%YAML 1.1
%TAG !u! tag:unity3d.com,2011:
--- !u!114 &11400000
MonoBehaviour:
  m_ObjectHideFlags: 0
  m_CorrespondingSourceObject: {fileID: 0}
  m_PrefabInstance: {fileID: 0}
  m_PrefabAsset: {fileID: 0}
  m_GameObject: {fileID: 0}
  m_Enabled: 1
  m_EditorHideFlags: 0
  m_Script: {fileID: 11500000, guid: 468a46d0ae32c3544b7d98094e6448a9, type: 3}
  m_Name: AddressableAssetSettings
  m_EditorClassIdentifier: 
  m_DefaultGroup: bc556176eff0a044ca4484c64b8fea5f
  m_currentHash:
    serializedVersion: 2
    Hash: 00000000000000000000000000000000
  m_OptimizeCatalogSize: 0
  m_BuildRemoteCatalog: 1
  m_BundleLocalCatalog: 0
  m_CatalogRequestsTimeout: 0
  m_DisableCatalogUpdateOnStart: 0
  m_IgnoreUnsupportedFilesInBuild: 0
  m_UniqueBundleIds: 0
  m_NonRecursiveBuilding: 1
  m_CCDEnabled: 0
  m_maxConcurrentWebRequests: 3
  m_ContiguousBundles: 1
  m_StripUnityVersionFromBundleBuild: 0
  m_DisableVisibleSubAssetRepresentations: 0
  m_ShaderBundleNaming: 0
  m_ShaderBundleCustomNaming: 
  m_MonoScriptBundleNaming: 0
  m_CheckForContentUpdateRestrictionsOption: 0
  m_MonoScriptBundleCustomNaming: 
  m_RemoteCatalogBuildPath:
    m_Id: a749457984a321549ae4668e4eb0f8c6
  m_RemoteCatalogLoadPath:
    m_Id: 1264c76d90d22db4783e3ec2b94d6d84
  m_ContentStateBuildPathProfileVariableName: <default settings path>
  m_CustomContentStateBuildPath: 
  m_ContentStateBuildPath: 
  m_BuildAddressablesWithPlayerBuild: 0
  m_overridePlayerVersion: '[UnityEditor.PlayerSettings.bundleVersion]'
  m_GroupAssets:
  - {fileID: 11400000, guid: 6bc12cc6f88975d47bbca6c96fdfaa92, type: 2}
  - {fileID: 11400000, guid: 1deed81783bc30c4aaf2a9512f869d85, type: 2}
  m_BuildSettings:
    m_CompileScriptsInVirtualMode: 0
    m_CleanupStreamingAssetsAfterBuilds: 1
    m_LogResourceManagerExceptions: 1
    m_BundleBuildPath: Temp/com.unity.addressables/AssetBundles
  m_ProfileSettings:
    m_Profiles:
    - m_InheritedParent: 
      m_Id: e306ddd2106abc44c8a4509073c63c2e
      m_ProfileName: Default
      m_Values:
      - m_Id: b94cf0b85219cce4faef4747bb9a4a09
        m_Value: '[UnityEditor.EditorUserBuildSettings.activeBuildTarget]'
      - m_Id: f4063abd49132b34cb80770a30c6ec07
        m_Value: '[UnityEngine.AddressableAssets.Addressables.BuildPath]/[BuildTarget]'
      - m_Id: 37c0d445a584cbe45b85b4157982635e
        m_Value: '{UnityEngine.AddressableAssets.Addressables.RuntimePath}/[BuildTarget]'
      - m_Id: a749457984a321549ae4668e4eb0f8c6
        m_Value: Builds/[BuildTarget]/Addressables
      - m_Id: 1264c76d90d22db4783e3ec2b94d6d84
        m_Value: http://localhost:8000
    m_ProfileEntryNames:
    - m_Id: b94cf0b85219cce4faef4747bb9a4a09
      m_Name: BuildTarget
      m_InlineUsage: 0
    - m_Id: f4063abd49132b34cb80770a30c6ec07
      m_Name: Local.BuildPath
      m_InlineUsage: 0
    - m_Id: 37c0d445a584cbe45b85b4157982635e
      m_Name: Local.LoadPath
      m_InlineUsage: 0
    - m_Id: a749457984a321549ae4668e4eb0f8c6
      m_Name: Remote.BuildPath
      m_InlineUsage: 0
    - m_Id: 1264c76d90d22db4783e3ec2b94d6d84
      m_Name: Remote.LoadPath
      m_InlineUsage: 0
    m_ProfileVersion: 1
  m_LabelTable:
    m_LabelNames:
    - default
  m_SchemaTemplates: []
  m_GroupTemplateObjects:
  - {fileID: 11400000, guid: f5fe7b9721f578146a36b8061ec436a2, type: 2}
  m_InitializationObjects: []
  m_CertificateHandlerType:
    m_AssemblyName: 
    m_ClassName: 
  m_ActivePlayerDataBuilderIndex: 3
  m_DataBuilders:
  - {fileID: 11400000, guid: 577531afbbb46a3459d43e79308f1949, type: 2}
  - {fileID: 11400000, guid: ce6fb4ea8e5a4c74cbdbc7d0b9d95cda, type: 2}
  - {fileID: 11400000, guid: ef128865bfa18a24eab4ad48f65ce382, type: 2}
  - {fileID: 11400000, guid: 739071d28f9157e4db22874ef1b1a0ff, type: 2}
  m_ActiveProfileId: e306ddd2106abc44c8a4509073c63c2e
  m_HostingServicesManager:
    m_HostingServiceInfos: []
    m_Settings: {fileID: 11400000}
    m_NextInstanceId: 0
    m_RegisteredServiceTypeRefs: []
    m_PingTimeoutInMilliseconds: 5000
