<svg xmlns="http://www.w3.org/2000/svg" width="23.748" height="23.748" viewBox="0 0 23.748 23.748">
  <g id="Groupe_16503" data-name="Groupe 16503" transform="translate(-12 -13)">
    <g id="Groupe_16502" data-name="Groupe 16502">
      <g id="pay" transform="translate(12 13)">
        <path id="Tracé_10719" data-name="Tracé 10719" d="M74.149,331.217a1.7,1.7,0,0,1-1.64-1.255c-.007-.026-.007-.051-.012-.077l-4.671-2.524a.832.832,0,0,0-.416-.11.873.873,0,0,0-.163.015.8.8,0,0,0-.212.069.833.833,0,0,0-.364.336.861.861,0,0,0-.114.424.843.843,0,0,0,.422.736l7.731,4.626a1.276,1.276,0,0,0,.676.194h5.975a1.276,1.276,0,0,0,.467-.089l1.557-.615v-4.568l-1.516-.908a1.272,1.272,0,0,0-.653-.181H79.59a2.967,2.967,0,0,0-.767.1l-4.895,1.31a.857.857,0,0,0-.625.748v.139a.775.775,0,0,0,.025.157.848.848,0,0,0,.821.625c.052,0,.3-.055.494-.1l4.392-1.175.219.819-4.406,1.179A4.143,4.143,0,0,1,74.149,331.217Zm0,0" transform="translate(-63.03 -309.903)"/>
        <path id="Tracé_10720" data-name="Tracé 10720" d="M400,320h2.544v6.785H400Zm0,0" transform="translate(-378.797 -303.038)"/>
        <path id="Tracé_10721" data-name="Tracé 10721" d="M0,0H2.544V7.633H0ZM0,0" transform="translate(0 0)"/>
        <path id="Tracé_10722" data-name="Tracé 10722" d="M65.447,6.673a3.824,3.824,0,0,0,1.946.634V5.258a3.084,3.084,0,0,1-.867-.487l-.248-.2.534-.659.246.2a2.248,2.248,0,0,0,2.858-.042l.3-.254,2.5,2.5a.85.85,0,1,0,1.2-1.205l-2.992-3,.6-.6,1.029,1.029h3.5L74.375.869A2.948,2.948,0,0,0,72.276,0H66.945a1.273,1.273,0,0,0-.569.134L65.425.61A2.129,2.129,0,0,1,64.4.832L64,.817V6.361h.975Zm0,0" transform="translate(-60.607 0)"/>
        <path id="Tracé_10723" data-name="Tracé 10723" d="M144,66.044v7.286h16.114V64H149.158l.848.848h7.139v.424a1.7,1.7,0,0,0,1.7,1.7h.424v3.393h-.424a1.7,1.7,0,0,0-1.7,1.7v.424H146.968v-.424a1.7,1.7,0,0,0-1.7-1.7h-.424V66.968h.424a1.692,1.692,0,0,0,1.362-.689l-.723-.723A3.084,3.084,0,0,1,144,66.044Zm0,0" transform="translate(-136.367 -60.608)"/>
        <path id="Tracé_10724" data-name="Tracé 10724" d="M179.381,98.319a1.7,1.7,0,0,1-1.2-.492l-.64-.64a2.531,2.531,0,0,1-1.542.9v1.767a2.552,2.552,0,0,1,2.085,2.085h8.552a2.552,2.552,0,0,1,2.085-2.085V98.085A2.552,2.552,0,0,1,186.637,96h-5.679a1.667,1.667,0,0,1-.139,1.522,2.12,2.12,0,1,1-.241.307A1.708,1.708,0,0,1,179.381,98.319Zm0,0" transform="translate(-166.671 -90.911)"/>
        <path id="Tracé_10725" data-name="Tracé 10725" d="M274.544,129.272A1.272,1.272,0,1,1,273.272,128,1.272,1.272,0,0,1,274.544,129.272Zm0,0" transform="translate(-257.582 -121.215)"/>
      </g>
    </g>
  </g>
</svg>
