<svg xmlns="http://www.w3.org/2000/svg" xmlns:xlink="http://www.w3.org/1999/xlink" width="337.567" height="243.914" viewBox="0 0 337.567 243.914">
  <defs>
    <clipPath id="clip-path">
      <rect id="Rectangle_2392" data-name="Rectangle 2392" width="221.392" height="193.444" transform="translate(-66)" fill="none"/>
    </clipPath>
  </defs>
  <g id="Group_16534" data-name="Group 16534" transform="translate(-15.717 -236.93)">
    <g id="Group_16525" data-name="Group 16525" transform="translate(3182.276 3823.597)">
      <path id="Path_11459" data-name="Path 11459" d="M-2831.052-3392.223c-7.065-24.2,5.385-50.436-5.967-73.71-3.605-7.392-9.239-13.9-13.972-20.808a101.39,101.39,0,0,1-15.085-33.668c-1.832-7.7-2.677-15.537-5.263-23.107-7.173-21-28.6-38.292-52.187-42.115a83.708,83.708,0,0,0-54.222,9.79c-69.824,40.094-106.2,21.128-130.576,34.962-15.278,8.671-22.8,24.793-27.34,40.912s-.159,51.22-12.949,62.657c-3.428,3.065-7.419,5.612-10.555,8.929-10.321,10.915-8.89,28.258-1.487,42.228,34.74,65.556,76.194,25.861,168.235,37.611,90.54,11.558,119.257,2.89,124.4-.973C-2862.545-3353.635-2819.139-3351.415-2831.052-3392.223Z" transform="translate(0)" fill="#e4f0ff"/>
      <path id="Path_11460" data-name="Path 11460" d="M-991.206-2674.447s-.739,7.284-6.487,7.788c5.748.5,6.487,7.788,6.487,7.788s.739-7.284,6.487-7.788C-990.467-2667.163-991.206-2674.447-991.206-2674.447Z" transform="translate(-1888.966 -794.495)" fill="#fff"/>
      <path id="Path_11461" data-name="Path 11461" d="M-858.546-2830.6s-.489,4.819-4.291,5.152c3.8.333,4.291,5.152,4.291,5.152s.489-4.818,4.291-5.152C-858.057-2825.784-858.546-2830.6-858.546-2830.6Z" transform="translate(-2006.419 -658.491)" fill="#fff"/>
      <path id="Path_11462" data-name="Path 11462" d="M-1014.716-2942.721s-.219,2.156-1.92,2.305c1.7.149,1.92,2.305,1.92,2.305s.219-2.156,1.92-2.305C-1014.5-2940.565-1014.716-2942.721-1014.716-2942.721Z" transform="translate(-1872.468 -560.842)" fill="#fff"/>
      <path id="Path_11463" data-name="Path 11463" d="M-2788.969-2740.07s-.753,7.425-6.613,7.939c5.859.514,6.613,7.939,6.613,7.939s.753-7.425,6.613-7.939C-2788.215-2732.645-2788.969-2740.07-2788.969-2740.07Z" transform="translate(-323.102 -737.34)" fill="#fff"/>
      <path id="Path_11464" data-name="Path 11464" d="M-2791.708-2943.187s-.489,4.819-4.292,5.152c3.8.334,4.292,5.152,4.292,5.152s.489-4.818,4.292-5.152C-2791.22-2938.368-2791.708-2943.187-2791.708-2943.187Z" transform="translate(-322.737 -560.436)" fill="#fff"/>
      <path id="Path_11465" data-name="Path 11465" d="M-2899.117-2509.712s-.223,2.2-1.957,2.35c1.734.152,1.957,2.35,1.957,2.35s.223-2.2,1.957-2.35C-2898.894-2507.514-2899.117-2509.712-2899.117-2509.712Z" transform="translate(-231.224 -937.97)" fill="#fff"/>
      <g id="Group_16503" data-name="Group 16503" transform="translate(-3077.553 -3575.25)">
        <g id="Group_16495" data-name="Group 16495" transform="translate(0 0)">
          <path id="Path_11466" data-name="Path 11466" d="M-2394.322-3273.313l-53.255,1.89c-4.588,0-8.41-3.028-8.791-6.965l-20.476-211.585c-.429-4.429,3.63-8.227,8.791-8.227l53.255,1.89c4.588,0,8.41,3.028,8.792,6.966l20.476,207.805C-2385.1-3277.112-2389.161-3273.313-2394.322-3273.313Z" transform="translate(2476.875 3498.202)" fill="#516a7d"/>
        </g>
        <g id="Group_16496" data-name="Group 16496" transform="translate(7.436 0)">
          <path id="Path_11467" data-name="Path 11467" d="M-2336.7-3273.313l-53.255,1.89c-4.588,0-8.41-3.028-8.791-6.965l-20.476-211.585c-.429-4.429,3.63-8.227,8.791-8.227l53.255,1.89c4.588,0,8.41,3.028,8.791,6.966l20.476,207.805C-2327.48-3277.112-2331.539-3273.313-2336.7-3273.313Z" transform="translate(2419.253 3498.202)" fill="#8ba7ba"/>
        </g>
        <g id="Group_16497" data-name="Group 16497" transform="translate(8.899 0)">
          <path id="Path_11468" data-name="Path 11468" d="M-2325.362-3273.313l-53.255,1.89c-4.588,0-8.41-3.028-8.791-6.965l-20.476-211.585c-.429-4.429,3.63-8.227,8.791-8.227l53.255,1.89c4.588,0,8.41,3.028,8.791,6.966l20.476,207.805C-2316.143-3277.112-2320.2-3273.313-2325.362-3273.313Z" transform="translate(2407.915 3498.202)" fill="#2a3942"/>
        </g>
        <g id="Group_16498" data-name="Group 16498" transform="translate(13.29 3.78)">
          <path id="Path_11469" data-name="Path 11469" d="M-2292.473-3252.82a4.72,4.72,0,0,1-3.263,1.235l-53.255,1.89a4.248,4.248,0,0,1-4.416-3.5l-2.973-30.741-17.5-180.843a3.445,3.445,0,0,1,1.153-2.9,4.721,4.721,0,0,1,3.263-1.235l53.255,1.89a4.248,4.248,0,0,1,4.416,3.5l10.136,102.869,10.343,104.936A3.468,3.468,0,0,1-2292.473-3252.82Z" transform="translate(2373.896 3468.914)" fill="#fff"/>
        </g>
        <g id="Group_16499" data-name="Group 16499" transform="translate(24.711 88.659)">
          <path id="Path_11470" data-name="Path 11470" d="M-2225.621-2799.879l-56.555,59.026-3.217-33.24,58.514-37.112Z" transform="translate(2285.393 2811.205)" fill="#fff"/>
        </g>
        <g id="Group_16501" data-name="Group 16501" transform="translate(30.806 112.041)">
          <g id="Group_16500" data-name="Group 16500">
            <path id="Path_11471" data-name="Path 11471" d="M-2174.259-2522.195a4.72,4.72,0,0,1-3.263,1.234l-53.255,1.89a4.249,4.249,0,0,1-4.416-3.5l-2.973-30.741c12.744-18.143,39.667-55.725,54.723-76.714l10.344,104.935A3.47,3.47,0,0,1-2174.259-2522.195Z" transform="translate(2238.166 2630.028)" fill="#fff"/>
          </g>
        </g>
        <g id="Group_16502" data-name="Group 16502" transform="translate(31.73 3.78)">
          <path id="Path_11472" data-name="Path 11472" d="M-2231.01-3468.914l2.76,4.26a2.953,2.953,0,0,0,2.136.953l22.368.28a2.954,2.954,0,0,0,2.336-1.1l2.527-4.394Z" transform="translate(2231.01 3468.914)" fill="#2a3942"/>
        </g>
      </g>
    </g>
    <g id="Group_16530" data-name="Group 16530" transform="translate(117 250.965)">
      <g id="Group_16531" data-name="Group 16531" transform="translate(0 0)">
        <path id="Path_11525" data-name="Path 11525" d="M14.855,16.569v8.679A7.428,7.428,0,1,1,0,25.248V16.569Z" transform="translate(80.17 -3.049)" fill="#eb5654"/>
        <path id="Path_11526" data-name="Path 11526" d="M27.112,16.569v8.679a7.428,7.428,0,1,1-14.855,0V16.569Z" transform="translate(53.058 -3.049)" fill="#fff"/>
        <path id="Path_11527" data-name="Path 11527" d="M39.369,16.569v8.679a7.428,7.428,0,1,1-14.855,0V16.569Z" transform="translate(25.946 -3.049)" fill="#eb5654"/>
        <path id="Path_11528" data-name="Path 11528" d="M51.627,16.569v8.679a7.428,7.428,0,1,1-14.855,0V16.569Z" transform="translate(-1.169 -3.049)" fill="#fff"/>
        <path id="Path_11529" data-name="Path 11529" d="M63.884,16.569v8.679a7.428,7.428,0,1,1-14.855,0V16.569Z" transform="translate(-28.281 -3.049)" fill="#eb5654"/>
        <path id="Path_11530" data-name="Path 11530" d="M0,5.413H8.994l40.358,13.52H34.5Z" transform="translate(45.674 -5.413)" fill="#c93b38"/>
        <path id="Path_11531" data-name="Path 11531" d="M12.257,5.413H27.112l34.5,13.52H46.754Z" transform="translate(18.561 -5.413)" fill="#e6f9ff"/>
        <path id="Path_11532" data-name="Path 11532" d="M24.514,5.413H39.369l34.5,13.52H59.011Z" transform="translate(-8.551 -5.413)" fill="#c93b38"/>
        <path id="Path_11533" data-name="Path 11533" d="M36.772,6.394,68.794,18.93H83.648L49.149,5.416H40.936a9.316,9.316,0,0,0-4.164.978" transform="translate(-33.189 -5.413)" fill="#e6f9ff"/>
        <path id="Path_11534" data-name="Path 11534" d="M49.029,9.339l20.748,9.418H84.632L52.612,6.222a9.4,9.4,0,0,0-3.583,3.117" transform="translate(-49.029 -5.242)" fill="#c93b38"/>
      </g>
    </g>
    <g id="Group_16533" data-name="Group 16533" transform="translate(172 285)">
      <g id="Group_16532" data-name="Group 16532" clip-path="url(#clip-path)">
        <path id="Path_11535" data-name="Path 11535" d="M26.921.52,18.233,10.63a1.488,1.488,0,0,0,.158,2.1L32.479,24.836a2.418,2.418,0,0,0,1.819.57l8.743-.9a1.485,1.485,0,0,0,1.335-1.554l-.43-8.779a2.415,2.415,0,0,0-.837-1.712L29.021.36a1.489,1.489,0,0,0-2.1.16M39.743,20.326a1.315,1.315,0,1,1,.14,1.854,1.315,1.315,0,0,1-.14-1.854" transform="translate(31.958 20.824)" fill="#81cdf2"/>
        <path id="Path_11536" data-name="Path 11536" d="M24.765,13.885,36.147,11.1l.942.809-11.363,2.8Zm2.669-7.2a2.258,2.258,0,0,1,1.583-.812,2.626,2.626,0,0,1,1.919.756,3.04,3.04,0,0,1,1.078,1.726,2.135,2.135,0,0,1-.581,1.856,2.127,2.127,0,0,1-1.74.833,2.984,2.984,0,0,1-1.859-.78,2.889,2.889,0,0,1-1.03-1.69,2.233,2.233,0,0,1,.63-1.889m3.036.551a1.328,1.328,0,0,0-.952-.347,1.784,1.784,0,0,0-1.144.75,1.613,1.613,0,0,0-.507,1.178,1.448,1.448,0,0,0,1.443,1.236,1.77,1.77,0,0,0,1.14-.745,1.629,1.629,0,0,0,.511-1.182,1.349,1.349,0,0,0-.491-.89m-.016,8.3a2.249,2.249,0,0,1,1.584-.814,2.649,2.649,0,0,1,1.924.763,3.048,3.048,0,0,1,1.078,1.727,2.141,2.141,0,0,1-.58,1.856,2.127,2.127,0,0,1-1.742.832,2.992,2.992,0,0,1-1.865-.785,2.883,2.883,0,0,1-1.028-1.693,2.234,2.234,0,0,1,.629-1.886m3.042.557a1.333,1.333,0,0,0-.959-.352,1.782,1.782,0,0,0-1.143.749,1.625,1.625,0,0,0-.506,1.175,1.331,1.331,0,0,0,.483.886,1.344,1.344,0,0,0,.965.359,1.776,1.776,0,0,0,1.139-.745,1.629,1.629,0,0,0,.512-1.182,1.345,1.345,0,0,0-.491-.89" transform="translate(31.958 20.824)" fill="#fff"/>
        <path id="Path_11537" data-name="Path 11537" d="M123.426,37.081l-15.1-7.208a3.011,3.011,0,0,1-1.421-4.016l7.207-15.1a3.014,3.014,0,0,1,4.017-1.421l15.1,7.208a3.012,3.012,0,0,1,1.421,4.017l-7.207,15.1a3.012,3.012,0,0,1-4.017,1.421" fill="#b0e7ff"/>
        <path id="Path_11538" data-name="Path 11538" d="M124.721,37.728a3.349,3.349,0,0,1-1.447-.331l-15.1-7.207A3.364,3.364,0,0,1,106.59,25.7l7.207-15.1a3.363,3.363,0,0,1,4.484-1.586l15.1,7.207a3.364,3.364,0,0,1,1.586,4.485l-7.207,15.1a3.378,3.378,0,0,1-3.038,1.916M116.834,9.393a2.669,2.669,0,0,0-2.4,1.517l-7.207,15.1a2.66,2.66,0,0,0,1.256,3.549l15.1,7.208a2.663,2.663,0,0,0,3.549-1.256l7.207-15.1a2.661,2.661,0,0,0-1.256-3.548l-15.1-7.208a2.647,2.647,0,0,0-1.145-.261" fill="#81cdf2"/>
        <path id="Path_11539" data-name="Path 11539" d="M129.833,27.342l.055-.593A1.7,1.7,0,0,0,128.823,25a9.211,9.211,0,0,1-5.844-5.686c-1.925,3.373-6.468-1.174-6.468-1.174a31.093,31.093,0,0,0-1.461,4.336l-.356-.084-.5,2.128,3.57.849.234-.983,1.423.762a17.967,17.967,0,0,0,4.332,1.643l6.27,1.49.2-.846Z" fill="#22365b"/>
        <path id="Path_11540" data-name="Path 11540" d="M111.389,21.082a30.911,30.911,0,0,1,2.176-4.169s3.769,5.2,6.2,2.178a9.209,9.209,0,0,0,4.875,6.535,1.694,1.694,0,0,1,.776,1.9l-.252.989-6.97-3.039-3.908-2.92Z" fill="#9c2622"/>
        <path id="Path_11541" data-name="Path 11541" d="M125.305,29.054,119.348,26.6a17.968,17.968,0,0,1-4.019-2.305l-1.285-.976-.386.933-3.392-1.4.834-2.023,1.666.688a8.7,8.7,0,0,1,2.114,1.247l.711.569a17.958,17.958,0,0,0,4.372,2.58l5.674,2.341Z" fill="#265173"/>
        <path id="Path_11542" data-name="Path 11542" d="M37.739,122.331a.778.778,0,0,1-.117-.009.7.7,0,0,1-.576-.808c.032-.192,3.461-19.295,25.743-32.074,9.354-5.364,18.474-4.916,23.365-2.089,1.889,1.092,2.974,2.48,2.977,3.808.005,3.448-2.262,4.331-5.132,5.449a27.479,27.479,0,0,0-8.155,4.515,23.853,23.853,0,0,0-8.873,20.407.7.7,0,0,1-1.389.2,25.285,25.285,0,0,1,9.373-21.693A29.134,29.134,0,0,1,83.49,95.3c3.017-1.175,4.241-1.747,4.237-4.138,0-.791-.873-1.786-2.276-2.6-3.388-1.959-11.827-3.72-21.963,2.092-21.713,12.452-25.027,30.9-25.058,31.087a.7.7,0,0,1-.691.586" fill="#265173"/>
        <path id="Path_11543" data-name="Path 11543" d="M49.408,78.849l-7.354,3.486a6.042,6.042,0,0,1-10.92,5.175l-7.9,3.744-8.015,13.02,9.1,7.328,6.264-4.841L43.728,134.5l26.174-12.4L56.757,94.355l7.712-1.783.091-11.684Z" fill="#eb5654"/>
        <path id="Path_11544" data-name="Path 11544" d="M75.09,109.075h14.5s3.977,71.5,2.807,84.369H81.406Z" fill="#265173"/>
        <path id="Path_11545" data-name="Path 11545" d="M4.912,109.075S9.474,149.232,0,193.444H88.423s.7-47.332-13.334-84.369Z" fill="#008eb0"/>
        <path id="Path_11546" data-name="Path 11546" d="M81.676,186.777H8.11l.074-.412a304.686,304.686,0,0,0,3.989-70.25l-.024-.373H70.4l.081.238c9.042,26.679,10.833,58.146,11.182,70.437Zm-72.728-.7H80.953c-.373-12.467-2.2-43.352-11.054-69.632h-57a305.578,305.578,0,0,1-3.948,69.632" fill="#265173"/>
        <path id="Path_11547" data-name="Path 11547" d="M58.012,122.331a.7.7,0,0,1-.691-.585c-.031-.185-3.379-18.656-25.058-31.088C20.907,84.145,11.6,83.25,8.4,84.217c-.849.257-1.058.562-1.1.649-1.47,2.939,8.269,10.9,13.5,15.17a25.285,25.285,0,0,1,9.374,21.693.7.7,0,1,1-1.389-.2,23.853,23.853,0,0,0-8.873-20.407C11.241,94.042,4.216,87.885,6.039,84.238a3.006,3.006,0,0,1,1.952-1.364c3.56-1.075,13.148-.213,24.971,6.566,22.282,12.779,25.711,31.882,25.743,32.074a.7.7,0,0,1-.576.807.66.66,0,0,1-.117.01" fill="#265173"/>
        <path id="Path_11548" data-name="Path 11548" d="M32.111,122.285a2.126,2.126,0,0,1-2.746,1.942,3.2,3.2,0,0,1-2.3-3.253,2.126,2.126,0,0,1,2.745-1.942,3.2,3.2,0,0,1,2.3,3.253" fill="#22365b"/>
        <path id="Path_11549" data-name="Path 11549" d="M60.536,122.285a2.125,2.125,0,0,1-2.745,1.942,3.2,3.2,0,0,1-2.3-3.253,2.125,2.125,0,0,1,2.745-1.942,3.2,3.2,0,0,1,2.3,3.253" fill="#22365b"/>
        <path id="Path_11550" data-name="Path 11550" d="M145.139,92.985l3.126-2.366a.511.511,0,0,1,.391-.1l1.83.3a.313.313,0,0,1,.261.345l-.206,1.843a.509.509,0,0,1-.2.35l-3.126,2.366a.314.314,0,0,1-.44-.062l-1.7-2.243a.314.314,0,0,1,.061-.44m4.986-1.267a.277.277,0,1,0-.389-.054.278.278,0,0,0,.389.054" transform="translate(-171.784 -31.425)" fill="#60c6fc"/>
        <path id="Path_11551" data-name="Path 11551" d="M138.614,91.569a.158.158,0,0,0,.121-.056c.019-.022,1.989-2.294,7.035-4.39a.159.159,0,1,0-.121-.293c-5.126,2.129-7.075,4.384-7.156,4.478a.158.158,0,0,0,.018.223.157.157,0,0,0,.1.038" transform="translate(-160.344 -31.425)" fill="#60c6fc"/>
        <path id="Path_11552" data-name="Path 11552" d="M137.53,72.372s3.55,4.745,4.7,14.895l-6.5,2.778s-.528-3.1-1.268-2.989-5.387,9.719-14.684,14.473a47.353,47.353,0,0,1-11.3-17.008s10.775-4.648,12.571-9.4c.423-1.268-3.592-.845-3.592-.845l-.211-6.55a17.872,17.872,0,0,1,14.79.211s-3.7,9.719,5.493,4.437" transform="translate(-126.731 -31.425)" fill="#ffb157"/>
        <path id="Path_11553" data-name="Path 11553" d="M140.21,110.274a.158.158,0,0,0,.094-.031l15.024-11.1a.158.158,0,1,0-.187-.255l-15.025,11.1a.158.158,0,0,0,.094.286" transform="translate(-171.465 -31.425)" fill="#60c6fc"/>
        <path id="Path_11554" data-name="Path 11554" d="M138.655,110.038a.158.158,0,0,0,.094-.031l10.31-7.587a.158.158,0,1,0-.187-.254l-10.311,7.586a.158.158,0,0,0-.034.221.156.156,0,0,0,.128.065" transform="translate(-163.642 -31.425)" fill="#60c6fc"/>
        <path id="Path_11555" data-name="Path 11555" d="M144.9,102.646a.155.155,0,0,0,.094-.03l6.889-5.069a.158.158,0,1,0-.187-.255l-6.89,5.069a.158.158,0,0,0-.034.221.155.155,0,0,0,.128.064" transform="translate(-172.701 -31.425)" fill="#60c6fc"/>
      </g>
    </g>
  </g>
</svg>
