{
  "status": 0,
  "result": [
    {
      "createdById": "0054x000005rJTtAAM",
      "createdByName": "Taras Romanets",
      "createdDate": "2022-09-29T15:57:41.000Z",
      "fileName": "permissionsets/For_Graphic_App.permissionset",
      "fullName": "For_Graphic_App",
      "id": "0PS4x000004ICqjGAG",
      "lastModifiedById": "0054x000005rJTtAAM",
      "lastModifiedByName": "Taras Romanets",
      "lastModifiedDate": "2022-09-29T15:57:41.000Z",
      "manageableState": "unmanaged",
      "type": "PermissionSet"
    },
    {
      "createdById": "0054x000005rJTtAAM",
      "createdByName": "Taras Romanets",
      "createdDate": "2022-08-24T16:17:10.000Z",
      "fileName": "permissionsets/Experience_Profile_Manager.permissionset",
      "fullName": "Experience_Profile_Manager",
      "id": "0PS4x0000045Ku3GAE",
      "lastModifiedById": "0054x000005rJTtAAM",
      "lastModifiedByName": "Taras Romanets",
      "lastModifiedDate": "2022-08-24T16:17:10.000Z",
      "manageableState": "unmanaged",
      "type": "PermissionSet"
    },
    {
      "createdById": "0054x000005rJTtAAM",
      "createdByName": "Taras Romanets",
      "createdDate": "2022-10-25T11:01:48.000Z",
      "fileName": "permissionsets/Graphic_User_Permissions.permissionset",
      "fullName": "Graphic_User_Permissions",
      "id": "0PS4x000004IGGYGA4",
      "lastModifiedById": "0054x000005rJTtAAM",
      "lastModifiedByName": "Taras Romanets",
      "lastModifiedDate": "2022-10-25T11:01:48.000Z",
      "manageableState": "unmanaged",
      "type": "PermissionSet"
    }
  ]
}