{
  "project_info": {
    "project_number": "247942815387",
    "project_id": "pushertest-9f0bb",
    "storage_bucket": "pushertest-9f0bb.appspot.com"
  },
  "client": [
    {
      "client_info": {
        "mobilesdk_app_id": "1:247942815387:android:6ecb9247eb937fa57ab03e",
        "android_client_info": {
          "package_name": "com.demopusher.pushapp"
        }
      },
      "oauth_client": [
        {
          "client_id": "247942815387-0gl9suk85p6c4uieufdc2lt4fdgl8d9d.apps.googleusercontent.com",
          "client_type": 3
        }
      ],
      "api_key": [
        {
          "current_key": "AIzaSyCvRuN9f4C7RvBKsUZ_iNkCsoFFCPdrACM"
        }
      ],
      "services": {
        "appinvite_service": {
          "other_platform_oauth_client": [
            {
              "client_id": "247942815387-0gl9suk85p6c4uieufdc2lt4fdgl8d9d.apps.googleusercontent.com",
              "client_type": 3
            }
          ]
        }
      }
    }
  ],
  "configuration_version": "1"
}