/home/ec2-user/masterdevopstech_github/java-backend-rest-app/src/main/java/com/lambdaschool/java/services/UserServiceImpl.java
/home/ec2-user/masterdevopstech_github/java-backend-rest-app/src/main/java/com/lambdaschool/java/controllers/OpenController.java
/home/ec2-user/masterdevopstech_github/java-backend-rest-app/src/main/java/com/lambdaschool/java/services/PlantServiceImpl.java
/home/ec2-user/masterdevopstech_github/java-backend-rest-app/src/main/java/com/lambdaschool/java/config/SwaggerWebMVC.java
/home/ec2-user/masterdevopstech_github/java-backend-rest-app/src/main/java/com/lambdaschool/java/handlers/RestExceptionHandler.java
/home/ec2-user/masterdevopstech_github/java-backend-rest-app/src/main/java/com/lambdaschool/java/services/SecurityUserServiceImpl.java
/home/ec2-user/masterdevopstech_github/java-backend-rest-app/src/main/java/com/lambdaschool/java/config/SimpleCorsFilter.java
/home/ec2-user/masterdevopstech_github/java-backend-rest-app/src/main/java/com/lambdaschool/java/JavaApplication.java
/home/ec2-user/masterdevopstech_github/java-backend-rest-app/src/main/java/com/lambdaschool/java/exceptions/CustomErrorDetails.java
/home/ec2-user/masterdevopstech_github/java-backend-rest-app/src/main/java/com/lambdaschool/java/models/ErrorDetail.java
/home/ec2-user/masterdevopstech_github/java-backend-rest-app/src/main/java/com/lambdaschool/java/services/UserService.java
/home/ec2-user/masterdevopstech_github/java-backend-rest-app/src/main/java/com/lambdaschool/java/repositories/PlantRepository.java
/home/ec2-user/masterdevopstech_github/java-backend-rest-app/src/main/java/com/lambdaschool/java/services/UserAuditing.java
/home/ec2-user/masterdevopstech_github/java-backend-rest-app/src/main/java/com/lambdaschool/java/config/Swagger2Config.java
/home/ec2-user/masterdevopstech_github/java-backend-rest-app/src/main/java/com/lambdaschool/java/services/PlantService.java
/home/ec2-user/masterdevopstech_github/java-backend-rest-app/src/main/java/com/lambdaschool/java/config/ResourceServerConfig.java
/home/ec2-user/masterdevopstech_github/java-backend-rest-app/src/main/java/com/lambdaschool/java/exceptions/ResourceNotFoundException.java
/home/ec2-user/masterdevopstech_github/java-backend-rest-app/src/main/java/com/lambdaschool/java/repositories/UserRepository.java
/home/ec2-user/masterdevopstech_github/java-backend-rest-app/src/main/java/com/lambdaschool/java/models/User.java
/home/ec2-user/masterdevopstech_github/java-backend-rest-app/src/main/java/com/lambdaschool/java/controllers/UserController.java
/home/ec2-user/masterdevopstech_github/java-backend-rest-app/src/main/java/com/lambdaschool/java/models/UserMinimum.java
/home/ec2-user/masterdevopstech_github/java-backend-rest-app/src/main/java/com/lambdaschool/java/models/Plant.java
/home/ec2-user/masterdevopstech_github/java-backend-rest-app/src/main/java/com/lambdaschool/java/SeedData.java
/home/ec2-user/masterdevopstech_github/java-backend-rest-app/src/main/java/com/lambdaschool/java/services/HelperFunctions.java
/home/ec2-user/masterdevopstech_github/java-backend-rest-app/src/main/java/com/lambdaschool/java/config/H2ServerConfiguration.java
/home/ec2-user/masterdevopstech_github/java-backend-rest-app/src/main/java/com/lambdaschool/java/services/HelperFunctionsImpl.java
/home/ec2-user/masterdevopstech_github/java-backend-rest-app/src/main/java/com/lambdaschool/java/controllers/LogoutController.java
/home/ec2-user/masterdevopstech_github/java-backend-rest-app/src/main/java/com/lambdaschool/java/models/Auditable.java
/home/ec2-user/masterdevopstech_github/java-backend-rest-app/src/main/java/com/lambdaschool/java/config/DataSourceConfig.java
/home/ec2-user/masterdevopstech_github/java-backend-rest-app/src/main/java/com/lambdaschool/java/config/AuthorizationServerConfig.java
/home/ec2-user/masterdevopstech_github/java-backend-rest-app/src/main/java/com/lambdaschool/java/controllers/PlantController.java
/home/ec2-user/masterdevopstech_github/java-backend-rest-app/src/main/java/com/lambdaschool/java/models/ValidationError.java
/home/ec2-user/masterdevopstech_github/java-backend-rest-app/src/main/java/com/lambdaschool/java/config/SecurityConfig.java
/home/ec2-user/masterdevopstech_github/java-backend-rest-app/src/main/java/com/lambdaschool/java/exceptions/ResourceFoundException.java
