com/lambdaschool/java/services/PlantServiceImplTest.class
com/lambdaschool/java/controllers/PlantControllerTest.class
com/lambdaschool/java/JavaApplicationTests.class
com/lambdaschool/java/controllers/UserControllerTest.class
