com/lambdaschool/java/services/HelperFunctionsImpl.class
com/lambdaschool/java/config/SimpleCorsFilter.class
com/lambdaschool/java/exceptions/ResourceFoundException.class
com/lambdaschool/java/models/User.class
com/lambdaschool/java/config/H2ServerConfiguration.class
com/lambdaschool/java/controllers/PlantController.class
com/lambdaschool/java/models/Plant.class
com/lambdaschool/java/JavaApplication.class
com/lambdaschool/java/services/HelperFunctions.class
com/lambdaschool/java/repositories/PlantRepository.class
com/lambdaschool/java/services/PlantService.class
com/lambdaschool/java/config/SwaggerWebMVC.class
com/lambdaschool/java/handlers/RestExceptionHandler.class
com/lambdaschool/java/models/UserMinimum.class
com/lambdaschool/java/services/PlantServiceImpl.class
com/lambdaschool/java/services/UserServiceImpl.class
com/lambdaschool/java/models/ErrorDetail.class
com/lambdaschool/java/repositories/UserRepository.class
com/lambdaschool/java/SeedData.class
com/lambdaschool/java/config/AuthorizationServerConfig.class
com/lambdaschool/java/config/ResourceServerConfig.class
com/lambdaschool/java/config/DataSourceConfig.class
com/lambdaschool/java/models/Auditable.class
com/lambdaschool/java/config/SecurityConfig.class
com/lambdaschool/java/services/SecurityUserServiceImpl.class
com/lambdaschool/java/exceptions/ResourceNotFoundException.class
com/lambdaschool/java/controllers/OpenController.class
com/lambdaschool/java/services/UserAuditing.class
com/lambdaschool/java/models/ValidationError.class
com/lambdaschool/java/exceptions/CustomErrorDetails.class
com/lambdaschool/java/config/Swagger2Config.class
com/lambdaschool/java/services/UserService.class
com/lambdaschool/java/controllers/UserController.class
com/lambdaschool/java/controllers/LogoutController.class
