[
    {
       "name":"nginx",
       "image":"nginx:latest",
       "cpu":0,
       "portMappings":[
          {
             "name":"80",
             "containerPort":80,
             "hostPort":80,
             "protocol":"tcp",
             "appProtocol":"http"
          }
       ],
       "essential":true,
       "environment":[],
       "environmentFiles":[],
       "mountPoints":[],
       "volumesFrom":[],
       "ulimits":[],
       "logConfiguration":{
          "logDriver":"awslogs",
          "options":{
             "awslogs-create-group":"true",
             "awslogs-group":"/ecs/",
             "awslogs-region":"eu-central-1",
             "awslogs-stream-prefix":"ecs"
          },
          "secretOptions":[]
       }
    }
 ]