<?xml version="1.0" encoding="utf-8"?>
<!-- Generator: Adobe Illustrator 18.1.1, SVG Export Plug-In . SVG Version: 6.00 Build 0)  -->
<svg version="1.1" id="Isolation_Mode" xmlns="http://www.w3.org/2000/svg" xmlns:xlink="http://www.w3.org/1999/xlink" x="0px"
	 y="0px" viewBox="415 620 175 163" enable-background="new 415 620 175 163" xml:space="preserve">
<g>
	<g>
		<path fill="#0E0D33" d="M426.3,623.4l155.1,55.4c6.7,3.2,7.8,4.9,7.8,10.6v24.9c0,5.7-1.1,7.5-7.8,10.6l-155.1,55.7
			c-3.3,1.3-7.5,0.3-7.5-4.6v-28.7c0-6.7,2.1-8.6,8.3-10.6l107.2-35.2l-107.2-34.9c-6.2-2.1-8.3-3.8-8.3-10.8v-27.5
			C418.9,623.2,423,622.2,426.3,623.4z"/>
	</g>
</g>
</svg>
