<?xml version="1.0" encoding="utf-8"?>
<!-- Generator: Adobe Illustrator 18.1.1, SVG Export Plug-In . SVG Version: 6.00 Build 0)  -->
<svg version="1.1" id="Isolation_Mode" xmlns="http://www.w3.org/2000/svg" xmlns:xlink="http://www.w3.org/1999/xlink" x="0px"
	 y="0px" viewBox="0 0 1024 768" enable-background="new 0 0 1024 768" xml:space="preserve">
<g>
	<g>
		<path fill="#FFFFFF" d="M433.1,304.2l157.6,56.3c6.8,3.2,7.9,5,7.9,10.8v25.3c0,5.8-1.1,7.6-7.9,10.8l-157.6,56.6
			c-3.4,1.3-7.6,0.3-7.6-4.7v-29.2c0-6.8,2.1-8.7,8.4-10.8l108.9-35.8l-108.9-35.5c-6.3-2.1-8.4-3.9-8.4-11v-27.9
			C425.5,303.9,429.7,302.9,433.1,304.2z"/>
	</g>
</g>
</svg>
