{
	"version": "1",
	"data": {
		"common": {
			"files": [
				{ "src": "src/drivers/net/dsa/microchip/ksz_common.c",      "dst": "drivers/net/dsa/microchip/" },
				{ "src": "src/drivers/net/dsa/microchip/ksz_sysfs.c",       "dst": "drivers/net/dsa/microchip/" },
				{ "src": "src/drivers/net/dsa/microchip/ksz8895.c" ,        "dst": "drivers/net/dsa/microchip/" },
				{ "src": "src/drivers/net/dsa/microchip/ksz8895_spi.c",     "dst": "drivers/net/dsa/microchip/" },
				{ "src": "src/drivers/net/dsa/microchip/ksz9477.c",         "dst": "drivers/net/dsa/microchip/" },
				{ "src": "src/drivers/net/dsa/microchip/ksz9477_i2c.c",     "dst": "drivers/net/dsa/microchip/" },
				{ "src": "src/drivers/net/dsa/microchip/ksz9477_spi.c",     "dst": "drivers/net/dsa/microchip/" },
				{ "src": "src/drivers/net/dsa/microchip/ksz_common.h",      "dst": "drivers/net/dsa/microchip/" },
				{ "src": "src/drivers/net/dsa/microchip/ksz_priv.h",        "dst": "drivers/net/dsa/microchip/" },
				{ "src": "src/drivers/net/dsa/microchip/ksz_version.h",     "dst": "drivers/net/dsa/microchip/" },
				{ "src": "src/drivers/net/dsa/microchip/ksz8895_reg.h",     "dst": "drivers/net/dsa/microchip/" },
				{ "src": "src/drivers/net/dsa/microchip/ksz9477_reg.h",     "dst": "drivers/net/dsa/microchip/" },
				{ "src": "src/include/linux/platform_data/microchip-ksz.h", "dst": "include/linux/platform_data/" }
			]
		},
		"4.19": {
			"patches": [
				"kernel-4.19/patches/0001-dsa-Add-DSA_TAG_PROTO_KSZ.patch",
				"kernel-4.19/patches/0002-net-bridge-Increase-maximum-hardware-header-length.patch"
			],
			"files": [
				{ "src": "kernel-4.19/src/drivers/net/dsa/microchip/Kconfig",  "dst": "drivers/net/dsa/microchip/" },
				{ "src": "kernel-4.19/src/drivers/net/dsa/microchip/Makefile", "dst": "drivers/net/dsa/microchip/" },
				{ "src": "kernel-4.19/src/include/linux/dsa/ksz_dsa.h",        "dst": "include/linux/dsa/" },
				{ "src": "kernel-4.19/src/net/dsa/tag_ksz.c",                  "dst": "net/dsa/" }
			]
		},
		"5.15, 6.1": {
			"files": [
				{ "src": "kernel-%tag%/src/drivers/net/dsa/microchip/Kconfig",  "dst": "drivers/net/dsa/microchip/" },
				{ "src": "kernel-%tag%/src/drivers/net/dsa/microchip/Makefile", "dst": "drivers/net/dsa/microchip/" }
			],
			"patches": [
				"kernel-%tag%/patches/0002-net-bridge-Increase-maximum-hardware-header-length.patch"
			]
		}
	}
}
