  [
    {
      "builds": [
        {
          "arch": "amd64",
          "os": "darwin",
          "url": "https://releases.hashicorp.com/consul/1.20.1/consul_1.20.1_darwin_amd64.zip"
        },
        {
          "arch": "arm64",
          "os": "darwin",
          "url": "https://releases.hashicorp.com/consul/1.20.1/consul_1.20.1_darwin_arm64.zip"
        },
        {
          "arch": "386",
          "os": "freebsd",
          "url": "https://releases.hashicorp.com/consul/1.20.1/consul_1.20.1_freebsd_386.zip"
        },
        {
          "arch": "amd64",
          "os": "freebsd",
          "url": "https://releases.hashicorp.com/consul/1.20.1/consul_1.20.1_freebsd_amd64.zip"
        },
        {
          "arch": "386",
          "os": "linux",
          "url": "https://releases.hashicorp.com/consul/1.20.1/consul_1.20.1_linux_386.zip"
        },
        {
          "arch": "amd64",
          "os": "linux",
          "url": "https://releases.hashicorp.com/consul/1.20.1/consul_1.20.1_linux_amd64.zip"
        },
        {
          "arch": "arm",
          "os": "linux",
          "url": "https://releases.hashicorp.com/consul/1.20.1/consul_1.20.1_linux_arm.zip"
        },
        {
          "arch": "arm64",
          "os": "linux",
          "url": "https://releases.hashicorp.com/consul/1.20.1/consul_1.20.1_linux_arm64.zip"
        },
        {
          "arch": "amd64",
          "os": "solaris",
          "url": "https://releases.hashicorp.com/consul/1.20.1/consul_1.20.1_solaris_amd64.zip"
        },
        {
          "arch": "386",
          "os": "windows",
          "url": "https://releases.hashicorp.com/consul/1.20.1/consul_1.20.1_windows_386.zip"
        },
        {
          "arch": "amd64",
          "os": "windows",
          "url": "https://releases.hashicorp.com/consul/1.20.1/consul_1.20.1_windows_amd64.zip"
        }
      ],
      "is_prerelease": false,
      "license_class": "oss",
      "name": "consul",
      "status": {
        "state": "supported",
        "timestamp_updated": "2024-10-30T16:59:30.860Z"
      },
      "timestamp_created": "2024-10-30T16:59:30.860Z",
      "timestamp_updated": "2024-10-30T16:59:30.860Z",
      "url_changelog": "https://github.com/hashicorp/consul/blob/release/1.20.1/CHANGELOG.md",
      "url_docker_registry_dockerhub": "https://hub.docker.com/r/hashicorp/consul",
      "url_docker_registry_ecr": "https://gallery.ecr.aws/hashicorp/consul",
      "url_license": "https://github.com/hashicorp/consul/blob/main/LICENSE",
      "url_project_website": "https://www.consul.io",
      "url_release_notes": "https://www.consul.io/docs/release-notes",
      "url_shasums": "https://releases.hashicorp.com/consul/1.20.1/consul_1.20.1_SHA256SUMS",
      "url_shasums_signatures": [
        "https://releases.hashicorp.com/consul/1.20.1/consul_1.20.1_SHA256SUMS.sig",
        "https://releases.hashicorp.com/consul/1.20.1/consul_1.20.1_SHA256SUMS.72D7468F.sig"
      ],
      "url_source_repository": "https://github.com/hashicorp/consul",
      "version": "1.20.1"
    },
    {
      "builds": [
        {
          "arch": "amd64",
          "os": "darwin",
          "url": "https://releases.hashicorp.com/consul/1.18.2/consul_1.18.2_darwin_amd64.zip"
        },
        {
          "arch": "arm64",
          "os": "darwin",
          "url": "https://releases.hashicorp.com/consul/1.18.2/consul_1.18.2_darwin_arm64.zip"
        },
        {
          "arch": "386",
          "os": "freebsd",
          "url": "https://releases.hashicorp.com/consul/1.18.2/consul_1.18.2_freebsd_386.zip"
        },
        {
          "arch": "amd64",
          "os": "freebsd",
          "url": "https://releases.hashicorp.com/consul/1.18.2/consul_1.18.2_freebsd_amd64.zip"
        },
        {
          "arch": "386",
          "os": "linux",
          "url": "https://releases.hashicorp.com/consul/1.18.2/consul_1.18.2_linux_386.zip"
        },
        {
          "arch": "amd64",
          "os": "linux",
          "url": "https://releases.hashicorp.com/consul/1.18.2/consul_1.18.2_linux_amd64.zip"
        },
        {
          "arch": "arm",
          "os": "linux",
          "url": "https://releases.hashicorp.com/consul/1.18.2/consul_1.18.2_linux_arm.zip"
        },
        {
          "arch": "arm64",
          "os": "linux",
          "url": "https://releases.hashicorp.com/consul/1.18.2/consul_1.18.2_linux_arm64.zip"
        },
        {
          "arch": "amd64",
          "os": "solaris",
          "url": "https://releases.hashicorp.com/consul/1.18.2/consul_1.18.2_solaris_amd64.zip"
        },
        {
          "arch": "386",
          "os": "windows",
          "url": "https://releases.hashicorp.com/consul/1.18.2/consul_1.18.2_windows_386.zip"
        },
        {
          "arch": "amd64",
          "os": "windows",
          "url": "https://releases.hashicorp.com/consul/1.18.2/consul_1.18.2_windows_amd64.zip"
        }
      ],
      "is_prerelease": false,
      "license_class": "oss",
      "name": "consul",
      "status": {
        "state": "supported",
        "timestamp_updated": "2024-05-17T14:41:12.287Z"
      },
      "timestamp_created": "2024-05-17T14:41:12.287Z",
      "timestamp_updated": "2024-05-17T14:41:12.287Z",
      "url_changelog": "https://github.com/hashicorp/consul/blob/release/1.18.2/CHANGELOG.md",
      "url_docker_registry_dockerhub": "https://hub.docker.com/r/hashicorp/consul",
      "url_docker_registry_ecr": "https://gallery.ecr.aws/hashicorp/consul",
      "url_license": "https://github.com/hashicorp/consul/blob/main/LICENSE",
      "url_project_website": "https://www.consul.io",
      "url_release_notes": "https://www.consul.io/docs/release-notes",
      "url_shasums": "https://releases.hashicorp.com/consul/1.18.2/consul_1.18.2_SHA256SUMS",
      "url_shasums_signatures": [
        "https://releases.hashicorp.com/consul/1.18.2/consul_1.18.2_SHA256SUMS.sig",
        "https://releases.hashicorp.com/consul/1.18.2/consul_1.18.2_SHA256SUMS.72D7468F.sig"
      ],
      "url_source_repository": "https://github.com/hashicorp/consul",
      "version": "1.18.2"
    }
  ]
