module gitlab.com/tanna.dev/renovate-config-sqlite

go 1.22.1

require (
	github.com/bradleyfalzon/ghinstallation/v2 v2.10.0
	github.com/google/go-github/v61 v61.0.0
	github.com/jedib0t/go-pretty/v6 v6.5.8
	github.com/shurcooL/githubv4 v0.0.0-20240120211514-18a1ae0e79dc
	github.com/sqlc-dev/sqlc v1.26.0
	github.com/urfave/cli/v2 v2.27.1
	golang.org/x/oauth2 v0.19.0
	modernc.org/sqlite v1.29.6
)

require (
	filippo.io/edwards25519 v1.1.0 // indirect
	github.com/antlr4-go/antlr/v4 v4.13.0 // indirect
	github.com/cpuguy83/go-md2man/v2 v2.0.3 // indirect
	github.com/cubicdaiya/gonp v1.0.4 // indirect
	github.com/cznic/mathutil v0.0.0-20181122101859-297441e03548 // indirect
	github.com/davecgh/go-spew v1.1.1 // indirect
	github.com/dustin/go-humanize v1.0.1 // indirect
	github.com/fatih/structtag v1.2.0 // indirect
	github.com/go-sql-driver/mysql v1.8.1 // indirect
	github.com/golang-jwt/jwt/v4 v4.5.0 // indirect
	github.com/golang/protobuf v1.5.3 // indirect
	github.com/google/cel-go v0.20.1 // indirect
	github.com/google/go-github/v60 v60.0.0 // indirect
	github.com/google/go-querystring v1.1.0 // indirect
	github.com/google/uuid v1.6.0 // indirect
	github.com/hashicorp/golang-lru/v2 v2.0.7 // indirect
	github.com/inconshreveable/mousetrap v1.1.0 // indirect
	github.com/jackc/pgpassfile v1.0.0 // indirect
	github.com/jackc/pgservicefile v0.0.0-20221227161230-091c0ba34f0a // indirect
	github.com/jackc/pgx/v5 v5.5.5 // indirect
	github.com/jackc/puddle/v2 v2.2.1 // indirect
	github.com/jinzhu/inflection v1.0.0 // indirect
	github.com/mattn/go-isatty v0.0.16 // indirect
	github.com/mattn/go-runewidth v0.0.15 // indirect
	github.com/ncruces/go-strftime v0.1.9 // indirect
	github.com/pganalyze/pg_query_go/v5 v5.1.0 // indirect
	github.com/pingcap/errors v0.11.5-0.20210425183316-da1aaba5fb63 // indirect
	github.com/pingcap/failpoint v0.0.0-20220801062533-2eaa32854a6c // indirect
	github.com/pingcap/log v1.1.0 // indirect
	github.com/pingcap/tidb/pkg/parser v0.0.0-20231103154709-4f00ece106b1 // indirect
	github.com/remyoudompheng/bigfft v0.0.0-20230129092748-24d4a6f8daec // indirect
	github.com/rivo/uniseg v0.2.0 // indirect
	github.com/riza-io/grpc-go v0.2.0 // indirect
	github.com/russross/blackfriday/v2 v2.1.0 // indirect
	github.com/shurcooL/graphql v0.0.0-20230722043721-ed46e5a46466 // indirect
	github.com/spf13/cobra v1.8.0 // indirect
	github.com/spf13/pflag v1.0.5 // indirect
	github.com/stoewer/go-strcase v1.2.0 // indirect
	github.com/tetratelabs/wazero v1.7.0 // indirect
	github.com/wasilibs/go-pgquery v0.0.0-20240319230125-b9b2e95c69a7 // indirect
	github.com/xrash/smetrics v0.0.0-20201216005158-039620a65673 // indirect
	go.uber.org/atomic v1.11.0 // indirect
	go.uber.org/multierr v1.11.0 // indirect
	go.uber.org/zap v1.26.0 // indirect
	golang.org/x/crypto v0.20.0 // indirect
	golang.org/x/exp v0.0.0-20231108232855-2478ac86f678 // indirect
	golang.org/x/net v0.21.0 // indirect
	golang.org/x/sync v0.6.0 // indirect
	golang.org/x/sys v0.17.0 // indirect
	golang.org/x/term v0.17.0 // indirect
	golang.org/x/text v0.14.0 // indirect
	google.golang.org/genproto/googleapis/api v0.0.0-20240123012728-ef4313101c80 // indirect
	google.golang.org/genproto/googleapis/rpc v0.0.0-20240123012728-ef4313101c80 // indirect
	google.golang.org/grpc v1.62.1 // indirect
	google.golang.org/protobuf v1.33.0 // indirect
	gopkg.in/natefinch/lumberjack.v2 v2.2.1 // indirect
	gopkg.in/yaml.v3 v3.0.1 // indirect
	modernc.org/gc/v3 v3.0.0-20240107210532-573471604cb6 // indirect
	modernc.org/libc v1.41.0 // indirect
	modernc.org/mathutil v1.6.0 // indirect
	modernc.org/memory v1.7.2 // indirect
	modernc.org/strutil v1.2.0 // indirect
	modernc.org/token v1.1.0 // indirect
)
