module gitlab.com/tanna.dev/oidc-thumbprint

go 1.18

require github.com/zitadel/oidc v1.3.1

require (
	github.com/golang/protobuf v1.4.2 // indirect
	github.com/gorilla/schema v1.2.0 // indirect
	github.com/gorilla/securecookie v1.1.1 // indirect
	golang.org/x/crypto v0.0.0-20200622213623-75b288015ac9 // indirect
	golang.org/x/net v0.0.0-20210405180319-a5a99cb37ef4 // indirect
	golang.org/x/oauth2 v0.0.0-20200902213428-5d25da1a8d43 // indirect
	golang.org/x/text v0.3.7 // indirect
	google.golang.org/appengine v1.6.6 // indirect
	google.golang.org/protobuf v1.25.0 // indirect
	gopkg.in/square/go-jose.v2 v2.6.0 // indirect
)
