{
  "type" : [ "h-entry" ],
  "properties" : {
    "name" : [ "Pelle Wessman (@voxpelli@mastodon.social)" ],
    "summary" : [ "Banning or not banning Working from Home is so indicative of the black and white days we are living in.\n\nWorking from Home is great for some, awful for some and Working from Office is great for some, awful for some.\n\nAs with everything: Don’t outright ban or require it. Make **mindful decisions** that’s perceptive to the needs of your employees and which makes them perform optimally both individually and collectively 🙏" ],
    "url" : [ "https://mastodon.social/@voxpelli/113453706879386133" ]
  }
}
