{
  "type" : [ "h-entry" ],
  "properties" : {
    "name" : [ "Patricia Aas (@Patricia@vivaldi.net)" ],
    "summary" : [ "I think this book affected me in a completely opposite direction of what was intended. I am extremely motivated to make monolithic apps now.\n\nBrb gonna write a blog post on my distributed app hosted in a single process doing synchronous message passing through compiler generated stubs (*cough* function calls) and how running my “distributed app” in the same virtual memory space lends itself to improved performance, monitoring and debugging. Imma call it Virtual Distributed Monolith. Pay me to be your consultant 💰\n\n\nI’ll just write bs blog post like: “Real Time Audio with personalized addressing system allowing instant multichannel audio collaboration”" ],
    "url" : [ "https://social.vivaldi.net/@Patricia/112498759468388381" ]
  }
}
