{
  "type" : [ "h-entry" ],
  "properties" : {
    "name" : [ "james (@james@strangeobject.space)" ],
    "summary" : [ "Turned on my PC. Was just about to log in when I did a painful double take.\n\nThe picture displayed by Windows 10 is a Toucan with the words “AI is playing a critical role in the preservation of the Amazon rainforest”\n\nYou are correct. \n\nIt’s fucking nuking it.\n\nYou fucking shit lords.\n\n#AI #Microsoft" ],
    "url" : [ "https://strangeobject.space/@james/112622023990478562" ]
  }
}
