{
  "type" : [ "h-entry" ],
  "properties" : {
    "name" : [ "Inspirational Skeletor💀 (@skeletor@mas.to)" ],
    "summary" : [ "Attached: 1 image" ],
    "featured" : [ "https://media.mas.to/media_attachments/files/112/360/824/239/877/221/original/0f6ff166c7871b6f.jpeg" ],
    "url" : [ "https://mas.to/@skeletor/112360824531815702" ]
  }
}
