{
  "type" : [ "h-entry" ],
  "properties" : {
    "name" : [ "Joe Nash (@joenash@hachyderm.io)" ],
    "summary" : [ "On the one hand, I am feeling very crispy. On the other hand, after a year of mostly unemployment I had worried I had lost my ability to be productive for the length of a normal working day, and it would seem I have not." ],
    "url" : [ "https://hachyderm.io/@joenash/112331606497083722" ]
  }
}
