{
  "type" : [ "h-entry" ],
  "properties" : {
    "name" : [ "Any business that depends on third-party APIs that it does not control and is locked into using is not a good business." ],
    "url" : [ "https://werd.io/2024/any-business-that-depends-on-third-party-apis" ],
    "published" : [ "2024-04-09T18:54:03+00:00" ],
    "content" : [ {
      "html" : "Any business that depends on third-party APIs that it does not control and is locked into using is not a good business.",
      "value" : "Any business that depends on third-party APIs that it does not control and is locked into using is not a good business.",
      "lang" : "en"
    } ],
    "author" : [ {
      "type" : [ "h-card" ],
      "properties" : {
        "name" : [ "Ben Werdmuller" ],
        "url" : [ "https://werd.io/profile/benwerd", "https://werd.io/profile/benwerd", "https://werd.io/profile/benwerd" ],
        "photo" : [ "https://werd.io/file/5d388c5fb16ea14aac640912/thumb.jpg" ]
      },
      "lang" : "en",
      "value" : "Ben Werdmuller"
    } ]
  },
  "lang" : "en"
}
