{
  "type" : [ "h-entry" ],
  "properties" : {
    "name" : [ "Terence Eden (@Edent@mastodon.social)" ],
    "summary" : [ "Attached: 1 image\n\nWriting up my talk for #EMFcamp. \n\nIf you'd like to get the inside story of how the UK's contact tracing app was open sourced, please come along.\n\nhttps://www.emfcamp.org/schedule/2024/16-lessons-learned-open-sourcing-the-uks-covid-tracing-app" ],
    "featured" : [ "https://files.mastodon.social/media_attachments/files/112/475/008/142/928/343/original/089a1fedf59d4b1b.png" ],
    "url" : [ "https://mastodon.social/@Edent/112475031604353968" ]
  }
}
