{
  "type" : [ "h-entry" ],
  "properties" : {
    "name" : [ "luna, only carbon now (@luna@pony.social)" ],
    "summary" : [ "oh, I see, so it’s fine when SummoningSalt posts a video about a hotly-contested game speedrun, but when *I’m* the one getting beaten repeatedly for fun suddenly that’s “violating YouTube’s community guidelines”?" ],
    "url" : [ "https://pony.social/@luna/113460578510337932" ]
  }
}
