{
  "type" : [ "h-entry" ],
  "properties" : {
    "name" : [ "Justin Garrison (@justingarrison.com)" ],
    "summary" : [ "I recently found someone’s content that seems great for what I’m trying to learn\n\nThey publish content via substack which I refuse to pay for\n\nOne of their podcasts they said they love X and it has got better since Elon and it’s an immediate unfollow from me" ],
    "url" : [ "https://bsky.app/profile/justingarrison.com/post/3lduagxb7f227" ],
    "published" : [ "2024-12-22T01:14:26.550Z" ]
  }
}
