{
  "type": [
    "h-entry"
  ],
  "properties": {
    "name": [
      "So You Think You Know Git - FOSDEM 2024"
    ],
    "summary": [
      "Scott Chacon's FOSDEM 2024 talk on Git Tips and Tricks.Scott talks about:00:00 - Introduction01:06 - About Me (well, Scott Chacon)02:36 - How Well Do You Kno..."
    ],
    "featured": [
      "https://i.ytimg.com/vi/aolI_Rz0ZqY/maxresdefault.jpg"
    ],
    "url": [
      "https://www.youtube.com/watch?v=aolI_Rz0ZqY"
    ]
  }
}
