{
  "type" : [ "h-entry" ],
  "properties" : {
    "name" : [ "FOSDEM 2025 - Statement on planned protests during the upcoming FOSDEM 2025" ],
    "featured" : [ "https://fosdem.org/2025/assets/style/logo-gear-7204a6874eb0128932db10ff4030910401ac06f4e907f8b4a40da24ba592b252.png" ],
    "url" : [ "https://fosdem.org/2025/news/2025-01-16-protests/" ]
  }
}
