{
  "type" : [ "h-entry" ],
  "properties" : {
    "name" : [ "Fallthrough | An Exploration of Complexity" ],
    "summary" : [ "Modern software development feels so complex. In this episode, Ian Wester-Lopshire is joined by Kris Brandow, Matthew Sanabria, and Angelica Hill to discuss complexity. They propose hypotheses for the root cause of complexity, explore the ways complexity affects our technology and organizations,..." ],
    "featured" : [ "https://img.transistor.fm/DAYB0lRYcGhWEU4mZ9gEA3HTOaPQCEI5CVo7bZFqQgw/rs:fill:800:800:1/q:60/aHR0cHM6Ly9pbWct/dXBsb2FkLXByb2R1/Y3Rpb24udHJhbnNp/c3Rvci5mbS81NmU0/OTBhOGU3NDc3YTgw/MDEwYTZjZTQ1ZjYz/ZDdhMC5wbmc.webp" ],
    "audio" : [ "https://media.transistor.fm/c57ca733/195f0cd8.mp3" ],
    "url" : [ "https://share.transistor.fm/s/c57ca733" ]
  }
}
