{
  "type" : [ "h-entry" ],
  "properties" : {
    "uid" : [ "63ed1c17-00fe-5b5c-b1b0-9baf1f1df6d3" ],
    "name" : [ "Re: How do you represent a JSON field in Go that could be absent, null or have a value?" ],
    "in-reply-to" : [ "https://www.jvt.me/posts/2024/01/09/go-json-nullable/" ],
    "url" : [ "https://beesbuzz.biz/blog/chatter/11538-Re-How-do-you-represent-a-JSON-field-in-Go-that-could-be-absent-null-or-have-a-value" ],
    "published" : [ "2024-01-09T11:57:39-08:00" ],
    "content" : [ {
      "html" : "<p class=\"reference\">In reply to: <a href=\"https://www.jvt.me/posts/2024/01/09/go-json-nullable/\">Re: How do you represent a JSON field in Go that could be absent, <code>null</code> or have a value?</a></p><div id=\"preamble\" class=\"body\">\n<p>I have nothing helpful to add here except to say, Javascript’s <code>undefined</code>/<code>null</code> duality continues to be a mistake.</p><p>(But also, anything that relies on that duality has also made a mistake.)</p>\n</div>",
      "value" : "In reply to: Re: How do you represent a JSON field in Go that could be absent, null or have a value?\nI have nothing helpful to add here except to say, Javascript’s undefined/null duality continues to be a mistake.\n(But also, anything that relies on that duality has also made a mistake.)",
      "lang" : "en"
    } ],
    "author" : [ {
      "type" : [ "h-card" ],
      "properties" : {
        "name" : [ "fluffy" ],
        "note" : [ "A Seattle-based programmer/musician who makes games, comics, and bad decisions." ],
        "pronouns" : [ "they/them or it/its (if you're nice about it)" ],
        "pronoun-nominative" : [ "they", "it" ],
        "pronoun-oblique" : [ "them", "its" ],
        "url" : [ "https://beesbuzz.biz/" ],
        "email" : [ "mailto:fluffy%40beesbuzz%2ebiz" ],
        "photo" : [ "https://beesbuzz.biz/static/headshot.jpg" ],
        "bday" : [ "1978-06-14" ]
      },
      "lang" : "en",
      "value" : "fluffy"
    } ]
  },
  "lang" : "en"
}
