{
  "type" : [ "h-entry" ],
  "properties" : {
    "name" : [ "Collaborative discussions at an unconference" ],
    "category" : [ "barcamp", "oggcamp", "unconference" ],
    "url" : [ "https://shkspr.mobi/blog/2024/10/collaborative-discussions-at-an-unconference/" ],
    "published" : [ "2024-10-15" ],
    "updated" : [ "2024-10-15" ],
    "author" : [ {
      "type" : [ "h-card" ],
      "properties" : {
        "name" : [ "@edent" ],
        "photo" : [ {
          "value" : "https://shkspr.mobi/apple-touch-icon.png",
          "alt" : ""
        } ]
      },
      "lang" : "en-GB",
      "value" : "@edent"
    } ]
  },
  "lang" : "en-GB"
}
