{
  "type" : [ "h-entry" ],
  "properties" : {
    "name" : [ "Danielle Foré (@danirabbit@mastodon.online)" ],
    "summary" : [ "The more I think about it, the major problems in tech and in society in general is that all the investment is going to solve problems that white affluent men have" ],
    "url" : [ "https://mastodon.online/@danirabbit/112502816917988936" ]
  }
}
