{
  "type" : [ "h-entry" ],
  "properties" : {
    "name" : [ "Ana Rodrigues (@anarodrigues@front-end.social)" ],
    "summary" : [ "Ready for the second session of the day for me: Site Death. What happens to your personal website after you pass away. \n\n#IndieWebCampBrighton" ],
    "url" : [ "https://front-end.social/@anarodrigues/112066136296252054" ]
  }
}
