{
  "type" : [ "h-entry" ],
  "properties" : {
    "name" : [ "DevOps and Docker Talk: Cloud Native Interviews and Tooling | OpenSauced with Brian Douglas" ],
    "summary" : [ "Interviews from Bret Fisher's live show. Topics cover container and cloud topics like Docker, Kubernetes, Swarm, Cloud Native development, DevOps, SRE, GitOps, DevSecOps, platform engineering, and the full software lifecycle. Full show notes and more info available at https://podcast.bretfisher.com" ],
    "featured" : [ "https://images.transistor.fm/file/transistor/images/social_images/site/536/NEW_Podcast_Logo_1000x1000.png" ],
    "audio" : [ "https://media.transistor.fm/fc7f4dc0/e76ebc48.mp3?src=site" ],
    "url" : [ "https://podcast.bretfisher.com/episodes/opensauced-with-brian-douglas" ]
  }
}
