{
  "type" : [ "h-entry" ],
  "properties" : {
    "name" : [ "Questions from a new Go developer (Go Time #308)" ],
    "summary" : [ "In this episode we answer any/all questions from a new Go developer. Features, best practices, quirks of the language… it’s all on the table for discussion. " ],
    "featured" : [ "https://cdn.changelog.com/static/images/share/twitter-gotime-a47cdd7bb3e3357398eda827d9cc3615.png" ],
    "audio" : [ "https://op3.dev/e/https://cdn.changelog.com/uploads/gotime/308/go-time-308.mp3" ],
    "url" : [ "https://changelog.com/gotime/308" ]
  }
}
