{
  "type" : [ "h-entry" ],
  "properties" : {
    "name" : [ "Joe Nash (@joenash@hachyderm.io)" ],
    "summary" : [ "Unbelievably, it’s been 5 years, and I am now a permanent resident of the Netherlands!" ],
    "url" : [ "https://hachyderm.io/@joenash/112384269319453593" ]
  }
}
