{
  "type" : [ "h-entry" ],
  "properties" : {
    "name" : [ "Redocly, OpenAPI, and learning to Moonwalk with Lorna Jane Mitchell" ],
    "summary" : [ "Phil sits down with Lorna Jane Mitchell to get the latest on what's going on at Redocly, the state of OpenAPI 3.1, and what's to come with OpenAPI's proposed 4.0 spec, Moonwalk." ],
    "featured" : [ "https://apisyouwonthate.com/content/images/2024/01/lornapod.jpg" ],
    "url" : [ "https://apisyouwonthate.com/podcast/redocly-openapi-moonwalk-lorna-jane-mitchell/" ],
    "published" : [ "2024-01-22T07:00:47.000Z" ]
  }
}
