{
  "type" : [ "h-entry" ],
  "properties" : {
    "name" : [ "Russell Keith-Magee's journey to open source" ],
    "summary" : [ "Russell Keith-Magee connects with Open Source Stories to talk about his earliest memories of technology, recount how he got involved with the Django ecosystem, and share his thoughts on open source contractualism." ],
    "featured" : [ "https://i.creativecommons.org/l/by-sa/4.0/88x31.png" ],
    "url" : [ "https://www.opensourcestories.org/stories/2021/russell-keith-magee/" ],
    "published" : [ "2023-04-25T09:52:35-07:00" ]
  }
}
