{
  "type" : [ "h-entry" ],
  "properties" : {
    "name" : [ "Terence Eden (@Edent@mastodon.social)" ],
    "summary" : [ "Attached: 1 image\n\nTwo years later.\n\nWant to know one of the major reasons Mastodon didn't catch on with journalists and large website owners?\n\nIt is *invisible* in referrer statistics.\n\nHere's my blog from the last month.\n\nBlueSky now sends me more traffic than Bing.\n\nHow much traffic does Mastodon send? It is impossible to know due to the \"noreferrer\" header in all links.\n\n(I'm not saying your privacy isn't important. But you can't build a community if no-one knows you exist.)" ],
    "featured" : [ "https://files.mastodon.social/media_attachments/files/113/611/599/519/383/213/original/f32f26cb4a0f015a.png" ],
    "url" : [ "https://mastodon.social/@Edent/113611619218784737" ]
  }
}
