{
  "type" : [ "h-entry" ],
  "properties" : {
    "name" : [ "Alex Wilson (@probablyfine@tech.lgbt)" ],
    "summary" : [ "Doing a bit of TDD as a treat (I require the dopamine from seeing red turn into green)" ],
    "url" : [ "https://tech.lgbt/@probablyfine/112178919548188201" ]
  }
}
