{
  "type" : [ "h-entry" ],
  "properties" : {
    "name" : [ "GitHub - heyman/heynote: A dedicated scratchpad for developers" ],
    "summary" : [ "A dedicated scratchpad for developers. Contribute to heyman/heynote development by creating an account on GitHub." ],
    "featured" : [ "https://opengraph.githubassets.com/636494925336fbf6076543faf914fc484ca01e374248f7980c24f82e4b18013f/heyman/heynote" ],
    "url" : [ "https://github.com/heyman/heynote" ]
  }
}
