{
  "type" : [ "h-entry" ],
  "properties" : {
    "name" : [ "Tolerating full cloud outages with Monzo Stand-in" ],
    "featured" : [ "https://images.ctfassets.net/ro61k101ee59/7FT3ap1A4U7BkEy85W3WyY/fb167cb59d57ff773dd9a7a1e926453a/Preview_Link.png" ],
    "url" : [ "https://monzo.com/blog/tolerating-full-cloud-outages-with-monzo-stand-in" ]
  }
}
