{
  "type" : [ "h-entry" ],
  "properties" : {
    "name" : [ "Corporate Blogging is Hard; Open a GitHub Issue Instead" ],
    "category" : [ "blogging", "github", "marketing" ],
    "url" : [ "https://shkspr.mobi/blog/2024/07/corporate-blogging-is-hard-open-a-github-issue-instead/" ],
    "published" : [ "2024-07-26" ],
    "updated" : [ "2024-07-26" ],
    "author" : [ {
      "type" : [ "h-card" ],
      "properties" : {
        "name" : [ "@edent" ],
        "photo" : [ {
          "value" : "https://shkspr.mobi/apple-touch-icon.png",
          "alt" : ""
        } ]
      },
      "lang" : "en-GB",
      "value" : "@edent"
    } ]
  },
  "lang" : "en-GB"
}
