{
  "type" : [ "h-entry" ],
  "properties" : {
    "name" : [ "Joe Nash (@joenash@hachyderm.io)" ],
    "summary" : [ "everyone is exhibiting a frankly dangerous and unhinged post #emfcamp energy this time around, 2026 is going to be something else" ],
    "url" : [ "https://hachyderm.io/@joenash/112580595668401033" ]
  }
}
