{
  "type" : [ "h-entry" ],
  "properties" : {
    "name" : [ "Terra The Unhinged Autist (@Terra@chaosfem.tw)" ],
    "summary" : [ "Two years ago: I'm wearing a fucking T-shirt because who the fuck cares I'm not gonna see the end of this goddamn year anyway.\n\nTonight: Hrm, which of the two gorgeous dresses that I bought but haven't worn yet shown I wear to the party?" ],
    "url" : [ "https://chaosfem.tw/@Terra/111677525811371997" ]
  }
}
