{
  "type" : [ "h-entry" ],
  "properties" : {
    "name" : [ "GitHub - benjifs/sparkles: a micropub client" ],
    "summary" : [ "a micropub client. Contribute to benjifs/sparkles development by creating an account on GitHub." ],
    "featured" : [ "https://opengraph.githubassets.com/91743ad35a18451bd0edcdef45e4a9084a1a7602e1ae56e46b2b3687c57a5b87/benjifs/sparkles" ],
    "url" : [ "https://github.com/benjifs/sparkles" ]
  }
}
