{
  "type" : [ "h-entry" ],
  "properties" : {
    "name" : [ "Stuart Langridge (@sil@mastodon.social)" ],
    "summary" : [ "#soocon24 is like open source conferences used to be.\n\nThis is more of a compliment than it may sound like." ],
    "url" : [ "https://mastodon.social/@sil/111890927295289936" ]
  }
}
