{
  "type" : [ "h-entry" ],
  "properties" : {
    "name" : [ "james (@james@strangeobject.space)" ],
    "summary" : [ "Anyone working for BigCorp and have 15-27k they wanna use to sponsor an event in two weeks, to make it as accessible as it has been in previous years?\n\nTo a sexy hunky luscious BigCorp like you, it’s a forgettable line item and you probably spent 10x more on useless crap this year.\n\nGo on, give it to me.\n\n😬\n\nhttps://www.emfcamp.org/" ],
    "url" : [ "https://strangeobject.space/@james/112446484040002467" ]
  }
}
