{
  "type" : [ "h-entry" ],
  "properties" : {
    "name" : [ "jenny sais quoi (@jennyrock@octodon.social)" ],
    "summary" : [ "Attached: 1 image · Content warning: uspol" ],
    "url" : [ "https://octodon.social/@jennyrock/112146512817545369" ]
  }
}
