{
  "type" : [ "h-entry" ],
  "properties" : {
    "name" : [ "Seth🎙️ (@s3th.me)" ],
    "summary" : [ "Made me chuckle!" ],
    "featured" : [ "https://cdn.bsky.app/img/feed_thumbnail/plain/did:plc:fric2guxsgk2zd5wtxhj44gj/bafkreib7fz73qfjvxvxy43vfca5kxnpfzhmywxt4c57zvibb75em77g6n4@jpeg" ],
    "url" : [ "https://bsky.app/profile/s3th.me/post/3lgnt7oziih2z" ],
    "published" : [ "2025-01-26T16:17:21.448Z" ]
  }
}
