{
  "type" : [ "h-entry" ],
  "properties" : {
    "name" : [ "Dan Hon (@danhon@dan.mastohon.com)" ],
    "summary" : [ "Just realised Sam Altman is the Willy Wonka of AI." ],
    "url" : [ "https://dan.mastohon.com/@danhon/113194208931823254" ]
  }
}
