{
  "type" : [ "h-entry" ],
  "properties" : {
    "name" : [ "Kubernetes is an anti-platform with Adam Jacob (Ship It! #126)" ],
    "summary" : [ "Adam Jacob remains optimistic about the future for infrastructure and is building new ideas to make it better." ],
    "featured" : [ "https://snap.fly.dev/shipit/126/img" ],
    "audio" : [ "https://op3.dev/e/https://cdn.changelog.com/uploads/shipit/126/ship-it-126.mp3" ],
    "url" : [ "https://changelog.com/shipit/126" ]
  }
}
