{
  "type" : [ "h-entry" ],
  "properties" : {
    "name" : [ "automatic server maid (@astrid@fedi.astrid.tech)" ],
    "summary" : [ "gamer girl bath water is a scam. we all know that real gamer girls don't bathe" ],
    "featured" : [ "https://s3.us-west-000.backblazeb2.com/nyaabucket/a0354d551b2d54d6ddae7645becd91fc8cb8760807a501131f5a1359df08926f.png" ],
    "url" : [ "https://fedi.astrid.tech/notice/Ah7fAeL1PYxSMv2teq" ]
  }
}
