{
  "type" : [ "h-entry" ],
  "properties" : {
    "name" : [ "Ian Coldwater 📦💥 (@lookitup.baby)" ],
    "summary" : [ "I will never understand why people post generated pictures of aurora when real auroras are this beautiful" ],
    "featured" : [ "https://cdn.bsky.app/img/feed_thumbnail/plain/did:plc:z2rokxrttw5254hogmucux2x/bafkreigeyrgrbu7nps4xdszcnejjqdlp6zd6lpfu674zd3kwglw7d2jyji@jpeg" ],
    "url" : [ "https://bsky.app/profile/lookitup.baby/post/3lblk4l53fs2k" ],
    "published" : [ "2024-11-23T03:23:17.155Z" ]
  }
}
