{
  "type" : [ "h-entry" ],
  "properties" : {
    "name" : [ "Dave Rahardja (@drahardja@sfba.social)" ],
    "summary" : [ "Tech workers when everyone is hiring: lol, I don’t need to unionize. Look how well I negotiated for myself!\n\nTech workers when there are layoffs everywhere: I don’t have time to unionize! I’m desperate to get a job right now!\n\n#unionize #unionStrong" ],
    "url" : [ "https://sfba.social/@drahardja/111740688534911216" ]
  }
}
