{
  "type" : [ "h-entry" ],
  "properties" : {
    "name" : [ "#72 - Give People What They Came For, with Jerod Santo" ],
    "summary" : [ "Today I got the pleasure to chat with Jerod Santo, the Managing Editor at Changelog Media. Picture this – a podcast that not only uncovers the intricacies of Jerod's career but also shares some unconventional lessons learned from his work. From navigating the ever-evolving tech landscape to spearheading Changelog, Jerod brings a wealth of experience that transcends your typical engineer expectations and taps into the heart of what it means to build a sustainable developer community." ],
    "featured" : [ "https://cdn.theworkitem.com/art/episode-72/header.jpg" ],
    "audio" : [ "https://cdn.theworkitem.com/audio/the-work-item-S05E02.mp3" ],
    "url" : [ "https://theworkitem.com/blog/give-people-what-they-came-for-jerod-santo/" ],
    "published" : [ "2024-02-05T00:00:00+00:00" ]
  }
}
