{
  "type" : [ "h-entry" ],
  "properties" : {
    "name" : [ "The Oban Pros with Shannon &amp; Parker Selbert (Changelog &amp; Friends #35)" ],
    "summary" : [ "Today you get Sorentwo for the price of one! We are joined by Shannon &amp;amp; Parker Selbert, both halves of the mom-and-pop software shop behind Oban, the robust job processing library that’s been delivering our emails &amp;amp; processing our audio for years. " ],
    "featured" : [ "https://cdn.changelog.com/static/images/share/twitter-friends-7fa3c9c5a72765c322b47e92da397fbb.png" ],
    "audio" : [ "https://op3.dev/e/https://cdn.changelog.com/uploads/friends/35/changelog--friends-35.mp3" ],
    "url" : [ "https://changelog.com/friends/35" ]
  }
}
