{
  "type" : [ "h-entry" ],
  "properties" : {
    "name" : [ "Aha moments reading Go&#39;s source: Part 1 with Jesús Espino, Principal Engineer at Mattermost (Go Time #323)" ],
    "summary" : [ "Jesús Espino from Mattermost tells Natalie all about (the first six of) his 10 &quot;aha moments&quot; he had reading the Go source code. Part 2 (with the rest of his aha moments) coming soon!" ],
    "featured" : [ "https://snap.fly.dev/gotime/323/img" ],
    "audio" : [ "https://op3.dev/e/https://cdn.changelog.com/uploads/gotime/323/go-time-323.mp3" ],
    "url" : [ "https://changelog.com/gotime/323" ]
  }
}
