{
  "type" : [ "h-entry" ],
  "properties" : {
    "name" : [ "Florian Haas (@xahteiwi@mastodon.social)" ],
    "summary" : [ "Tapping the sign:\n\nYou don't take meeting notes for the people in the meeting. You take them for people who aren't in the meeting.\n\nThat includes three-months-from-now-you, who also isn't in the meeting." ],
    "url" : [ "https://mastodon.social/@xahteiwi/112205781643722359" ]
  }
}
