{
  "type" : [ "h-card" ],
  "properties" : {
    "name" : [ "Mario" ],
    "photo" : [ {
      "value" : "https://v1.image.11ty.dev/https%3A%2F%2Fwebmention.io%2Favatar%2Fcdn.masto.host%2Fc31eb7e639446b600869fc9fff90205bf2f3143db8b87031c50ce8a40d6533c0.png/jpeg/72/",
      "alt" : "Mario"
    } ],
    "url" : [ "https://fediverse.zachleat.com/@zachleat/112917087819399708#favorited-by-109639115399589709" ]
  },
  "lang" : "en"
}
