{
  "type" : [ "h-entry" ],
  "properties" : {
    "name" : [ "Mastering OpenSSF Scorecards & SBOMs with Chris Swan" ],
    "summary" : [ "Joining Viktor Petersson this week is Chris Swan from Atsign, where they dive into the crucial world of Software Bill of Materials (SBOMs) and OpenSSF Scorecards. Chris sheds light on the essential role these tools play in bolstering open source security, sharing expert insights on dependency management, secure coding practices, and the importance of transparency and trust within the tech industry.\n" ],
    "featured" : [ "https://vpetersson.com/assets/images/site/talk.jpg" ],
    "url" : [ "https://vpetersson.com/podcast/S01E09.html" ]
  }
}
