{
  "type" : [ "h-card" ],
  "properties" : {
    "name" : [ "himal" ],
    "photo" : [ {
      "value" : "https://cdn.bsky.app/img/avatar/plain/did:plc:iyrvoj3a3msrqlngpuvgkxzw/bafkreihf56v5k4cwy3susqjz4gmyuomrjzwbfipsgdrpyt2u2ol42qko2y@jpeg",
      "alt" : ""
    } ],
    "url" : [ "https://bsky.app/profile/himal.bsky.social/post/3ldlpekivrk2r" ]
  },
  "lang" : "en-GB"
}
