{
  "type" : [ "h-entry" ],
  "properties" : {
    "name" : [ "Luna (@luna@pony.social)" ],
    "summary" : [ "Attached: 1 image" ],
    "featured" : [ "https://cdn.pony.social/media_attachments/files/111/909/508/611/032/098/original/c2249194f0722a20.png" ],
    "url" : [ "https://pony.social/@luna/111909509351772138" ]
  }
}
