{
  "type" : [ "h-entry" ],
  "properties" : {
    "name" : [ "Alex Wilson-Davis (@probablyfine@tech.lgbt)" ],
    "summary" : [ "Some try to keep on top of their emails by aspiring to reach Inbox Zero. \n\nI try to keep on top of my code by aspiring to reach Branches Zero.\n\nIf you're taking continuous integration seriously, you should have zero branches most of the time, and they should only exist (a) if you're not doing trunk-based development and (b) for as short a time as possible." ],
    "url" : [ "https://tech.lgbt/@probablyfine/113208787574773008" ]
  }
}
