{
  "type" : [ "h-entry" ],
  "properties" : {
    "name" : [ "pumpkin spice bratte (@Sinjo@tech.lgbt)" ],
    "summary" : [ "@probablyfine the actual useful thing is for software developers to care about their writing skills, which is a vanishingly rare trait" ],
    "url" : [ "https://tech.lgbt/@Sinjo/113231947038791863" ]
  }
}
