{
  "type" : [ "h-entry" ],
  "properties" : {
    "summary" : [ "Receiving webmentions was easy to set up with webmention.io and webmention.js. For a static site, sending webmentions is a little messier, but there is a netlify plugin that I’ve found helpful. Always room for improvement though." ],
    "category" : [ "IndieWeb" ],
    "url" : [ "https://www.ciccarello.me/posts/2023/11/19/indieweb-site-implementation/" ],
    "author" : [ "https://www.ciccarello.me/" ],
    "published" : [ "2023-11-19T17:46:18Z" ]
  },
  "lang" : "en-us"
}
