{
  "type" : [ "h-entry" ],
  "properties" : {
    "name" : [ "Dear friend, you have built a Kubernetes" ],
    "summary" : [ "Mac's Tech Blog" ],
    "featured" : [ "https://www.macchaffee.com/static/favicon.png" ],
    "url" : [ "https://www.macchaffee.com/blog/2024/you-have-built-a-kubernetes/" ]
  }
}
