{
  "type" : [ "h-entry" ],
  "properties" : {
    "name" : [ "Adriana Villela (@adrianamvillela@hachyderm.io)" ],
    "summary" : [ "@www.jvt.me@www.jvt.me just my private notes of random crap I've picked up over the years that were in a .txt file and finally found a home in GH. 😁" ],
    "url" : [ "https://hachyderm.io/@adrianamvillela/112870383246543376" ]
  }
}
