{
  "type" : [ "h-card" ],
  "properties" : {
    "name" : [ "Old Man in the Shoe" ],
    "photo" : [ {
      "value" : "https://files.mastodon.social/accounts/avatars/112/259/039/003/177/332/original/ce7fb5f189d1db5a.webp",
      "alt" : ""
    } ],
    "url" : [ "https://mastodon.social/@jenzi" ]
  },
  "lang" : "en-US"
}
