{
  "type" : [ "h-entry" ],
  "properties" : {
    "name" : [ "We can dance if we want to... (Changelog News #81)" ],
    "summary" : [ "Changelog Beats drops a new Dance Party album, Will McGugan’s new Toolong (tl) terminal app, Mitchell Baker is out as Mozilla CEO, Microsoft’s Jordi Adoumie announces sudo for Windows, Tatu Ylonen tells the tale of how they got SSH to be port 22 &amp;amp; Jack Lindamood gives an “Endorse” or “Regret” rating for ~50 differe..." ],
    "featured" : [ "https://cdn.changelog.com/static/images/share/twitter-news-f48944e5ee8f74e0a75c4000fb833e2f.png" ],
    "audio" : [ "https://op3.dev/e/https://cdn.changelog.com/uploads/news/81/changelog-news-81.mp3" ],
    "url" : [ "https://changelog.com/news/81" ]
  }
}
