{
  "type" : [ "h-card" ],
  "properties" : {
    "name" : [ "nebucatnetzer" ],
    "photo" : [ {
      "value" : "https://files.mastodon.social/cache/accounts/avatars/111/812/476/939/794/836/original/3b8fb4856bc84506.png",
      "alt" : ""
    } ],
    "url" : [ "https://emacs.ch/@nebucatnetzer/113312562154767132" ]
  },
  "lang" : "en-GB"
}
