{
  "type" : [ "h-entry" ],
  "properties" : {
    "name" : [ "chimbosonic (@chimbosonic@fosstodon.org)" ],
    "summary" : [ "As the year wrapped up, I spent some time reflecting on my transition from a CyberSecurity engineer to Principal engineer  which inspired me to write a blog about the steep learning curve of writing quality coding and—how I used #rust to reinforce my skills. Check it out and let me know what you think!\n\nhttps://tilde.club/~chimbo/blog/posts/rust-learnings-and-journey.html\n\n#RustLang, #Rust, #SoftwareEngineering, #CodingJourney, #CareerChange, #CyberSecurity, #OpenSource, #TechBlog,  #blog" ],
    "url" : [ "https://fosstodon.org/@chimbosonic/113799005597093169" ]
  }
}
