{
  "type" : [ "h-entry" ],
  "properties" : {
    "name" : [ "GitHub and Sovereign Tech Agency: Funding Open Source Ecosystems, Tue, Dec 10, 2024, 8:00 AM   | Meetup" ],
    "summary" : [ "Join GitHub and the [Sovereign Tech Agency ](https://www.sovereign.tech)(home of the Sovereign Tech Fund) for a conversation on public- and private-sector open source fundi" ],
    "featured" : [ "https://secure.meetupstatic.com/photos/event/a/e/8/2/600_524924674.jpeg" ],
    "url" : [ "https://www.meetup.com/github/events/304800194/" ]
  }
}
