{
  "type" : [ "h-entry" ],
  "properties" : {
    "name" : [ "dannyguo.com/src/pages/blog/my-salary-history.md at c835e1a8960a8204000201d98f6b8ee75f23b383 · dguo/dannyguo.com" ],
    "summary" : [ ":thought_balloon: My personal website. Contribute to dguo/dannyguo.com development by creating an account on GitHub." ],
    "featured" : [ "https://opengraph.githubassets.com/d587724e0cdd9d202c6da36feba44f7e78df537dea1ceed010be427aef0efae3/dguo/dannyguo.com" ],
    "url" : [ "https://github.com/dguo/dannyguo.com/blob/c835e1a8960a8204000201d98f6b8ee75f23b383/src/pages/blog/my-salary-history.md" ]
  }
}
