{
  "type" : [ "h-entry" ],
  "properties" : {
    "name" : [ "Ep 3. Jo Brand" ],
    "summary" : [ "Taskmaster The Podcast · Episode" ],
    "featured" : [ "https://i.scdn.co/image/ab6765630000ba8a400fe8d0ed5753d27fd9586d" ],
    "url" : [ "https://open.spotify.com/episode/3EWeWwV4nFHIeh7derbbGT" ]
  }
}
