{
  "type" : [ "h-entry" ],
  "properties" : {
    "name" : [ "Patricia Aas (@Patricia@vivaldi.net)" ],
    "summary" : [ "Normal folks hating on C++: it’s an old and memory unsafe programming language.\n\nMe hating on C++: there is a convicted rapist and registered sex offender on the C++ committee and the committee leadership worked really hard to keep him there." ],
    "url" : [ "https://social.vivaldi.net/@Patricia/112819653451972957" ]
  }
}
