{
  "type" : [ "h-entry" ],
  "properties" : {
    "name" : [ "Josh Simmons (@josh@josh.tel)" ],
    "summary" : [ "I am deeply alarmed for the trans and gender expansive community in the UK. What the fuck: https://www.lgbtqnation.com/2024/12/united-kingdom-bans-puberty-blockers-indefinitely-its-a-death-sentence/\n\n(Yes also alarmed about what's happening in the US, esp in Florida right now, and what the next four years may bring.)\n\n#UKPol #USPol #Trans #LGBTQ" ],
    "url" : [ "https://josh.tel/@josh/113641518146897665" ]
  }
}
