{
  "type" : [ "h-entry" ],
  "properties" : {
    "name" : [ "Chris \"Not So\" Short 🇺🇦 (@ChrisShort@hachyderm.io)" ],
    "summary" : [ "Attached: 1 image\n\nThe sponsors of an event like Open Source Summit are often a good list of orgs that might be hiring, if you’re looking for a job. #OSSNA" ],
    "featured" : [ "https://media.hachyderm.io/media_attachments/files/112/281/912/827/581/543/original/bb14ca5aabc076d4.jpeg" ],
    "url" : [ "https://hachyderm.io/@ChrisShort/112281912999479002" ]
  }
}
