{
  "type" : [ "h-entry" ],
  "properties" : {
    "name" : [ "Alex P. 👹 (@saddestrobots@jorts.horse)" ],
    "summary" : [ "the whole country's gonna get soooo many lectures about \"political violence\" from the people who think all of society will crumble if the cops don't beat the shit out of black teens and homeless people every day of the week" ],
    "url" : [ "https://jorts.horse/@saddestrobots/112782644374055499" ]
  }
}
