{
  "type" : [ "h-entry" ],
  "properties" : {
    "name" : [ "Changelog (@changelog@changelog.social)" ],
    "summary" : [ "Who best fits these two qualities?\n\n1. Knows a boat load about HTTP\n2. Is good at communicating knowledge\n\n(Asking for a @jsparty)" ],
    "url" : [ "https://changelog.social/@changelog/112570521030419992" ]
  }
}
