{
  "type" : [ "h-entry" ],
  "properties" : {
    "name" : [ "OpenUK (@openuk@hachyderm.io)" ],
    "summary" : [ "Attached: 1 image\n\nState of Open Con 25 schedule is live. The content will be world class and set the agenda for open source in 2025. View the schedule and buy your tickets at: https://stateofopencon.com\n#soocon25 #opensource #opendhardware #opendata #opensourcesoftware #AI #opensourceai" ],
    "featured" : [ "https://media.hachyderm.io/media_attachments/files/113/753/220/985/874/688/original/b824da031b51a647.png" ],
    "url" : [ "https://hachyderm.io/@openuk/113753221109549758" ]
  }
}
