{
  "type" : [ "h-entry" ],
  "properties" : {
    "name" : [ "SustainOSS: Foundations and Fiscal Hosting for Open Source Communities" ],
    "summary" : [ "Join Shane Curcuru (fossfoundation.info) and Lauren Gardner (Open Source Collective) to talk about the state of fiscal hosting for FOSS!" ],
    "featured" : [ "https://img.evbuc.com/https%3A%2F%2Fcdn.evbuc.com%2Fimages%2F723264869%2F1390032590%2F1%2Foriginal.20240319-163048?w=1000&auto=format%2Ccompress&q=75&sharp=10&rect=0%2C60%2C1920%2C960&s=6231ac474b311b55e54a305402c75592" ],
    "url" : [ "https://www.eventbrite.com/e/sustainoss-foundations-and-fiscal-hosting-for-open-source-communities-tickets-866704676017" ]
  }
}
