{
  "type" : [ "h-entry" ],
  "properties" : {
    "name" : [ "Terence Eden (@Edent@mastodon.social)" ],
    "summary" : [ "EBay just hit me with this again. A fiver for installing their app.\n\nInstalled, claimed £5 discount, bought the thing I'd added to my basket on the Web, uninstalled immediately.\n\nIf any of you would like to pay me to temporarily use you app, let me know!" ],
    "url" : [ "https://mastodon.social/@Edent/112982033178206068" ]
  }
}
