{
  "type" : [ "h-entry" ],
  "properties" : {
    "name" : [ "Wine Web and a whole lot of Whatnot with Robbie Wagner & Chuck Carpenter (Changelog & Friends #68)" ],
    "summary" : [ "We join the Whiskey Web and Whatnot podcast live from the hallway track at All Things Open 2024. Topics include: Chianti, content creation, open source, fake jobs, cancel culture, Silicon Valley (ding), frontend frustrations, the Roman empire & more." ],
    "featured" : [ "https://snap.fly.dev/friends/68/img" ],
    "audio" : [ "https://op3.dev/e/https://cdn.changelog.com/uploads/friends/68/changelog--friends-68.mp3" ],
    "url" : [ "https://changelog.com/friends/68" ]
  }
}
