{
  "type" : [ "h-entry" ],
  "properties" : {
    "name" : [ "It's a peccadillo circus featuring Mat Ryer on the piano (Changelog & Friends #75)" ],
    "summary" : [ "Mat Ryer is back! He plays the piano, we tell each other truths/lies, we pay homage to the 8\" floppy disk, Mat accepts an open source medal, and so much more. It's a real circus. MatGPT!" ],
    "featured" : [ "https://snap.fly.dev/friends/75/img" ],
    "audio" : [ "https://op3.dev/e/https://cdn.changelog.com/uploads/friends/75/changelog--friends-75.mp3" ],
    "url" : [ "https://changelog.com/friends/75" ]
  }
}
