{
  "type" : [ "h-card" ],
  "properties" : {
    "name" : [ "Valentin Sawadski" ],
    "photo" : [ {
      "value" : "https://v1.image.11ty.dev/https%3A%2F%2Fwebmention.io%2Favatar%2Fcdn.masto.host%2F11938521f392136e2c92384bc9dc78fcf7db54517a130c893418d97fd00a7904.jpg/jpeg/72/",
      "alt" : "Valentin Sawadski"
    } ],
    "url" : [ "https://fediverse.zachleat.com/@zachleat/112917087819399708#favorited-by-109708945259467830" ]
  },
  "lang" : "en"
}
