{
  "type" : [ "h-entry" ],
  "properties" : {
    "name" : [ "Mohammed Shah on TOS Violations for Open Source Projects" ],
    "summary" : [ "Mohammed discusses WhatsApp TOS violations, and how the distressing experience of receiving cease and desist letters forced him to step down from the project." ],
    "featured" : [ "https://assets.fireside.fm/file/fireside-images/podcasts/images/2/27729c65-f4a6-4496-8c86-820e7f13b285/episodes/4/4391c84a-9711-417d-b6c2-55c3356eccac/cover_medium.jpg?v=1" ],
    "audio" : [ "https://aphid.fireside.fm/d/1437767933/27729c65-f4a6-4496-8c86-820e7f13b285/4391c84a-9711-417d-b6c2-55c3356eccac.mp3" ],
    "author" : [ {
      "type" : [ "h-card" ],
      "properties" : {
        "name" : [ "SustainOSS" ]
      }
    } ],
    "url" : [ "https://podcast.sustainoss.org/216" ]
  }
}
