{
  "type" : [ "h-entry" ],
  "properties" : {
    "name" : [ "Abby Bangser (@abangser.bsky.social)" ],
    "summary" : [ "Deja vu. 8 years ago I was flying to the US after a shocking result. \n\nThis time I'm flying on Saturday. After an (annoyingly less) shocking result. \n\nBeing an American emigrant makes the experience of being in the US post these elections particularly surreal." ],
    "url" : [ "https://bsky.app/profile/abangser.bsky.social/post/3labeuiaofo23" ],
    "published" : [ "2024-11-06T08:57:24.886Z" ]
  }
}
