{
  "type" : [ "h-entry" ],
  "properties" : {
    "name" : [ "tierney cyren (@bnb.im)" ],
    "summary" : [ "this year (next month!) is 10 years since I left the abusive household I grew up in and stopped talking to my family\n\nvery thankful for my chosen family, many of whom are here. I wouldn’t be alive right now without you." ],
    "url" : [ "https://bsky.app/profile/bnb.im/post/3lfsb4lddds2l" ],
    "published" : [ "2025-01-15T17:11:35.653Z" ]
  }
}
