{
  "type" : [ "h-card" ],
  "properties" : {
    "name" : [ "Pedro Machado Santa" ],
    "photo" : [ {
      "value" : "https://files.mastodon.social/accounts/avatars/108/196/223/149/688/757/original/cdef1495c357e84a.jpeg",
      "alt" : ""
    } ],
    "url" : [ "https://mastodon.social/@pedrosanta" ]
  },
  "lang" : "en-US"
}
