{
  "type" : [ "h-entry" ],
  "properties" : {
    "name" : [ "elle (@ElleGray@mstdn.social)" ],
    "summary" : [ "I always write in the present tense. It's the present, and I'm tense" ],
    "url" : [ "https://mstdn.social/@ElleGray/112287610010962222" ]
  }
}
