{
  "type" : [ "h-entry" ],
  "properties" : {
    "name" : [ "A few thoughts on conferences" ],
    "featured" : [ "https://akrabat.com/wp-content/uploads/2024/02/IMG_7828-web-1024x576.jpeg" ],
    "url" : [ "https://akrabat.com/a-few-thoughts-on-conferences/" ]
  }
}
