{
  "type" : [ "h-entry" ],
  "properties" : {
    "name" : [ "Kuna (@wryote.bsky.social)" ],
    "summary" : [ "Me opening the news every fucking morning" ],
    "featured" : [ "https://cdn.bsky.app/img/feed_thumbnail/plain/did:plc:uaeeoakxoukxipbtwptwau5w/bafkreihhjuwgmgbjbgqh32gn2cxzgyfijxwhz4rbxkbvrffnbgaxo4blzu@jpeg" ],
    "url" : [ "https://bsky.app/profile/wryote.bsky.social/post/3lha2kmdzzc2t" ],
    "published" : [ "2025-02-02T22:16:40.657Z" ]
  }
}
