{
  "type" : [ "h-entry" ],
  "properties" : {
    "name" : [ "james is online (@james@strangeobject.space)" ],
    "summary" : [ "What if Canva acquired me? I’ll pay them €100" ],
    "url" : [ "https://strangeobject.space/@james/112161024584779250" ]
  }
}
