{
  "type" : [ "h-entry" ],
  "properties" : {
    "name" : [ "Luis Apiolaza (@ojala@mastodon.nz)" ],
    "summary" : [ "Attached: 1 image" ],
    "featured" : [ "https://mastodon.nz/system/media_attachments/files/111/728/438/318/722/391/original/e23ec06a9584ffc9.png" ],
    "url" : [ "https://mastodon.nz/@ojala/111728441903573356" ]
  }
}
