{
  "type" : [ "h-entry" ],
  "properties" : {
    "name" : [ "Some notes on upgrading Hugo" ],
    "summary" : [ "Some notes on upgrading Hugo" ],
    "author" : [ {
      "type" : [ "h-card" ],
      "properties" : {
        "name" : [ "Julia Evans" ]
      }
    } ],
    "url" : [ "https://jvns.ca/blog/2024/10/07/some-notes-on-upgrading-hugo/" ]
  }
}
