{
  "type" : [ "h-entry" ],
  "properties" : {
    "name" : [ "Open source threaded team chat?! with Alya Abbott, COO at Zulip (Changelog Interviews #607)" ],
    "summary" : [ "We're joined by Alya Abbott from Zulip, the open source, organized, threaded, team chat for distributed teams of all sizes. We talk about Zulip's origins, how it's open source, the way it's led, no VC funding, what makes it different/better, how you can self-host it or use their cloud, moving to Zulip, contributing and..." ],
    "featured" : [ "https://snap.fly.dev/podcast/607/img" ],
    "audio" : [ "https://op3.dev/e/https://cdn.changelog.com/uploads/podcast/607/the-changelog-607.mp3" ],
    "url" : [ "https://changelog.com/podcast/607" ]
  }
}
