{
  "type" : [ "h-entry" ],
  "properties" : {
    "name" : [ "Open Source Ready | Ep. #2, Defining Open Source with Avi Press of Scarf | Heavybit" ],
    "summary" : [ "Brian Douglas and John McBride speak with Avi Press, Founder & CEO of Scarf, about the evolving definition of \"open source\" in the context of AI." ],
    "featured" : [ "https://cdn.sanity.io/images/50q6fr1p/production/e52ffa414dfa5503c8e45c02ad87b0cd1a0360cd-1600x600.jpg?auto=format" ],
    "audio" : [ "https://media.blubrry.com/heavybit/d3aeja1uqhkije.cloudfront.net/podcasts/open-source-ready/20241011-open-source-ready-002.mp3" ],
    "url" : [ "https://www.heavybit.com/library/podcasts/open-source-ready/ep-2-defining-open-source-with-avi-press-of-scarf" ]
  }
}
