{
  "type" : [ "h-entry" ],
  "properties" : {
    "name" : [ "CI/CDagger with Gerhard Lazu (Ship It! #133)" ],
    "summary" : [ "Gerhard Lazu joins the show to discuss how Ship It! started and why you might want a general purpose language for your CI/CD." ],
    "featured" : [ "https://snap.fly.dev/shipit/133/img" ],
    "audio" : [ "https://op3.dev/e/https://cdn.changelog.com/uploads/shipit/133/ship-it-133.mp3" ],
    "url" : [ "https://changelog.com/shipit/133" ]
  }
}
