{
  "type" : [ "h-entry" ],
  "properties" : {
    "name" : [ "GitHub - bradleyfalzon/ghinstallation: HTTP Round Tripper for GitHub Apps - Authenticate as an Installation Workflow" ],
    "summary" : [ "HTTP Round Tripper for GitHub Apps - Authenticate as an Installation Workflow - bradleyfalzon/ghinstallation" ],
    "featured" : [ "https://opengraph.githubassets.com/f7aeaadd4454c5de5949dece40c99220d9ebdd1bb80834becae9b1dfdcba3841/bradleyfalzon/ghinstallation" ],
    "url" : [ "https://github.com/bradleyfalzon/ghinstallation" ]
  }
}
