{
  "type" : [ "h-entry" ],
  "properties" : {
    "name" : [ "Alex Bradbury (@asb@fosstodon.org)" ],
    "summary" : [ "Stick the following in your ~/.gitconfig to make `git branch` sort by most recently committed (thanks to @wingo@mastodon.social for this one!):\n\n[branch]\n  sort = -committerdate" ],
    "url" : [ "https://fosstodon.org/@asb/112659544993354147" ]
  }
}
