{
  "type" : [ "h-entry" ],
  "properties" : {
    "name" : [ "The Business of Open Source | Excellent Open Source User Experiences with Karthik Ranganathan" ],
    "summary" : [ "This week on The Business of Open Source, I spoke with Karthik Ranganathan, founder and co-CEO of Yugabyte. This is the second time Karthik has been on the podcast, but since three years had passed I thought it’d be a good idea to catch up and see what’s changed at Yugabyte and how his..." ],
    "featured" : [ "https://img.transistor.fm/Lb7Bpu3aBT5bp3W_HYHhf1rD6x1UPhXhFzHEBTRywb0/rs:fill:800:800:1/q:60/aHR0cHM6Ly9pbWct/dXBsb2FkLXByb2R1/Y3Rpb24udHJhbnNp/c3Rvci5mbS9zaG93/LzEwNTI5LzE2NTY1/MTIwMDAtYXJ0d29y/ay5qcGc.webp" ],
    "audio" : [ "https://dts.podtrac.com/redirect.mp3/media.transistor.fm/307f0b55/e37059a1.mp3" ],
    "url" : [ "https://share.transistor.fm/s/307f0b55" ]
  }
}
