{
  "type" : [ "h-entry" ],
  "properties" : {
    "name" : [ "Chris Martin (@chris__martin@functional.cafe)" ],
    "summary" : [ "\"why does software require maintenance, it's not like it wears down\"\n\nBecause software is not generally useful for any inherent good; what matters is its relationship with the surrounding context, and that context is in perpetual change." ],
    "url" : [ "https://functional.cafe/@chris__martin/113369395366414375" ]
  }
}
