{
  "type" : [ "h-entry" ],
  "properties" : {
    "name" : [ "kat cosgrove (@kat.lol)" ],
    "summary" : [ "what the hell is a lemon pig and why is everyone talking about it like this is an entirely normal thing that everyone but me has been doing for years" ],
    "url" : [ "https://bsky.app/profile/kat.lol/post/3leoqfcinh22b" ],
    "published" : [ "2025-01-01T14:09:02.048Z" ]
  }
}
