{
  "type" : [ "h-entry" ],
  "properties" : {
    "name" : [ "Anders Eknert (@anderseknert@hachyderm.io)" ],
    "summary" : [ "The corporation behind #Redis is now starting to chase #OpenSource client libraries claiming trademark violations https://github.com/redis-rs/redis-rs/issues/1419 and are attempting to have the projects transferred to them. \n\nIf it wasn't obvious before, now is a good time to fuck the hell off from that software. Just use #Valkey or one of the other alternatives." ],
    "url" : [ "https://hachyderm.io/@anderseknert/113548512606487363" ]
  }
}
