{
  "type" : [ "h-entry" ],
  "properties" : {
    "name" : [ "Anders Eknert (@anderseknert@hachyderm.io)" ],
    "summary" : [ "TFW you find exactly the tool you need for something and it works just like you want. Yay! Today that tool was jwker, which allows quickly turning PEM certs into JSON Web Keys (JWKs).\n\nhttps://github.com/jphastings/jwker/\n\nAnd the author is on hachyderm!  thanks @byjp" ],
    "url" : [ "https://hachyderm.io/@anderseknert/113279361650248960" ]
  }
}
