{
  "type" : [ "h-card" ],
  "properties" : {
    "name" : [ "Mⱺ℠" ],
    "photo" : [ {
      "value" : "https://files.mastodon.social/cache/accounts/avatars/109/304/843/811/906/594/original/b3d5e4f2da0aa247.jpeg",
      "alt" : ""
    } ],
    "url" : [ "https://troet.cafe/@nevali/110016019161198127" ]
  },
  "lang" : "en-GB"
}
