{
  "type" : [ "h-entry" ],
  "properties" : {
    "name" : [ "Introducing incident.io On-call by The Debrief by incident.io " ],
    "summary" : [ "This is on-call as it should be.\nThe secret's out. The world can finally know. \nincident.io On-call is here. \nNaturally, a lot of you may be wondering: why and why now. So to help answer those questions, we sat down with Chris and Pete, two of our co-founders here at incident.io to get a bit of background on this project:\n\n What exactly went into it?\n What were we hoping to solve for?\n How are we addressing the pain points around being on call?\n And most importantly, how are we stacking up against the incumbents in our space? \n\nThis episode will not only get you excited about this huge week, it'll get you pumped for what's ahead for on-call.\nLearn more about on-call here: https://incident.io/oncall" ],
    "featured" : [ "https://d3t3ozftmdmh3i.cloudfront.net/staging/podcast_uploaded_nologo400/32979477/32979477-1706038796074-147e3861c9863.jpg" ],
    "url" : [ "https://podcasters.spotify.com/pod/show/incident-fm/episodes/Introducing-incident-io-On-call-e2glovk" ]
  }
}
