{
  "type" : [ "h-entry" ],
  "properties" : {
    "name" : [ "Biggest Wukong Fan (@destinedone.bsky.social)" ],
    "summary" : [ "For everyone who's noticed the 'sitting on an ice pack' text; refer to this" ],
    "featured" : [ "https://cdn.bsky.app/img/feed_thumbnail/plain/did:plc:ibw5y4qoifztmkw3r7gcxj2b/bafkreih3fn4hme3wqju7eraprhvymxdko2xtteteooqljwtp4x5g2rdcre@jpeg" ],
    "url" : [ "https://bsky.app/profile/destinedone.bsky.social/post/3l6v5bcnzg22r" ],
    "published" : [ "2024-10-19T18:44:16.466Z" ]
  }
}
