{
  "type" : [ "h-entry" ],
  "properties" : {
    "name" : [ "It&#39;s a long &amp; windy road with Shaundai Person at Microsoft Build 2024 (Changelog &amp; Friends #45)" ],
    "summary" : [ "We kick off our Microsoft Build 2024 “coverage” in this free-wheelin’ conversation with our friend, Shaundai Person! We’re talking Netflix infra, we’re talking sales, we’re talking real-world AI usage, we’re talking career choices…. What’s a good next step? Listen in! " ],
    "featured" : [ "https://snap.fly.dev/friends/45/img" ],
    "audio" : [ "https://op3.dev/e/https://cdn.changelog.com/uploads/friends/45/changelog--friends-45.mp3" ],
    "url" : [ "https://changelog.com/friends/45" ]
  }
}
