{
  "type" : [ "h-entry" ],
  "properties" : {
    "name" : [ "Terence Eden (@Edent@mastodon.social)" ],
    "summary" : [ "🆕 blog! “A Cheap and Lazy way to create Mastodon Bots using… BlueSky?!”\n\n\nWith the sad news that BotsIn.Space is closing down, I needed to find a new way to host some of my automated accounts. I didn't want to spin up an entirely new instance, or self-host anything. So here's what I ended up doing. RSS → BlueSky → Bridgy → Mastodon RSS to BlueSky I set […]\n\n👀 Read more: https://shkspr.mobi/blog/2024/11/a-cheap-and-lazy-way-to-create-mastodon-bots-using-bluesky/" ],
    "url" : [ "https://mastodon.social/@Edent/113413384025578152" ]
  }
}
