{
  "type" : [ "h-entry" ],
  "properties" : {
    "name" : [ "jade pixel (@renegadejade@hachyderm.io)" ],
    "summary" : [ "Tired: my lesbian farmer gf\nWired: my crop top" ],
    "url" : [ "https://hachyderm.io/@renegadejade/112378842746073605" ]
  }
}
