{
  "type" : [ "h-entry" ],
  "properties" : {
    "name" : [ "Terence Eden (@Edent@mastodon.social)" ],
    "summary" : [ "\"Less of a question, more of a feature request…\"\n\nOnly at #OggCamp 🤣" ],
    "url" : [ "https://mastodon.social/@Edent/113299634599031494" ]
  }
}
