{
  "type" : [ "h-entry" ],
  "properties" : {
    "name" : [ "ThatSexToyGuy (@hungry_joe@mas.to)" ],
    "summary" : [ "Attached: 1 image\n\ni literally can't open ANY social media in public. THIS IS MY LINKEDIN" ],
    "featured" : [ "https://media.mas.to/media_attachments/files/112/508/594/282/130/570/original/8212da439edf737a.png" ],
    "url" : [ "https://mas.to/@hungry_joe/112508596310507560" ]
  }
}
