{
  "type" : [ "h-entry" ],
  "properties" : {
    "name" : [ "Anders Eknert (@anderseknert@hachyderm.io)" ],
    "summary" : [ "If you’re ever thinking about posting “any updates on this?” in a GitHub issue that hasn’t seen any activity in years: there aren’t any updates on this." ],
    "url" : [ "https://hachyderm.io/@anderseknert/112546053550159669" ]
  }
}
