{
  "type" : [ "h-entry" ],
  "properties" : {
    "name" : [ "ThatSexToyGuy (@hungry_joe@mas.to)" ],
    "summary" : [ "im not sure who to vote for, if only there was a candidate i could be absolutely certain had run through a field of wheat" ],
    "url" : [ "https://mas.to/@hungry_joe/112727878400462681" ]
  }
}
