{
  "type" : [ "h-entry" ],
  "properties" : {
    "name" : [ "Marcus Noble (@Marcus@k8s.social)" ],
    "summary" : [ "I think I'm at the point where Spotify is no longer worth it for me. \nTheir in-app adds for concerts I'm not interested in, their removal of playlist radio (that I used to find new music) and their flood of AI enshittification has made the service not worth the money.\n\nWhat does everyone else use instead? \nNeeds to have the following:\n* Family support\n* Alexa support\n* Offline playlists\n* Discover new music based on either listening history or playlist / artist\n* Focus on just music" ],
    "url" : [ "https://k8s.social/@Marcus/112229092904610138" ]
  }
}
