{
  "type" : [ "h-entry" ],
  "properties" : {
    "name" : [ "Minimum Wage Clock · Luna’s Blog" ],
    "featured" : [ "https://moonbase.lgbt/blog/minimum-wage-clock/x-meta-opengraph.jpg" ],
    "url" : [ "https://moonbase.lgbt/blog/minimum-wage-clock/" ]
  }
}
