{
  "type" : [ "h-entry" ],
  "properties" : {
    "name" : [ "Cup o' Go | 🐋🐋 Two Orcas swimming in a pod(cast); FDs, Aliases, and more with Maxim Vovshin" ],
    "summary" : [ "Join us at Orca Security! New roles for Go Developers opened, hand in your CV (and tell 'em Shay sent you :) )Backend DeveloperRuntime Security ResearcherAgent DeveloperDevOps EngineerProposals🕸️ cmd/compile: relax wasm/wasm32 function import signature type constraints\"Types\" in the WASM spec🍗..." ],
    "featured" : [ "https://img.transistor.fm/viBzFgOPpNCvRB5mEq0BClMEWHySkoebRaEIerz0mOw/rs:fill:800:800:1/q:60/aHR0cHM6Ly9pbWct/dXBsb2FkLXByb2R1/Y3Rpb24udHJhbnNp/c3Rvci5mbS9zaG93/LzM3ODYyLzE2NzQ0/ODY4OTgtYXJ0d29y/ay5qcGc.webp" ],
    "audio" : [ "https://media.transistor.fm/c25fae36/1e7295c6.mp3" ],
    "url" : [ "https://share.transistor.fm/s/c25fae36" ]
  }
}
