{
  "type" : [ "h-entry" ],
  "properties" : {
    "name" : [ "Ratchet & Clank Rift Apart: Best Settings for Steam Deck" ],
    "summary" : [ "60 FPS in Ratchet and Clank: Rift Apart on Steam Deck? Let's find out and dive into its performance and the best settings." ],
    "featured" : [ "https://overkill.wtf/content/images/2023/07/rachet-clank-rift-apart-steam-deck-review.jpg" ],
    "url" : [ "https://overkill.wtf/ratchet-clank-rift-apart-review-steam-deck-performance-best-settings/" ],
    "published" : [ "2023-09-29T13:33:55.000Z" ]
  }
}
