{
  "type" : [ "h-entry" ],
  "properties" : {
    "name" : [ "yeet" ],
    "featured" : [ "https://yeet.ols.wtf/emu/muscle.png", "https://yeet.ols.wtf/emu/honk.png", "https://yeet.ols.wtf/emu/yeet.png", "https://yeet.ols.wtf/emu/goose.png" ],
    "url" : [ "https://yeet.ols.wtf/u/ols/h/GRrS913J27Wc39wmXK" ]
  }
}
