{
  "type" : [ "h-entry" ],
  "properties" : {
    "name" : [ "Radley Balko (@radleybalko.bsky.social)" ],
    "summary" : [ "“You must give your money to people you find abhorrent or we will put you in prison” is a banger of a free speech policy. Fuck these people." ],
    "featured" : [ "https://cdn.bsky.app/img/feed_thumbnail/plain/did:plc:c7ozmxoc5b2ky4iam2o36uic/bafkreic2nntz7iu35hfg4ldnggl6en3bbfxcwjgubatkssn2hynowqd4ia@jpeg" ],
    "url" : [ "https://bsky.app/profile/radleybalko.bsky.social/post/3lai5dptnor2i" ],
    "published" : [ "2024-11-09T01:31:24.486Z" ]
  }
}
