{
  "type" : [ "h-entry" ],
  "properties" : {
    "name" : [ "Taylor Barnett-Torabi (@taylor_atx@hachyderm.io)" ],
    "summary" : [ "I've been laid off once before in 2017 but this time has been such a different experience that I honestly don’t wish this on even some of my enemies. \n\nBut also, I feel like I'm doing pretty okay given the circumstances, which feels like I have reached some new level of maturing." ],
    "url" : [ "https://hachyderm.io/@taylor_atx/112066156075866561" ]
  }
}
