{
  "type" : [ "h-entry" ],
  "properties" : {
    "name" : [ "jacoBOOian 👻 (@jacob@jacobian.org)" ],
    "summary" : [ "Attached: 1 image\n\nI’m very tempted to make a “dropout without context” bot, starting with this #dropout #makesomenoise" ],
    "featured" : [ "https://cdn.masto.host/socialjacobianorg/media_attachments/files/113/473/866/775/452/500/original/fb2e30bd45e68668.png" ],
    "url" : [ "https://social.jacobian.org/@jacob/113473867087224307" ]
  }
}
