{
  "type" : [ "h-entry" ],
  "properties" : {
    "name" : [ "GitHub - astefanutti/decktape: PDF exporter for HTML presentations" ],
    "summary" : [ "PDF exporter for HTML presentations. Contribute to astefanutti/decktape development by creating an account on GitHub." ],
    "featured" : [ "https://opengraph.githubassets.com/61eec1ea9753913d570884e8fc4acfe4ac8589c41284c97904cb8a96d1f9bbe2/astefanutti/decktape" ],
    "url" : [ "https://github.com/astefanutti/decktape" ]
  }
}
