{
  "type" : [ "h-entry" ],
  "properties" : {
    "name" : [ "Marcus Noble (@averagemarcus.bsky.social)" ],
    "summary" : [ "✨ INSOMNIA ✨" ],
    "url" : [ "https://bsky.app/profile/averagemarcus.bsky.social/post/3lfqtgciqx22r" ],
    "published" : [ "2025-01-15T03:33:50.251Z" ]
  }
}
