{
  "type" : [ "h-entry" ],
  "properties" : {
    "name" : [ "Anders Eknert (@anderseknert@hachyderm.io)" ],
    "summary" : [ "@www.jvt.me@www.jvt.me Of course! And fixing it means you'll see a nil dereference cause panic at runtime. But who cares about *that*." ],
    "url" : [ "https://hachyderm.io/@anderseknert/113237704317762049" ]
  }
}
