{
  "type" : [ "h-entry" ],
  "properties" : {
    "name" : [ "The Business of Open Source | Understanding the Legal Side of Open Source with Heather Meeker" ],
    "summary" : [ "Heather Meeker, General Partner at OSS Capital, joins me to discuss the legal elements of open source, including options for licensing and business structure." ],
    "featured" : [ "https://img.transistor.fm/Lb7Bpu3aBT5bp3W_HYHhf1rD6x1UPhXhFzHEBTRywb0/rs:fill:800:800:1/q:60/aHR0cHM6Ly9pbWct/dXBsb2FkLXByb2R1/Y3Rpb24udHJhbnNp/c3Rvci5mbS9zaG93/LzEwNTI5LzE2NTY1/MTIwMDAtYXJ0d29y/ay5qcGc.webp" ],
    "audio" : [ "https://dts.podtrac.com/redirect.mp3/media.transistor.fm/bace8502/11fd1f31.mp3" ],
    "url" : [ "https://share.transistor.fm/s/bace8502" ]
  }
}
