{
  "type" : [ "h-entry" ],
  "properties" : {
    "name" : [ "Michael Beckwith - Cabin boy☠️ (@tw2113.bsky.social)" ],
    "summary" : [ "Only a few remember the legend that is Dr. Ján Ïtor" ],
    "url" : [ "https://bsky.app/profile/tw2113.bsky.social/post/3lekf7sxlus2i" ],
    "published" : [ "2024-12-30T20:38:29.869Z" ]
  }
}
