{
  "type" : [ "h-card" ],
  "properties" : {
    "name" : [ "Simon Wood" ],
    "photo" : [ {
      "value" : "https://files.mastodon.social/accounts/avatars/000/014/825/original/Avatar-640x480.jpg",
      "alt" : ""
    } ],
    "url" : [ "https://mastodon.social/@simonwood/113674071253242918" ]
  },
  "lang" : "en-GB"
}
