{
  "type" : [ "h-entry" ],
  "properties" : {
    "name" : [ "Riker Googling (@RikerGoogling@botsin.space)" ],
    "summary" : [ "how to install bisexual lighting" ],
    "url" : [ "https://botsin.space/@RikerGoogling/113052598507295543" ]
  }
}
