{
  "type" : [ "h-entry" ],
  "properties" : {
    "name" : [ "Kat Marchán 🐈 (@zkat@toot.cat)" ],
    "summary" : [ "the layoffs will continue until ~morale~unionization improves" ],
    "url" : [ "https://toot.cat/@zkat/111739428748567087" ]
  }
}
