{
  "type" : [ "h-entry" ],
  "properties" : {
    "name" : [ "13% of the time, Devin works every time (JS Party #317)" ],
    "summary" : [ "Jerod, KBall &amp;amp; Nick discuss the latest news: Devin, Astro DB, The JavaScript Registry, Tailwind 4 &amp;amp; Angular merging with Wiz. Oh, and a surprise mini-game of HeadLIES! " ],
    "featured" : [ "https://cdn.changelog.com/static/images/share/twitter-jsparty-da8b18a62e1b0a5cf593f5ec9ef3b021.png" ],
    "audio" : [ "https://op3.dev/e/https://cdn.changelog.com/uploads/jsparty/317/js-party-317.mp3" ],
    "url" : [ "https://changelog.com/jsparty/317" ]
  }
}
