{
  "type" : [ "h-entry" ],
  "properties" : {
    "name" : [ "Yogthos (@yogthos@mas.to)" ],
    "summary" : [ "Attached: 1 image" ],
    "featured" : [ "https://media.mas.to/masto-public/media_attachments/files/111/754/817/936/416/894/original/d2d7a2830656a243.png" ],
    "url" : [ "https://mas.to/@yogthos/111754824856293554" ]
  }
}
