{
  "type" : [ "h-card" ],
  "properties" : {
    "name" : [ "Karl Matthias" ],
    "note" : [ "Member of Technical Staff at Mozi. Co-Author of “Docker: Up and Running” from O’Reilly Media" ],
    "locality" : [ "Dublin, Ireland" ],
    "photo" : [ {
      "value" : "https://relistan.com/images/bio-photo.png",
      "alt" : "Karl Matthias"
    } ],
    "url" : [ "https://relistan.com/" ]
  },
  "lang" : "en-US"
}
