{
  "type" : [ "h-entry" ],
  "properties" : {
    "name" : [ "stage7 :windmillTrans: (@stage7@owo.cafe)" ],
    "summary" : [ "Adjunto: 1 imagen\n\nSTOP DOING FEDIVERSE LOGOS\n\n#FediLogo" ],
    "featured" : [ "https://cdn.owo.cafe/media_attachments/files/113/034/394/564/337/899/original/a1b54e69623e79ec.png" ],
    "url" : [ "https://owo.cafe/@stage7/113034396992621267" ]
  }
}
