{
  "type" : [ "h-entry" ],
  "properties" : {
    "name" : [ "Post by Irenes (many), @ireneista@irenes.space" ],
    "summary" : [ "@rangaku@tech.lgbt if they have filesystem clutter we'll take some" ],
    "featured" : [ "https://adhd.irenes.space/fileserver/01M07AXAZZVCTA7V8C9H0Y2Y0D/attachment/original/01HWPGB9F7G1HJ9VAE8KCGEEM0.jpg" ],
    "url" : [ "https://adhd.irenes.space/@ireneista/statuses/01HZ21Y7BPYY3HAVRGJXAJZ9AQ" ]
  }
}
