{
  "type" : [ "h-entry" ],
  "properties" : {
    "name" : [ "Lesley Carhart :unverified: (@hacks4pancakes@infosec.exchange)" ],
    "summary" : [ "Attached: 1 image\n\nI don’t know who to credit for this because it’s been stolen so much, but I love it." ],
    "featured" : [ "https://media.infosec.exchange/infosec.exchange/media_attachments/files/112/621/957/759/574/610/original/36d6a244abee0ef9.jpeg" ],
    "url" : [ "https://infosec.exchange/@hacks4pancakes/112621958019048075" ]
  }
}
