{
  "type" : [ "h-entry" ],
  "properties" : {
    "name" : [ "kf (@kf@666.glitchwit.ch)" ],
    "summary" : [ "someone once described my gender as “whatever makes cis men the most uncomfortable” and that’s really feeling true for me this week 😂🙈" ],
    "url" : [ "https://666.glitchwit.ch/@kf/112367243327632724" ]
  }
}
