{
  "type" : [ "h-entry" ],
  "properties" : {
    "name" : [ "Molly White (@molly0xfff@hachyderm.io)" ],
    "summary" : [ "fuck i love blogs. if i had nothing but time i would just read blogs all day." ],
    "url" : [ "https://hachyderm.io/@molly0xfff/111908268704676868" ]
  }
}
