{
  "type" : [ "h-entry" ],
  "properties" : {
    "name" : [ "Phil Sturgeon (@Philsturgeon@mastodon.green)" ],
    "summary" : [ "AI, taking complex topics and fucking them up, giving people bad information that’ll get them killed, all for the low low price of more energy and water than we have to spare. This is such a waste of time.  https://mastodon.social/@emanuelmaiberg/113192736734791060" ],
    "url" : [ "https://mastodon.green/@Philsturgeon/113193079880203470" ]
  }
}
