{
  "type" : [ "h-entry" ],
  "properties" : {
    "name" : [ "Chris Fletch :pentagram: (@HailsandAles@metalhead.club)" ],
    "summary" : [ "Think we are more in need of a New Years Revolution am I right" ],
    "url" : [ "https://metalhead.club/@HailsandAles/111677025188590673" ]
  }
}
