{
  "type" : [ "h-entry" ],
  "properties" : {
    "name" : [ "Cup o' Go | 🆕 Most of what you need to know about Go 1.22" ],
    "summary" : [ "New releases♬ Go 1.21.7 and 1.20.14 released🧹 golangci-lint 1.56.1 released, including support for `--show-stats` and John's bugfixConferences and Meetups🇮🇱 Go Israel March 2024 hosted by Orca SecurityGo 1.22 Feature RundownOfficial announcement, release notes, and download linkCool interactive..." ],
    "featured" : [ "https://images.transistor.fm/images/episode/1725131/medium_1707470379-artwork.jpg" ],
    "audio" : [ "https://media.transistor.fm/7fdfd92d/f3c11f9f.mp3" ],
    "url" : [ "https://share.transistor.fm/s/7fdfd92d" ]
  }
}
