{
  "type" : [ "h-entry" ],
  "properties" : {
    "name" : [ "Luis Villa (@luis_in_brief@social.coop)" ],
    "summary" : [ "Attached: 1 image\n\n:blobhyperthink:" ],
    "featured" : [ "https://social-coop-media.ams3.cdn.digitaloceanspaces.com/media_attachments/files/111/819/092/275/482/554/original/691da558a2068805.png" ],
    "url" : [ "https://social.coop/@luis_in_brief/111819092436824274" ]
  }
}
