{
  "type" : [ "h-entry" ],
  "properties" : {
    "name" : [ "Simon Willison (@simon@simonwillison.net)" ],
    "summary" : [ "Attached: 1 image\n\nAnyone else spend way too much time thinking about the grammar of linking to things?\n\nIn this fragment I'm not at all confident about the \"backs up that data\" link, maybe I should have included \"as JSON\" in that link...\n\nAnyone seen a comprehensive style guide that addresses this?\n\nExtract from https://simonwillison.net/2024/Jun/21/search-based-rag/#ingredients-for-rag" ],
    "featured" : [ "https://cdn.masto.host/fedisimonwillisonnet/media_attachments/files/112/657/927/145/698/410/original/266a67593b28a274.jpeg" ],
    "url" : [ "https://fedi.simonwillison.net/@simon/112657927527940565" ]
  }
}
