{
  "type" : [ "h-entry" ],
  "properties" : {
    "name" : [ "Cup o' Go | This just in! When is a constructor that returns an interface appropriate? 🤔" ],
    "summary" : [ "Upcoming conferences🇯🇵 June 8: Go Conference 2024 @ Tokyo, Japan🇩🇪 June 17-20: GopherCon EU @ Berlin, Germany🇳🇱 June 19-21: DevOps Days @ Amsterdam, Netherlands🇷🇺 June 24-25: Golang Conf 2024 @ St. Petersburg, RussiaProposals👍 Accepted: go telemetry subcommandPrevious discussion on Episode 62⛔..." ],
    "featured" : [ "https://img.transistor.fm/viBzFgOPpNCvRB5mEq0BClMEWHySkoebRaEIerz0mOw/rs:fill:800:800:1/q:60/aHR0cHM6Ly9pbWct/dXBsb2FkLXByb2R1/Y3Rpb24udHJhbnNp/c3Rvci5mbS9zaG93/LzM3ODYyLzE2NzQ0/ODY4OTgtYXJ0d29y/ay5qcGc.webp" ],
    "audio" : [ "https://media.transistor.fm/360369f1/e930466e.mp3" ],
    "url" : [ "https://share.transistor.fm/s/360369f1" ]
  }
}
