{
  "type" : [ "h-entry" ],
  "properties" : {
    "name" : [ "Baldur Bjarnason (@baldur@toot.cafe)" ],
    "summary" : [ "JFC, people in tech are really out there saying that language models will be better at therapy, financial advice, and career advice than trained people.\n\nWTF is wrong with you people? Do you really have no clue about what other people’s jobs actually involve?\n\nLanguage models can’t even do maths how are they supposed to get good at financial advice?\n\nAnd therapy? Just… 😑\n\nWhat’s wrong with people in tech?" ],
    "url" : [ "https://toot.cafe/@baldur/112031199817039932" ]
  }
}
