{
  "type" : [ "h-entry" ],
  "properties" : {
    "name" : [ "Conrad Irwin (@conradirwin.bsky.social)" ],
    "summary" : [ "https://www.jvt.me/posts/2025/01/27/go-tools-124/\n\nSuper happy to see this headline :D" ],
    "url" : [ "https://bsky.app/profile/conradirwin.bsky.social/post/3lgr2av6rpk2h" ],
    "published" : [ "2025-01-27T23:01:17.951Z" ]
  }
}
