{
  "type" : [ "h-entry" ],
  "properties" : {
    "name" : [ "Hynek Schlawack (@hynek@mastodon.social)" ],
    "summary" : [ "I know nobody wants to admit it, but security shit shows like heartbleed, log4shell, or xzgate are kinda exciting times to live thru. 🤓 \n\nAlso I’m afraid it’s the only way to prove the problems we’ve been droning about for years are real and not made up by greedy maintainers." ],
    "url" : [ "https://mastodon.social/@hynek/112183107211631554" ]
  }
}
