{
  "type" : [ "h-entry" ],
  "properties" : {
    "name" : [ "The Business of Open Source | Nailing Customer Acquisition with Patrick Backman of MariaDB and OpenOcean " ],
    "summary" : [ "This week, I had a dilemma: should I prioritize the episode where I spoke with one of the MariaDB co-founders, in which we discuss setting up a foundation as a way to ensure that the project continues to be open source in the future, no matter what (relevant given the Redis announcement); or..." ],
    "featured" : [ "https://img.transistor.fm/Lb7Bpu3aBT5bp3W_HYHhf1rD6x1UPhXhFzHEBTRywb0/rs:fill:800:800:1/q:60/aHR0cHM6Ly9pbWct/dXBsb2FkLXByb2R1/Y3Rpb24udHJhbnNp/c3Rvci5mbS9zaG93/LzEwNTI5LzE2NTY1/MTIwMDAtYXJ0d29y/ay5qcGc.webp" ],
    "audio" : [ "https://dts.podtrac.com/redirect.mp3/media.transistor.fm/1c7246f8/0a495dce.mp3" ],
    "url" : [ "https://share.transistor.fm/s/1c7246f8" ]
  }
}
