{
  "type" : [ "h-entry" ],
  "properties" : {
    "name" : [ "\"Help, I see a problem and no one is prioritizing it!\" | nicole@web" ],
    "url" : [ "https://ntietz.com/blog/advice-if-problem-not-prioritized/" ]
  }
}
