{
  "type" : [ "h-entry" ],
  "properties" : {
    "name" : [ "Aral Balkan (@aral@mastodon.ar.al)" ],
    "summary" : [ "Opposing genocide isn’t antisemitic.\n\nSaying that opposing genocide is antisemitic is antisemitic.\n\nYou know what’s inhumane? Genocide. You know who’s committing genocide? Israel.\n\nYou have zero moral standing to assess me. Those who commit and are complicit in genocide never do.\n\nSo yes, most definitely, goodbye.\n\n#israel #palestine #gaza #apartheid #ethnicCleansing #genocide https://digitalcourage.social/@sl007/112268942430540187" ],
    "url" : [ "https://mastodon.ar.al/@aral/112269013504313369" ]
  }
}
