{
  "type" : [ "h-entry" ],
  "properties" : {
    "name" : [ "Ian Smith (@IanDSmith@mas.to)" ],
    "summary" : [ "Attached: 1 image" ],
    "featured" : [ "https://media.mas.to/media_attachments/files/112/307/669/078/493/261/original/91c1fb4dd969689e.jpg" ],
    "url" : [ "https://mas.to/@IanDSmith/112307669830551281" ]
  }
}
