{
  "type" : [ "h-entry" ],
  "properties" : {
    "name" : [ " Chris's Wiki :: blog/programming/Go123LinknameComingProblem " ],
    "url" : [ "https://utcc.utoronto.ca/~cks/space/blog/programming/Go123LinknameComingProblem" ]
  }
}
