{
  "type" : [ "h-entry" ],
  "properties" : {
    "name" : [ "Terence Eden (@Edent@mastodon.social)" ],
    "summary" : [ "One of the things I like about #BSky is that handles can be plain URls.\n\nSo there I am @ edent.tel\n\nI appreciate that isn't the model here, for historic reasons. And not everyone can afford a domain name. But it is a powerful concept." ],
    "url" : [ "https://mastodon.social/@Edent/112978929207237981" ]
  }
}
