{
  "type" : [ "h-entry" ],
  "properties" : {
    "name" : [ "Taylor Barnett-Torabi (@taylor_atx@hachyderm.io)" ],
    "summary" : [ "don’t mind me, just looking at messages from former co-workers from across the company saying nice things and sobbing about it on a plane 😭" ],
    "url" : [ "https://hachyderm.io/@taylor_atx/112050824040957738" ]
  }
}
