{
  "type" : [ "h-entry" ],
  "properties" : {
    "name" : [ "Vincent Tunru (@VincentTunru@fosstodon.org)" ],
    "summary" : [ "It's hard to see why \"clean\" Git commits are useful if you've never done a good `git blame` or `git bisect`.\n\nIt's also hard to see how useful `git blame` and `git bisect` can be if your Git commits are a mess.\n\nNot sure where I'm going with this.\n\n#git" ],
    "url" : [ "https://fosstodon.org/@VincentTunru/111821549457747607" ]
  }
}
