{
  "type" : [ "h-entry" ],
  "properties" : {
    "name" : [ "Nick @ The Linux Experiment (@thelinuxEXP@mastodon.social)" ],
    "summary" : [ "Did MKBHD ruin an AI company and their product because of their negative review of it?\n\nNo, the bad AI product ruined itself and its company. Just because someone created a business, found funding and created a thing doesn’t mean they should get instant recognition, and a pass for crappy stuff.\n\nEntrepreneurs aren’t your friends, they aren’t superior, they don’t deserve to be coddled. When they make sh*t products, they should be told that they made sh*t. MKBHD did their job." ],
    "url" : [ "https://mastodon.social/@thelinuxEXP/112290831801665788" ]
  }
}
