{
  "type" : [ "h-entry" ],
  "properties" : {
    "name" : [ "Moonlight Rambler (@moonlight_rambler@girlcock.club)" ],
    "summary" : [ "Attached: 1 image" ],
    "featured" : [ "https://media.girlcock.club/girlcockclubbucket/media_attachments/files/112/266/717/031/434/444/original/d740bac227d2ee46.png" ],
    "url" : [ "https://girlcock.club/@moonlight_rambler/112266719538169883" ]
  }
}
