{
  "type" : [ "h-card" ],
  "properties" : {
    "name" : [ "Evan Boehs" ],
    "country-name" : [ "United States" ],
    "url" : [ "https://boehs.org" ],
    "key" : [ "https://boehs.org/key.pub" ],
    "email" : [ "mailto:evan@mylastname.org" ],
    "photo" : [ {
      "value" : "https://github.com/boehs.png",
      "alt" : "A drawing of an astronaut in space"
    } ]
  },
  "lang" : "en"
}
