{
  "type" : [ "h-entry" ],
  "properties" : {
    "name" : [ "Dear new developer with Dan Moore, author of &#39;Letters to a New Developer&#39; (Changelog Interviews #572)" ],
    "summary" : [ "Hello 2024! We’re kicking off the year with Dan Moore, author of ‘Letters to a New Developer’ — a blog series of letters of what Dan wished he had known when starting his developer career. We discuss the value of online communities for new developers, the importance of communication skills, and the need to stay relevan..." ],
    "featured" : [ "https://cdn.changelog.com/static/images/share/twitter-podcast-0fed02e920a2ff887b9c8ccac88925e1.png" ],
    "audio" : [ "https://op3.dev/e/https://cdn.changelog.com/uploads/podcast/572/the-changelog-572.mp3" ],
    "url" : [ "https://changelog.com/podcast/572" ]
  }
}
