{
  "type" : [ "h-entry" ],
  "properties" : {
    "name" : [ "The Business of Open Source | ATO Special Episode with Tatiana Krupenya of DBeaver" ],
    "summary" : [ "This special episode of The Business of Open Source with Tatiana Krupenya, CEO of DBeaver, was recorded on site at All Things Open 2024. It’s a short conversation, so we addressed one main question: What is the difference between running an open source company versus as proprietary software..." ],
    "featured" : [ "https://img.transistor.fm/Lb7Bpu3aBT5bp3W_HYHhf1rD6x1UPhXhFzHEBTRywb0/rs:fill:800:800:1/q:60/aHR0cHM6Ly9pbWct/dXBsb2FkLXByb2R1/Y3Rpb24udHJhbnNp/c3Rvci5mbS9zaG93/LzEwNTI5LzE2NTY1/MTIwMDAtYXJ0d29y/ay5qcGc.webp" ],
    "audio" : [ "https://dts.podtrac.com/redirect.mp3/media.transistor.fm/981148e4/f700bf8b.mp3" ],
    "url" : [ "https://share.transistor.fm/s/981148e4" ]
  }
}
