{
  "type" : [ "h-entry" ],
  "properties" : {
    "name" : [ "Alex Plante 🐀👑 (@aplante.com)" ],
    "summary" : [ "lemon pig of 2024 before and after absorbing all my bad luck over the calendar year like a fucked up little yellow dorian grey. it is nearly time to rest, my faithful child." ],
    "featured" : [ "https://cdn.bsky.app/img/feed_thumbnail/plain/did:plc:rd3qfi4wgintxoldjqkjtjty/bafkreicq3xbudxh5qms4ggc5t7j4spehgn573qylxut7iygdqofhr3ipk4@jpeg" ],
    "url" : [ "https://bsky.app/profile/aplante.com/post/3len4c3t6js2b" ],
    "published" : [ "2024-12-31T22:36:49.251Z" ]
  }
}
