{
  "type" : [ "h-entry" ],
  "properties" : {
    "name" : [ "ThatSexToyGuy (@hungry_joe@mas.to)" ],
    "summary" : [ "Attached: 1 image\n\nPUT MY THINGS INTO POCKETS\nTHESE ARE MY CARGO SHORTS\nLIBERATION\nNO THIEVING\nDONT GIVE A FUCK IF MY WIFE IS LEAVING" ],
    "featured" : [ "https://media.mas.to/media_attachments/files/112/128/367/806/781/402/original/e255d6ec5b426611.png" ],
    "url" : [ "https://mas.to/@hungry_joe/112128368451809052" ]
  }
}
