{
  "type" : [ "h-entry" ],
  "properties" : {
    "name" : [ "Josh Simmons (@josh@josh.tel)" ],
    "summary" : [ "I get #Kagi relying on sources that don't share my values. Nothing in our societal order is uncompromised.\n\nBut calling gay rights political is a dog whistle that I hear loud and clear. There's no world in which I directly pay money into that kind of leadership.\n\nOn to the next..." ],
    "url" : [ "https://josh.tel/@josh/111710906875420044" ]
  }
}
