{
  "type" : [ "h-entry" ],
  "properties" : {
    "name" : [ "*IRL & ONLINE* Well Architected?, Tue, May 28, 2024, 6:30 PM   | Meetup" ],
    "summary" : [ "**The Talk;**\n\nDuring this talk, Shaun will explain what AWS Well Architected Framework is, recent research he has done on the topic and relate his experience of using the " ],
    "featured" : [ "https://secure.meetupstatic.com/photos/event/3/1/3/e/600_506532606.jpeg" ],
    "url" : [ "https://www.meetup.com/devops-notts/events/300919071/" ]
  }
}
