{
  "type" : [ "h-entry" ],
  "properties" : {
    "name" : [ "pokateo maps 🥔🗺️ (@pokateo@mapstodon.space)" ],
    "summary" : [ "babe are you ok you’ve barely touched your dashboard you specifically asked me to spend a week building" ],
    "url" : [ "https://mapstodon.space/@pokateo/112672899887205343" ]
  }
}
