{
  "type" : [ "h-entry" ],
  "properties" : {
    "name" : [ "0 dependencies!" ],
    "featured" : [ "/ongoing/misc/podcast-default.jpg" ],
    "url" : [ "https://www.tbray.org/ongoing/When/202x/2024/09/04/0dependencies" ]
  }
}
