{
  "type" : [ "h-entry" ],
  "properties" : {
    "name" : [ "Corey Quinn (@Quinnypig@awscommunity.social)" ],
    "summary" : [ "Attached: 1 image\n\nHosting a New Year’s party:" ],
    "featured" : [ "https://cdn.masto.host/awscommunitysocial/media_attachments/files/111/694/120/192/302/325/original/1436f1021bb46f69.jpeg" ],
    "url" : [ "https://awscommunity.social/@Quinnypig/111694120324069151" ]
  }
}
