{
  "type" : [ "h-entry" ],
  "properties" : {
    "name" : [ "Q ✨ (@q@glauca.space)" ],
    "summary" : [ "handing every lesbian a copy of ISO8601 so they can tell what is and isn’t a date" ],
    "url" : [ "https://glauca.space/@q/112382342392231364" ]
  }
}
