{
  "type" : [ "h-entry" ],
  "properties" : {
    "url" : [ "https://www.ciccarello.me/posts/2024/01/11/hpgft/" ],
    "bridgy-fed" : [ "https://fed.brid.gy/" ],
    "published" : [ "2024-01-11T21:51:00Z" ],
    "content" : [ {
      "html" : "<p><em>Wonders what mystery was left unsolved…</em> 🤔</p>",
      "value" : "Wonders what mystery was left unsolved… 🤔",
      "lang" : "en-us"
    } ],
    "in-reply-to" : [ {
      "type" : [ "h-cite" ],
      "properties" : {
        "content" : [ "Sometimes, you have to let a mystery go unsolved." ],
        "url" : [ "https://snarfed.org/2024-01-11_51849" ],
        "author" : [ {
          "type" : [ "h-card" ],
          "properties" : {
            "name" : [ "Ryan Barrett" ],
            "url" : [ "https://snarfed.org/" ]
          },
          "lang" : "en-us",
          "value" : "Ryan Barrett"
        } ]
      },
      "lang" : "en-us",
      "value" : "https://snarfed.org/2024-01-11_51849"
    } ],
    "author" : [ {
      "type" : [ "h-card" ],
      "properties" : {
        "name" : [ "Anthony Ciccarello" ],
        "summary" : [ "I'm a software engineer living in Southern California building cool things using JavaScript and other web technologies. I enjoy traveling to other countries and spending time in nature." ],
        "photo" : [ {
          "value" : "https://secure.gravatar.com/avatar/17d306899b5f20953440eca1d65d34e0?s=512",
          "alt" : ""
        } ],
        "url" : [ "https://www.ciccarello.me/" ]
      },
      "lang" : "en-us",
      "value" : "https://www.ciccarello.me/"
    } ]
  },
  "lang" : "en-us"
}
