{
  "type" : [ "h-entry" ],
  "properties" : {
    "name" : [ "Rob Whitaker (@RobW@iosdev.space)" ],
    "summary" : [ "Is there any evidence that captchas actually work? I suspect they have little to no effect, but this is based on nothing but my personal dislike of them." ],
    "url" : [ "https://iosdev.space/@RobW/111748518246051565" ]
  }
}
