{
  "type" : [ "h-entry" ],
  "properties" : {
    "name" : [ "Rob Whitaker (@RobW@iosdev.space)" ],
    "summary" : [ "Dogs are great ❤️" ],
    "url" : [ "https://iosdev.space/@RobW/112073762786337987" ]
  }
}
