{
  "type" : [ "h-entry" ],
  "properties" : {
    "name" : [ "Making shell history magical with Atuin featuring Ellie Huxtable (Changelog Interviews #579)" ],
    "summary" : [ "Today we speak with Ellie Huxtable, the creator of a magical open source tool for syncing, searching &amp;amp; backing up your shell history. Along the way we learn all about the sync service, why she likes Rust, the branding / marketing of the project, how she quit her job to work on it full time, the business model &amp;amp;..." ],
    "featured" : [ "https://cdn.changelog.com/static/images/share/twitter-podcast-0fed02e920a2ff887b9c8ccac88925e1.png" ],
    "audio" : [ "https://op3.dev/e/https://cdn.changelog.com/uploads/podcast/579/the-changelog-579.mp3" ],
    "url" : [ "https://changelog.com/podcast/579" ]
  }
}
