{
  "type" : [ "h-entry" ],
  "properties" : {
    "name" : [ "Flock of Cats 🐈 🐈 🐈 🦃 (@FlockOfCats@famichiki.jp)" ],
    "summary" : [ "“Wow Bluesky is getting popular! You should sign up!”\n\n“Interesting. Who are all the new users?”\n\n“People who stayed on X for 2 years”\n\n(-_-)" ],
    "url" : [ "https://famichiki.jp/@FlockOfCats/113467948764261348" ]
  }
}
