{
  "type" : [ "h-entry" ],
  "properties" : {
    "summary" : [ "I’ve wondered this same thing. I even tried installing node on one old device. According to some articles it can be done but I ran out of patience." ],
    "url" : [ "https://www.ciccarello.me/posts/2024/01/12/jdzk0/" ],
    "author" : [ "https://www.ciccarello.me/" ],
    "published" : [ "2024-01-12T05:43:00Z" ]
  },
  "lang" : "en-us"
}
