{
  "type" : [ "h-entry" ],
  "properties" : {
    "name" : [ "Terence Eden (@Edent@mastodon.social)" ],
    "summary" : [ "Does your client show the percent encoded link, or the Unicode characters?\n\nhttp://bit.ly/%E2%99%94%E2%99%95%E2%99%96%E2%99%97%E2%99%98%E2%99%99%E2%99%9A%E2%99%9B%E2%99%9C%E2%99%9D%E2%99%9E%E2%99%9F" ],
    "url" : [ "https://mastodon.social/@Edent/111883547743808473" ]
  }
}
