{
  "type" : [ "h-entry" ],
  "properties" : {
    "name" : [ "Anders Eknert (@anderseknert@hachyderm.io)" ],
    "summary" : [ "@www.jvt.me@www.jvt.me same! But any TODO list with over a dozen items is just hugely stressful to me 😅" ],
    "url" : [ "https://hachyderm.io/@anderseknert/112066293165810926" ]
  }
}
