{
  "type" : [ "h-entry" ],
  "properties" : {
    "name" : [ "Chris \"Not So\" Short 🇺🇦 (@ChrisShort@hachyderm.io)" ],
    "summary" : [ "Suggested Read: Are you worried about OSS maintainer burnout? | Creating a more sustainable model for `oapi-codegen` in the future · Jamie Tanna | Software Engineer https://www.jvt.me/posts/2024/05/09/oapi-codegen-sustainable/  #devopsish" ],
    "url" : [ "https://hachyderm.io/@ChrisShort/112434323181776667" ]
  }
}
