{
  "type" : [ "h-card" ],
  "properties" : {
    "name" : [ "Karl Turner" ],
    "photo" : [ {
      "value" : "https://cdn.bsky.app/img/avatar/plain/did:plc:zaqzosekkc5mrgewbtp6zwpz/bafkreidmo4p2n2af3vatbvlvasj4zicpdlfd3vcojoubgeqc3rwefjxvmu@jpeg",
      "alt" : ""
    } ],
    "url" : [ "https://bsky.app/profile/usefulwords.bsky.social/post/3ldll5guiis2u" ]
  },
  "lang" : "en-GB"
}
