{
  "type" : [ "h-entry" ],
  "properties" : {
    "name" : [ "Amy Hoy (@amyhoy.bsky.social)" ],
    "summary" : [ "i’ve often had men and women who had more power than me in a situation come up to me after i said the shit that had to be said and thank me \n\nand i hope you know i hold you in all in deep contempt\n\n[contains quote post or other embedded content]" ],
    "url" : [ "https://bsky.app/profile/amyhoy.bsky.social/post/3lfikf2cbkg2a" ],
    "published" : [ "2025-01-11T20:30:45.954Z" ]
  }
}
