{
  "type" : [ "h-entry" ],
  "properties" : {
    "name" : [ "kf (@kf@666.glitchwit.ch)" ],
    "summary" : [ "today my therapist tried to help me brainstorm potential personal interests, because I said I'm doing nothing because I did it all when I was manic\n\nhe said music, and I told him about how I play the electric guitar, got into synths, and worked for a music production company\n\nhe said school, and I told him I have three degrees already\n\nand on and on\n\neventually he said \"maybe you just like trains or something\" and I started showing him photos of all my train trips\n\nhe was like 😩" ],
    "url" : [ "https://666.glitchwit.ch/@kf/112413694970870673" ]
  }
}
