{
  "type" : [ "h-entry" ],
  "properties" : {
    "name" : [ "Miriam (still) (@mia@front-end.social)" ],
    "summary" : [ "We need unions. \n\nAnd we also need employee-owned collectives that reject eternal growth, increased production, and shareholder profit as the goals of our labor.\n\nThe infinite growth model is destroying our world. We can build alternatives." ],
    "url" : [ "https://front-end.social/@mia/112462843203583046" ]
  }
}
