{
  "type" : [ "h-entry" ],
  "properties" : {
    "name" : [ "Qasim Rashid, Esq. (@qasimrashid.com)" ],
    "summary" : [ "UnitedHealth CEO was killed 30 days ago on December 4. Luigi is now on trial\n\nLancet reports that USA’s exploitative health system enables 68K preventable deaths ANNUALLY. 5589 Americans have died under this system since December 4. So—when do the CEOs who knowingly enabled these deaths go on trial?" ],
    "url" : [ "https://bsky.app/profile/qasimrashid.com/post/3lesuhmbjjk2v" ],
    "published" : [ "2025-01-03T05:32:35.148Z" ]
  }
}
