{
  "type" : [ "h-entry" ],
  "properties" : {
    "name" : [ "patter (@patterfloof@meow.social)" ],
    "summary" : [ "@HiroRwar@gulp.cafe I like the explanation I've often seen alongside this pic\n\nIt's pretty much the first time cameras reached this village & there wasn't a culture on how to pose for portraits & photos. They asked him to pose & without all the European background, that's the pose he chose" ],
    "url" : [ "https://meow.social/@patterfloof/111857880773448121" ]
  }
}
