{
  "type" : [ "h-entry" ],
  "properties" : {
    "name" : [ "Sophie (@sophie@social.lol)" ],
    "summary" : [ "I'm so tired of seeing \"LFG\" everywhere that I have now decided it stands for \"lookin' fresh, girlies\" and that makes me feel better about it" ],
    "url" : [ "https://social.lol/@sophie/112410052808906648" ]
  }
}
