{
  "type" : [ "h-entry" ],
  "properties" : {
    "name" : [ "Terence Eden (@Edent@mastodon.social)" ],
    "summary" : [ "Do you find yourself exaggerating your emotional responses when you know you're being watched?\n\nWould you like your phone's selfie-camera to record your face when you receive a message so it can automatically reply 😄, 😢, or 😯?\n\nBlog post: https://shkspr.mobi/blog/2020/10/performative-emotions/" ],
    "url" : [ "https://mastodon.social/@Edent/113253617158770664" ]
  }
}
