{
  "type" : [ "h-entry" ],
  "properties" : {
    "name" : [ "Cup o' Go | One and two and three and four and proposals!" ],
    "summary" : [ "Go 1.23.4 and 1.22.10 releasedProposalsAccepted & implemented: testing: shuffle seed should be different when -shuffle=on and -count flag is setCLNew: cmd/vet: add check for sync.WaitGroup abuseAccepted: cmd/vet: warn about structs marked json omitemptyNew: runtime/mainthread: add mainthread.Do..." ],
    "featured" : [ "https://img.transistor.fm/viBzFgOPpNCvRB5mEq0BClMEWHySkoebRaEIerz0mOw/rs:fill:800:800:1/q:60/aHR0cHM6Ly9pbWct/dXBsb2FkLXByb2R1/Y3Rpb24udHJhbnNp/c3Rvci5mbS9zaG93/LzM3ODYyLzE2NzQ0/ODY4OTgtYXJ0d29y/ay5qcGc.webp" ],
    "audio" : [ "https://media.transistor.fm/a1cf7114/1e369613.mp3" ],
    "url" : [ "https://share.transistor.fm/s/a1cf7114" ]
  }
}
