{
  "type" : [ "h-card" ],
  "properties" : {
    "name" : [ "diapolical" ],
    "photo" : [ {
      "value" : "https://secure.gravatar.com/avatar/908c7ebc02f473c209d9a4b0c2bc013c?s=44&d=mm&r=g",
      "alt" : ""
    } ],
    "url" : [ "http://diapolical.com" ]
  },
  "lang" : "en-US"
}
