{
  "type" : [ "h-entry" ],
  "properties" : {
    "name" : [ "Shipping in SPAAAACCEEE with Andrew Guenther from Orbital Sidekick (Ship It! #92)" ],
    "summary" : [ "What do you do when your infrastructure runs 1000 miles away and you only have access every 90 minutes? Find out from Andrew Guenther from Orbital Sidekick. " ],
    "featured" : [ "https://cdn.changelog.com/static/images/share/twitter-shipit-feb3710d53361bb8a02164926b99f023.png" ],
    "audio" : [ "https://op3.dev/e/https://cdn.changelog.com/uploads/shipit/92/ship-it-92.mp3" ],
    "url" : [ "https://changelog.com/shipit/92" ]
  }
}
