{
  "type" : [ "h-entry" ],
  "properties" : {
    "name" : [ "Anders Eknert (@anderseknert@hachyderm.io)" ],
    "summary" : [ "While I’m ranting: how the fuck and when did “having to learn something new” become a thing generally accepted as a burden? Getting to learn shit *while getting paid for it* is an enormous fucking privilege of working in tech, and if you can’t recognize and appreciate that, please step aside for someone who does." ],
    "url" : [ "https://hachyderm.io/@anderseknert/112730596014943930" ]
  }
}
