{
  "type" : [ "h-entry" ],
  "properties" : {
    "name" : [ "The Business of Open Source | OSFS Special Episode: Peter Zaitsev Talks Sales " ],
    "summary" : [ "As part of the preparation for Open Source Founders Summit, I’m interviewing both our speakers and our attendees for a special podcast that’s hyper focused on one thing. In this episode I spoke with Peter Zaitsev, founder of Percona, about sales. We talked about the specifics of sales as a..." ],
    "featured" : [ "https://images.transistor.fm/images/episode/1727995/medium_1707731566-artwork.jpg" ],
    "audio" : [ "https://dts.podtrac.com/redirect.mp3/media.transistor.fm/dc85c208/d25a6f9a.mp3" ],
    "url" : [ "https://share.transistor.fm/s/dc85c208" ]
  }
}
