{
  "type" : [ "h-entry" ],
  "properties" : {
    "name" : [ "Run Gleam run with Louis Pilfold (Changelog Interviews #588)" ],
    "summary" : [ "This week we’re joined by Louis Pilfold, the creator of the Gleam programming language. For the uninitiated, Gleam is a functional programming language for building type-safe systems that compiles to Erlang and JavaScript and it’s written in Rust. We discuss the inspiration and development of Gleam, how it compares to ..." ],
    "featured" : [ "https://cdn.changelog.com/static/images/share/twitter-podcast-0fed02e920a2ff887b9c8ccac88925e1.png" ],
    "audio" : [ "https://op3.dev/e/https://cdn.changelog.com/uploads/podcast/588/the-changelog-588.mp3" ],
    "url" : [ "https://changelog.com/podcast/588" ]
  }
}
