{
  "type" : [ "h-entry" ],
  "properties" : {
    "name" : [ " GitHub’s Mike Hanley and Transforming the “Dept. of No” Into the \"Dept. of Yes, And…” - What's in the SOSS? An OpenSSF Podcast" ],
    "summary" : [ "In this episode, Omkhar chats with Mike Hanley, Chief Security Officer and SVP of Engineering at GitHub. Prior to GitHub, Mike was the Vice President of Security at Duo Security, where he built and led the security research, development, and opera..." ],
    "featured" : [ "https://www.buzzsprout.com/rails/active_storage/representations/redirect/eyJfcmFpbHMiOnsibWVzc2FnZSI6IkJBaHBCTVBBc1FZPSIsImV4cCI6bnVsbCwicHVyIjoiYmxvYl9pZCJ9fQ==--0d3dd0b3c05f74d14beb61df34ac9fd21e810649/eyJfcmFpbHMiOnsibWVzc2FnZSI6IkJBaDdDVG9MWm05eWJXRjBPZ2hxY0djNkUzSmxjMmw2WlY5MGIxOW1hV3hzV3docEFmcHBBZnA3QmpvSlkzSnZjRG9MWTJWdWRISmxPZ3B6WVhabGNuc0dPZ3h4ZFdGc2FYUjVhVUU2RUdOdmJHOTFjbk53WVdObFNTSUpjM0puWWdZNkJrVlUiLCJleHAiOm51bGwsInB1ciI6InZhcmlhdGlvbiJ9fQ==--bfdad5b04912fa8a9db85eb3989e46c5908e2723/soss_podcast_icon_3000px.jpg" ],
    "audio" : [ "https://www.buzzsprout.com/2323138/15514775-github-s-mike-hanley-and-transforming-the-dept-of-no-into-the-dept-of-yes-and.mp3?referrer=https%3A%2F%2Fwww.buzzsprout.com%2F2323138%2F15514775-github-s-mike-hanley-and-transforming-the-dept-of-no-into-the-dept-of-yes-and" ],
    "url" : [ "https://www.buzzsprout.com/2323138/15514775-github-s-mike-hanley-and-transforming-the-dept-of-no-into-the-dept-of-yes-and" ]
  }
}
