{
  "type" : [ "h-card" ],
  "properties" : {
    "name" : [ "Geoff" ],
    "photo" : [ {
      "value" : "https://files.mastodon.social/accounts/avatars/000/030/164/original/8951f690ec4d8855.jpg",
      "alt" : ""
    } ],
    "url" : [ "https://mastodon.social/@OpinionatedGeek/111874064763200415" ]
  },
  "lang" : "en-GB"
}
