{
  "type" : [ "h-entry" ],
  "properties" : {
    "name" : [ "The undercover generalist featuring Adolfo Ochagavía (Changelog &amp; Friends #37)" ],
    "summary" : [ "Which is smarter: specializing in a particular tech or becoming more of a generalist? It depends! Which is why Jerod invited “undercover generalist” Adolfo Ochagavía on our “It Depends” series to weigh the pros &amp;amp; cons of each path. " ],
    "featured" : [ "https://cdn.changelog.com/static/images/share/twitter-friends-7fa3c9c5a72765c322b47e92da397fbb.png" ],
    "audio" : [ "https://op3.dev/e/https://cdn.changelog.com/uploads/friends/37/changelog--friends-37.mp3" ],
    "url" : [ "https://changelog.com/friends/37" ]
  }
}
