{
  "type" : [ "h-entry" ],
  "properties" : {
    "name" : [ "Legacy Code Rocks: Quality-Check of External Dependencies with Feross Aboukhadijeh" ],
    "summary" : [ "Many of the largest companies rely on third-party code to run critical parts of their software. However, there's often little focus on ensuring the quality of these external dependencies. Today we speak with Feross Aboukhadijeh, CEO and founder of , a developer-first security platform. Socket helps developers and security teams release software faster and reduce time spent on security busywork. Feross is also a lecturer at Stanford, where he teaches CS233 Web Security. We discuss why the quality of third-party dependencies matters, when to start addressing this issue, how to handle unmaintained dependencies, and what tools are available for managing third-party dependencies. After listening to the episode, be sure to visit the  connect with Feross on , and check out his . Mentioned in this episode: Socket at &nbsp; Feross on X at &nbsp; Feross website at: &nbsp; " ],
    "featured" : [ "http://assets.libsyn.com/show/82186?height=250&width=250&overlay=true" ],
    "audio" : [ "https://traffic.libsyn.com/secure/legacycoderocks/Feross_Aboukhadijeh_MASTER_1.mp3" ],
    "url" : [ "https://legacycoderocks.libsyn.com/quality-check-of-external-dependencies-with-feross-aboukhadijeh" ]
  }
}
