{
  "type" : [ "h-entry" ],
  "properties" : {
    "name" : [ "GitHub - guacsec/guac: GUAC aggregates software security metadata into a high fidelity graph database." ],
    "summary" : [ "GUAC aggregates software security metadata into a high fidelity graph database. - GitHub - guacsec/guac: GUAC aggregates software security metadata into a high fidelity graph database." ],
    "featured" : [ "https://opengraph.githubassets.com/20867349e2880c77cdaec656c67d5206607b5cb4633f1f2aab95c37e431cba81/guacsec/guac" ],
    "url" : [ "https://github.com/guacsec/guac" ]
  }
}
