{
  "type" : [ "h-entry" ],
  "properties" : {
    "name" : [ "Linux distros with Jorge Castro (Ship It! #122)" ],
    "summary" : [ "uBlue is trying to build the world's best Linux experience for developers and gamers. Jorge Castro joins Justin & Autumn to tell us how it's going." ],
    "featured" : [ "https://snap.fly.dev/shipit/122/img" ],
    "audio" : [ "https://op3.dev/e/https://cdn.changelog.com/uploads/shipit/122/ship-it-122.mp3" ],
    "url" : [ "https://changelog.com/shipit/122" ]
  }
}
