{
  "type" : [ "h-entry" ],
  "properties" : {
    "name" : [ "Jeff Atwood (@codinghorror@infosec.exchange)" ],
    "summary" : [ "Depression is when you lose all your enthusiasm for enthusiasm, and you can't even tell." ],
    "url" : [ "https://infosec.exchange/@codinghorror/113025625453727769" ]
  }
}
