{
  "type" : [ "h-entry" ],
  "properties" : {
    "name" : [ "Carol 🪩 (@carol@social.lol)" ],
    "summary" : [ "Catching up on my notes:\n\n📰 Lifenotes #35: October 2023\nhttps://carol.gg/blog/lifenotes-35/" ],
    "url" : [ "https://social.lol/@carol/112350418032472031" ]
  }
}
