{
  "type" : [ "h-entry" ],
  "properties" : {
    "name" : [ "Parsing Protobuf Definitions with Tree-sitter" ],
    "author" : [ {
      "type" : [ "h-card" ],
      "properties" : {
        "name" : [ "Karl Matthias" ]
      }
    } ],
    "url" : [ "https://relistan.com/parsing-protobuf-files-with-treesitter" ],
    "published" : [ "2024-07-20T00:00:00-04:00" ]
  }
}
