{
  "type" : [ "h-entry" ],
  "properties" : {
    "name" : [ "Tim Banks: VibeRel Advocate (@elchefe.me)" ],
    "summary" : [ "So, I just got my first ever lingerie item for myself and suffice it to say that @abgushte.bsky.social is exceedingly pleased with my selection." ],
    "url" : [ "https://bsky.app/profile/elchefe.me/post/3lfv5daxgg22d" ],
    "published" : [ "2025-01-16T20:41:44.048Z" ]
  }
}
