{
  "type" : [ "h-card" ],
  "properties" : {
    "name" : [ "Andy Mabbett" ],
    "photo" : [ {
      "value" : "https://secure.gravatar.com/avatar/4e160e713acf1ab8547d1c36233389c3?s=64&r=x",
      "alt" : ""
    } ],
    "url" : [ "https://pigsonthewing.org.uk" ]
  },
  "lang" : "en-GB"
}
