{
  "type" : [ "h-entry" ],
  "properties" : {
    "name" : [ "Cup o' Go | Don't skip the gym! 🏋️ And interview Alice Merrick, UX researcher on the Go team" ],
    "summary" : [ "📝 Go 1.23: Interactive release notesNew proposalsruntime: add AddCleanup and deprecate SetFinalizer👉 weak: new package providing weak pointers💪 Bufstream enters public betaLightning RoundProfiling in Go: A Practical Guide by Noam YadgarCogent Core initial releaseNew RansomHub Ransomware..." ],
    "featured" : [ "https://img.transistor.fm/viBzFgOPpNCvRB5mEq0BClMEWHySkoebRaEIerz0mOw/rs:fill:800:800:1/q:60/aHR0cHM6Ly9pbWct/dXBsb2FkLXByb2R1/Y3Rpb24udHJhbnNp/c3Rvci5mbS9zaG93/LzM3ODYyLzE2NzQ0/ODY4OTgtYXJ0d29y/ay5qcGc.webp" ],
    "audio" : [ "https://media.transistor.fm/dd2bcc2a/25599ba6.mp3" ],
    "url" : [ "https://share.transistor.fm/s/dd2bcc2a" ]
  }
}
