{
  "type" : [ "h-entry" ],
  "properties" : {
    "name" : [ "How to Win at Micro-SaaS" ],
    "summary" : [ "Dominating a niche" ],
    "featured" : [ "https://substackcdn.com/image/fetch/w_1200,h_600,c_fill,f_jpg,q_auto:good,fl_progressive:steep,g_auto/https%3A%2F%2Fsubstack-post-media.s3.amazonaws.com%2Fpublic%2Fimages%2F4999d354-0441-4cf7-8c16-5019f9880669_1456x816.png" ],
    "author" : [ {
      "type" : [ "h-card" ],
      "properties" : {
        "name" : [ "Nate Ritter" ]
      }
    } ],
    "url" : [ "https://writings.founderlabs.io/p/how-to-win-at-micro-saas" ]
  }
}
