{
  "type" : [ "h-entry" ],
  "properties" : {
    "name" : [ "Cup o' Go | 🧮 Is new math in Go's future? Plus boot.dev update with Lane Wagner" ],
    "summary" : [ "🛡️ Security releasesgolang.org/x/crypto v0.35.0golang.org/x/oauth2 v0.27.0ProposalsAccepted: net/http: support content negotiation🧮 Likely accept: math/stats: new package with Mean, Median, moreConferences🇨🇿 Gophercamp, April 25 @ Brno, Czech RepublicCFP open until ??🇨🇭 Go blog: Faster Go maps..." ],
    "featured" : [ "https://img.transistor.fm/viBzFgOPpNCvRB5mEq0BClMEWHySkoebRaEIerz0mOw/rs:fill:800:800:1/q:60/aHR0cHM6Ly9pbWct/dXBsb2FkLXByb2R1/Y3Rpb24udHJhbnNp/c3Rvci5mbS9zaG93/LzM3ODYyLzE2NzQ0/ODY4OTgtYXJ0d29y/ay5qcGc.webp" ],
    "audio" : [ "https://media.transistor.fm/1b48496b/d797854c.mp3" ],
    "url" : [ "https://share.transistor.fm/s/1b48496b" ]
  }
}
