{
  "type" : [ "h-entry" ],
  "properties" : {
    "url" : [ "https://engineering-founders.simplecast.com/episodes/exploring-the-differences-of-hardware-software-startups-jessie-frazelle-zoo-GSP1e1Xe" ]
  }
}
