{
  "type" : [ "h-entry" ],
  "properties" : {
    "name" : [ "Scaling DevTools | Sagar Batchu - co-founder of Speakeasy" ],
    "summary" : [ "Sagar is the CEO and co-founder of Speakeasy - an API tooling platform. We talk about the journey of Speakeasy. The challenges of startup life. How they developed the product and how they work with..." ],
    "featured" : [ "https://img.transistor.fm/49VLK42XO8lyX5XBr-ReACYZKbEAnSYOEAJcNQjb3F0/aHR0cHM6Ly9pbWct/dXBsb2FkLXByb2R1/Y3Rpb24udHJhbnNp/c3Rvci5mbS9zb2Np/YWxfaW1hZ2VzL3Np/dGUvODg1MC9zY2Fs/aW5nLmpwZWc.jpeg" ],
    "audio" : [ "https://media.transistor.fm/4ae7ccb5/7045d20c.mp3?src=site" ],
    "url" : [ "https://podcast.scalingdevtools.com/episodes/sagar-batchu-co-founder-of-speakeasy" ]
  }
}
