{
  "type" : [ "h-entry" ],
  "properties" : {
    "name" : [ "iamcanehdian :mstdn: (@iamcanehdian@mstdn.ca)" ],
    "summary" : [ "\"I taught my kids about democracy last night. I had them vote on which movie to watch and what pizza to order. I then picked the pizza and which movie to watch because I'm the one with the money.\"\n\n#democracy #capitalism #fascism #goodgovernment #dadjokes" ],
    "url" : [ "https://mstdn.ca/@iamcanehdian/111695157844104878" ]
  }
}
