{
  "type" : [ "h-entry" ],
  "properties" : {
    "name" : [ "Reilly Spitzfaden (they/them) (@reillypascal@hachyderm.io)" ],
    "summary" : [ "Attached: 1 image\n\nI joined the IndieWeb webring! I've been wanting to join a webring for a while, and this makes me happy. \n\nI also added a proper h-card to my site and verified it: https://reillyspitzfaden.com\n\n#IndieWeb #Microformats #PersonalSites #Blog" ],
    "featured" : [ "https://media.hachyderm.io/media_attachments/files/112/451/779/273/899/179/original/126cbc961c3252f9.png" ],
    "url" : [ "https://hachyderm.io/@reillypascal/112451785032596712" ]
  }
}
