{
  "type" : [ "h-entry" ],
  "properties" : {
    "name" : [ "zzzzzzzz (@james@strangeobject.space)" ],
    "summary" : [ "OpenAI removing its rules against using it for Warfare and Military Tech is so fucking funny." ],
    "url" : [ "https://strangeobject.space/@james/111748863822623405" ]
  }
}
