{
  "type" : [ "h-entry" ],
  "properties" : {
    "name" : [ "Dana Fried (@tess@mastodon.social)" ],
    "summary" : [ "Attached: 1 image" ],
    "featured" : [ "https://files.mastodon.social/media_attachments/files/113/608/056/675/002/866/original/d2ef3087db60b04a.jpg" ],
    "url" : [ "https://mastodon.social/@tess/113608058089323831" ]
  }
}
