{
  "type" : [ "h-entry" ],
  "properties" : {
    "name" : [ "d@nny \"disc@\" mc² (@hipsterelectron@circumstances.run)" ],
    "summary" : [ "pronouncing HTML as hitmonlee" ],
    "url" : [ "https://circumstances.run/@hipsterelectron/113671339144190115" ]
  }
}
