{
  "type" : [ "h-entry" ],
  "properties" : {
    "name" : [ "arturo182 (@arturo182@mastodon.social)" ],
    "summary" : [ "Attached: 1 image\n\nLinkedIn trying to disguise unpaid labour as an amazing opportunity." ],
    "featured" : [ "https://files.mastodon.social/media_attachments/files/111/964/026/864/128/793/original/f986c60324ebb783.png" ],
    "url" : [ "https://mastodon.social/@arturo182/111964041343142682" ]
  }
}
