{
  "type" : [ "h-entry" ],
  "properties" : {
    "name" : [ "David Thomas Jackson (@DTJackson@mastodonapp.uk)" ],
    "summary" : [ "Attached: 1 image" ],
    "featured" : [ "https://files.mastodonapp.uk/media_attachments/files/112/727/186/024/324/722/original/31b9389084eca15e.jpg" ],
    "url" : [ "https://mastodonapp.uk/@DTJackson/112727186196883837" ]
  }
}
