{
  "type" : [ "h-entry" ],
  "properties" : {
    "name" : [ "aburka 🫣 (@aburka@hachyderm.io)" ],
    "summary" : [ "Hot take: if I can say \"they just tested positive\" and you don't have to ask \"for what?\" then the pandemic isn't over." ],
    "url" : [ "https://hachyderm.io/@aburka/112114519156801397" ]
  }
}
