{
  "type" : [ "h-entry" ],
  "properties" : {
    "name" : [ "Jon \"The Nice Guy\" Spriggs (@JonTheNiceGuy@toot.io)" ],
    "summary" : [ "@garrettc@mastodon.org.uk @carol@social.lol it's just the very best kind of event for a specific type of person. Fortunately my whole family was made up of that kind of person!" ],
    "url" : [ "https://toot.io/@JonTheNiceGuy/112554665587594928" ]
  }
}
