{
  "type" : [ "h-entry" ],
  "properties" : {
    "name" : [ "Why I joined incident.io (and you should too!)" ],
    "summary" : [ "We’re starting back up hiring at incident.io and it’s made me think about why I joined, and why I’m still here just (if not more) as excited as day one." ],
    "featured" : [ "https://media.licdn.com/dms/image/v2/D4E12AQH7U6gb1r_niA/article-cover_image-shrink_720_1280/article-cover_image-shrink_720_1280/0/1738618452542?e=2147483647&v=beta&t=u6rrhlAnn07NmuRvNaP6sb82-lcFQLJh4cF3QweUV_E" ],
    "url" : [ "https://www.linkedin.com/pulse/why-i-joined-incidentio-you-should-too-lawrence-jones-pkfue" ]
  }
}
