{
  "type" : [ "h-entry" ],
  "properties" : {
    "name" : [ "Reimagining OSS Licensing and Commercialization with Fair Source - Adam Jacob, System Initiative" ],
    "featured" : [ "https://i.ytimg.com/vi/rmhYHzJpkuo/maxresdefault.jpg" ],
    "photo" : [ "https://i.ytimg.com/vi/rmhYHzJpkuo/maxresdefault.jpg" ],
    "url" : [ "https://www.youtube.com/watch?v=rmhYHzJpkuo" ]
  }
}

