{
  "type" : [ "h-entry" ],
  "properties" : {
    "name" : [ "Zed&#39;s secret sauce with Nathan Sobo (Changelog &amp; Friends #33)" ],
    "summary" : [ "The Zed text editor has come a long way since Nathan Sobo came on the show last year to tell us about this follow-up to Atom. Zed is open source now, has the underpinnings of collaboration built in, is beginning its journey toward full extensibility, is coming to Linux soon &amp;amp; shows serious promise if Nathan’s team ..." ],
    "featured" : [ "https://cdn.changelog.com/static/images/share/twitter-friends-7fa3c9c5a72765c322b47e92da397fbb.png" ],
    "audio" : [ "https://op3.dev/e/https://cdn.changelog.com/uploads/friends/33/changelog--friends-33.mp3" ],
    "url" : [ "https://changelog.com/friends/33" ]
  }
}
