{
  "type" : [ "h-entry" ],
  "properties" : {
    "name" : [ "tierney cyren (@bnb.im)" ],
    "summary" : [ "walking around the house going \"wi wi wi\" all day until i get to see friends" ],
    "url" : [ "https://bsky.app/profile/bnb.im/post/3liwoqnx3uc2w" ],
    "published" : [ "2025-02-24T15:41:42.055Z" ]
  }
}
