{
  "type" : [ "h-entry" ],
  "properties" : {
    "name" : [ "TruffleHog Now Detects AWS Canaries without setting them off ◆ Truffle Security Co." ],
    "summary" : [ "Today we’re unveiling a novel way to identify canarytokens.org canaries completely statically without setting them off. Thinkst offers self hosted, and paid alternatives that are protected from these techniques. We’re open sourcing this capability and including it in TruffleHog." ],
    "featured" : [ "https://framerusercontent.com/images/6RiDCCdqX4TEZtsKcLWpzc30t48.png" ],
    "url" : [ "https://trufflesecurity.com/blog/canaries" ]
  }
}
