{
  "type" : [ "h-card" ],
  "properties" : {
    "name" : [ "Terence Eden" ],
    "photo" : [ {
      "value" : "https://files.mastodon.social/accounts/avatars/000/007/112/original/37df032a5951b96c.jpg",
      "alt" : ""
    } ],
    "url" : [ "https://mastodon.social/@Edent" ]
  },
  "lang" : "en-GB"
}
