{
  "type" : [ "h-entry" ],
  "properties" : {
    "name" : [ "Jonathan Yu (@jawnsy@mastodon.social)" ],
    "summary" : [ "@anderseknert@hachyderm.io @www.jvt.me@www.jvt.me Suppose your API stabilizes and you release your first 1.0 version. Hooray! That's awseome.\n\nIf you want to prototype some new functionality, but warn people that there may be breaking changes for that package as you iterate, what's the modern approach in Go for doing that?" ],
    "url" : [ "https://mastodon.social/@jawnsy/113069997585920818" ]
  }
}
