{
  "type" : [ "h-card" ],
  "properties" : {
    "name" : [ "duke dorje" ],
    "photo" : [ {
      "value" : "https://secure.gravatar.com/avatar/15af1c47be1443e402e824b56508686d?s=44&d=mm&r=g",
      "alt" : ""
    } ],
    "url" : [ "http://identikey.io" ]
  },
  "lang" : "en-US"
}
