{
  "type" : [ "h-card" ],
  "properties" : {
    "name" : [ "Tim Riley" ],
    "photo" : [ {
      "value" : "https://v1.image.11ty.dev/https%3A%2F%2Fwebmention.io%2Favatar%2Fcdn.masto.host%2Fc8f6edce61707af2cb6b746efc85e1f70db4006e083689a46a818447ff107eb1.png/jpeg/72/",
      "alt" : "Tim Riley"
    } ],
    "url" : [ "https://fediverse.zachleat.com/@zachleat/112917087819399708#favorited-by-109384376795918522" ]
  },
  "lang" : "en"
}
