{
  "type" : [ "h-entry" ],
  "properties" : {
    "name" : [ "roawrwn the computer foxwife (@kitsunecafe@tech.lgbt)" ],
    "summary" : [ "wish my brain was written in rust so there was memory safety and better concurrency" ],
    "url" : [ "https://tech.lgbt/@kitsunecafe/113732368094183054" ]
  }
}
