{
  "type" : [ "h-entry" ],
  "properties" : {
    "name" : [ "Hello World, meet Kian" ],
    "featured" : [ "https://evertpot.com/assets/cover/flower.png" ],
    "url" : [ "https://evertpot.com/hello-world-kian/" ]
  }
}
