{
  "type" : [ "h-entry" ],
  "properties" : {
    "name" : [ "Evan Boehs (@eb@social.coop)" ],
    "summary" : [ "People in the #indieweb webring who break it by not including the links are my actual pet peeves. Like you exhibit no restraint and you take and you take and you keep winning anyway" ],
    "url" : [ "https://social.coop/@eb/112131777763689815" ]
  }
}
