{
  "type" : [ "h-entry" ],
  "properties" : {
    "name" : [ "Félix (@fay59@tech.lgbt)" ],
    "summary" : [ "OH: the collective noun for a group of software engineers is a “merge conflict”" ],
    "url" : [ "https://tech.lgbt/@fay59/111898166516107097" ]
  }
}
