{
  "type" : [ "h-entry" ],
  "properties" : {
    "name" : [ "NanoRaptor (@NanoRaptor@bitbang.social)" ],
    "summary" : [ "Attached: 1 image" ],
    "featured" : [ "https://files.bitbang.social/media_attachments/files/111/717/524/263/311/109/original/d56b030a5527fc78.jpeg" ],
    "url" : [ "https://bitbang.social/@NanoRaptor/111717527878224801" ]
  }
}
