{
  "type" : [ "h-entry" ],
  "properties" : {
    "name" : [ "Sy Brand (@tartanllama.bsky.social)" ],
    "summary" : [ "Presented without comment, just a deep tiredness\n\n[contains quote post or other embedded content]" ],
    "featured" : [ "https://cdn.bsky.app/img/feed_thumbnail/plain/did:plc:iftpzy23ybfvx6dzrguuvjgx/bafkreiduulb4x77lqgvtbrxlsgb2dxapgg6y6luyjqdv2yym7o32x5enau@jpeg" ],
    "url" : [ "https://bsky.app/profile/tartanllama.bsky.social/post/3lgfz7cxwnc2q" ],
    "published" : [ "2025-01-23T13:43:14.650Z" ]
  }
}
