{
  "type" : [ "h-entry" ],
  "properties" : {
    "name" : [ "Cup o' Go | Where is the \"Advanced Mode\" switch?" ],
    "summary" : [ "🎉 Go 1.23 is here!Blog: Range Over Function Types by Ian Lance TaylorA look at the spec: Tree walking with range-over-func by Jonathan HallConferences & CFPs🇦🇺 GopherCon AU, Nov 7-8 Sydney, AustraliaCFP closes Sept 15🇺🇸 GoWest, Oct 25, Lehi, Utah, USAStill accepting lightning talksLane..." ],
    "featured" : [ "https://img.transistor.fm/viBzFgOPpNCvRB5mEq0BClMEWHySkoebRaEIerz0mOw/rs:fill:800:800:1/q:60/aHR0cHM6Ly9pbWct/dXBsb2FkLXByb2R1/Y3Rpb24udHJhbnNp/c3Rvci5mbS9zaG93/LzM3ODYyLzE2NzQ0/ODY4OTgtYXJ0d29y/ay5qcGc.webp" ],
    "audio" : [ "https://media.transistor.fm/e67fd8af/0aaa8c89.mp3" ],
    "url" : [ "https://share.transistor.fm/s/e67fd8af" ]
  }
}
