{
  "type" : [ "h-card" ],
  "properties" : {
    "name" : [ "RevK :verified_r:" ],
    "photo" : [ {
      "value" : "https://toot.me.uk/system/accounts/avatars/108/197/040/384/377/848/original/d0b4a4acdfc75b61.png",
      "alt" : ""
    } ],
    "url" : [ "https://toot.me.uk/@revk" ]
  },
  "lang" : "en-GB"
}
