{
  "type" : [ "h-entry" ],
  "properties" : {
    "name" : [ "Anders Eknert (@anderseknert@hachyderm.io)" ],
    "summary" : [ "Every time lice is reported at the kids daycare, being bald feels like an incredible asset. Watching moms rush in the to pick up their as quickly as possible, hoping not to bring any lice with them. While I walk around casually, talking to staff, playing with kids, just chillin. This is my moment." ],
    "url" : [ "https://hachyderm.io/@anderseknert/113047996460031791" ]
  }
}
