{
  "type" : [ "h-entry" ],
  "properties" : {
    "name" : [ "ThatSexToyGuy (@hungry_joe@mas.to)" ],
    "summary" : [ "welcome to the bukkake, thank you for coming" ],
    "url" : [ "https://mas.to/@hungry_joe/113604745150573267" ]
  }
}
