{
  "type" : [ "h-entry" ],
  "properties" : {
    "name" : [ "Rails is having a moment (again) with David Heinemeier Hansson (DHH), creator of Ruby on Rails (Changelog Interviews #615)" ],
    "summary" : [ "(Includes expletives) David Heinemeier Hansson (DHH), creator of Ruby on Rails and co-owner of 37signals, joined the show to discuss this Rails moment and renewed excitement for Rails. We discuss hard opinions, developers being cooked too long in the JavaScript soup, finding developer joy, the pros and cons of the BDFL..." ],
    "featured" : [ "https://snap.fly.dev/podcast/615/img" ],
    "audio" : [ "https://op3.dev/e/https://cdn.changelog.com/uploads/podcast/615/the-changelog-615.mp3" ],
    "url" : [ "https://changelog.com/podcast/615" ]
  }
}
