{
  "type" : [ "h-entry" ],
  "properties" : {
    "name" : [ "Anders Eknert (@anderseknert@hachyderm.io)" ],
    "summary" : [ "```\nfunc main() {\n\tkey := \"key\"\n\tvar obj map[string]any\n\tobj[\"key\"] = \"value\"\n}\n```\nThere's a pretty obvious problem in the above code. Which one do you think it is.. according to the #golang compiler?\n\nAnd that is why languages should leave linting to linters." ],
    "url" : [ "https://hachyderm.io/@anderseknert/113232795758674427" ]
  }
}
