{
  "type" : [ "h-entry" ],
  "properties" : {
    "name" : [ "Oxide and Friends | Cultural Idiosyncrasies" ],
    "summary" : [ "The Oxide Friends talk about about cultural idiosyncrasies--turns out we have a lot of them at Oxide! Some might even sound good enough for you to try out! Demo Fridays, morning water-cooler, no-meet Wednesdays, recorded meetings, dog-pile debugging (aka CSPAN for debugging), RFDs (requests for..." ],
    "featured" : [ "https://images.transistor.fm/images/episode/1829719/medium_1712153708-artwork.jpg" ],
    "audio" : [ "https://media.transistor.fm/d9523a5e/71eb0bf8.mp3" ],
    "url" : [ "https://share.transistor.fm/s/d9523a5e" ]
  }
}
