{
  "type" : [ "h-entry" ],
  "properties" : {
    "name" : [ "Large Heydon Collider (@heydon@front-end.social)" ],
    "summary" : [ "Attached: 2 images\n\nAs threatened, I've started making hypermasculine* clothing designs (*with unexpected slogans). \n\nhttps://webbed-briefs.teemill.com/collection/new" ],
    "featured" : [ "https://cdn.masto.host/frontendsocial/media_attachments/files/111/850/195/143/349/805/original/82eeba3f7c91d13a.png" ],
    "url" : [ "https://front-end.social/@heydon/111850205656365018" ]
  }
}
