{
  "type" : [ "h-entry" ],
  "properties" : {
    "name" : [ "Sam Whited (@sam@social.coop)" ],
    "summary" : [ "Random thought I had earlier that I'd like to run by some #FLOSS software people or FLOSS lawyers:\n\nCould we start a \"union\" of FLOSS software developers that would support us legally and help us bargain for better terms when negotiating license exceptions, support contracts, etc.?\n\n🧵" ],
    "url" : [ "https://social.coop/@sam/111806184764584632" ]
  }
}
