{
  "type" : [ "h-entry" ],
  "properties" : {
    "name" : [ "Staff archetypes" ],
    "summary" : [ "Stories of folks reaching Staff Engineer roles." ],
    "featured" : [ "https://staffeng.com/StaffEngSocialShare.jpg" ],
    "url" : [ "https://staffeng.com/guides/staff-archetypes/" ]
  }
}
