{
  "type" : [ "h-entry" ],
  "properties" : {
    "name" : [ "Bruce Perens, Post-Open | IT Ops Query" ],
    "summary" : [ "Bruce Perens created the definition of open source and co-founded the Open Source Initiative in 1998. He has said in recent public interviews, however, that open source has failed, and called for its overhaul under his Post-Open project. In this episode, Beth caught up with him to hear more about his ideas for the world after open source." ],
    "featured" : [ "https://d2bwo9zemjwxh5.cloudfront.net/image-logo/18344339/it_ops_query_icon_6ihbcv_1200x628.jpg?s=d179f6c017c1b20564a1fc4800656e5b&e=jpg" ],
    "author" : [ {
      "type" : [ "h-card" ],
      "properties" : {
        "name" : [ "PodBean Development" ]
      }
    } ],
    "url" : [ "https://itopsquery.podbean.com/e/bruce-perens-post-open/" ]
  }
}
