{
  "type" : [ "h-entry" ],
  "properties" : {
    "name" : [ "At the heart of the burnout epidemic" ],
    "summary" : [ "These days we’re dealing with a job burnout epidemic. Everybody speaks about it, there’s a lot of awareness, and yet things have been getting worse and worse every year. So what have we been missing?" ],
    "author" : [ {
      "type" : [ "h-card" ],
      "properties" : {
        "name" : [ "Michele Sollecito" ]
      }
    } ],
    "url" : [ "https://sollecitom.github.io/software-product-development-blog/posts/2023/2023-11-06-at-the-heart-of-the-burnout-epidemic/" ],
    "published" : [ "2023-11-06T05:00:00+00:00" ]
  }
}
