{
  "type" : [ "h-entry" ],
  "properties" : {
    "name" : [ "tillian (returning soon) (@mynameistillian@plush.city)" ],
    "summary" : [ "mozilla withdrawing from mastodon due to a lack of funds but having enough money to finance shitty ai research is like finding out your local library closed because they spent all their money on an inflatable dinosaur exhibit" ],
    "url" : [ "https://plush.city/@mynameistillian/113155071322459221" ]
  }
}
