{
  "type" : [ "h-entry" ],
  "properties" : {
    "name" : [ "Paul Cantrell (@inthehands@hachyderm.io)" ],
    "summary" : [ "I’m a software developer with a bunch of industry experience. I’m also a comp sci professor, and whenever a CS alum working in industry comes to talk to the students, I always like to ask, “What do you wish you’d taken more of in college?”\n\nAlmost without exception, they answer, “Writing.”\n\nOne of them said, “I do more writing at Google now than I did when I was in college.”\n\nI am therefore begging, begging you to listen to @stephstephking@mstdn.social: https://mstdn.social/@stephstephking/113336270193370876" ],
    "url" : [ "https://hachyderm.io/@inthehands/113336549424229433" ]
  }
}
