{
  "type" : [ "h-entry" ],
  "properties" : {
    "name" : [ "Wren Reilly (@akareilly@hachyderm.io)" ],
    "summary" : [ "If you want many eyes on your open source project, you need to get rid of assholes. \n\nBad community management is a security risk.\n\nAssholes bully sole maintainers. \nAssholes gatekeep and keep maintainer numbers low. \nAssholes waste time on the mailing list with petty bullshit. \nIf you fundraise, assholes are bullying your grant writers and community managers. \n\nSome of the best security contributors don't write a single line of code. They yeet assholes." ],
    "url" : [ "https://hachyderm.io/@akareilly/112189413810228739" ]
  }
}
