{
  "type" : [ "h-entry" ],
  "properties" : {
    "name" : [ "Cat Hicks (@grimalkina@mastodon.social)" ],
    "summary" : [ "Attached: 1 image\n\nLet the holiday break commence, the Hicks Juavinett household has truly earned it! ❤️💃💃❤️" ],
    "featured" : [ "https://files.mastodon.social/media_attachments/files/113/692/419/097/700/384/original/ea270a5a9e30c83e.jpg" ],
    "url" : [ "https://mastodon.social/@grimalkina/113692426744887686" ]
  }
}
