{
  "type" : [ "h-entry" ],
  "properties" : {
    "name" : [ "Terence Eden (@Edent@mastodon.social)" ],
    "summary" : [ "Wondering what the world would look like if we implemented \"Universal Basic Website\".\n\nEntitle everyone to their own domain, a few GB of space, the ability to run simple apps / blogs / etc.\n\nWhat does the world look like if people aren't beholden to Flickr / Facebook / Google Photos to share their family albums?\n\n#UBI" ],
    "url" : [ "https://mastodon.social/@Edent/112161196933183367" ]
  }
}
