{
  "type" : [ "h-entry" ],
  "properties" : {
    "name" : [ "Max Headroom :trekbadgetng: (@mikemathia@ioc.exchange)" ],
    "summary" : [ "Attached: 1 image\n\n#Daughter" ],
    "featured" : [ "https://files.ioc.exchange/media_attachments/files/111/678/683/053/687/242/original/3d6f98da6268fc8e.png" ],
    "url" : [ "https://ioc.exchange/@mikemathia/111678683268866418" ]
  }
}
