{
  "type" : [ "h-entry" ],
  "properties" : {
    "name" : [ "james is actually afk (@james@strangeobject.space)" ],
    "summary" : [ "My therapist just said I have a “skill issue” and then I had to explain why I was laughing and once again had to explain annoying gamer culture" ],
    "url" : [ "https://strangeobject.space/@james/111902792350493052" ]
  }
}
