{
  "type" : [ "h-card" ],
  "properties" : {
    "name" : [ "atomicker" ],
    "photo" : [ {
      "value" : "https://v1.image.11ty.dev/https%3A%2F%2Fwebmention.io%2Favatar%2Ffediverse.zachleat.com%2Fdb1d635fb4356e493a52ae26f48c9f875d733a757cb82141ea43b0221d79f2d5.png/jpeg/72/",
      "alt" : "atomicker"
    } ],
    "url" : [ "https://fediverse.zachleat.com/@zachleat/112917087819399708#favorited-by-109859310647870018" ]
  },
  "lang" : "en"
}
