{
  "type" : [ "h-entry" ],
  "properties" : {
    "name" : [ "Open Source And Decoding Enterprise Security with BoxyHQ's Deepak Prabhakara" ],
    "summary" : [ "In this episode of the Mechanical Ink podcast, Deepak Prabhakara from BoxyHQ shared his journey in the tech world, starting from his early days in Bangalore, India. His story is one of passion for technology, leading to significant roles in startups and eventually founding BoxyHQ. The discussion centered around BoxyHQ’s solutions like single sign-on, directory sync, and audit logs, all designed to enhance enterprise readiness for startups and growing companies." ],
    "featured" : [ "https://substackcdn.com/image/fetch/w_1200,h_600,c_fill,f_jpg,q_auto:good,fl_progressive:steep,g_auto/https%3A%2F%2Fsubstack-video.s3.amazonaws.com%2Fvideo_upload%2Fpost%2F140992742%2Fe50acd8b-61d9-4beb-892b-be9feb68226f%2Ftranscoded-1706090395.png" ],
    "audio" : [ "https://api.substack.com/api/v1/audio/upload/e50acd8b-61d9-4beb-892b-be9feb68226f/src" ],
    "author" : [ {
      "type" : [ "h-card" ],
      "properties" : {
        "name" : [ "Schalk Neethling" ]
      }
    } ],
    "url" : [ "https://schalkneethling.substack.com/p/open-source-and-decoding-enterprise" ]
  }
}
