{
  "type" : [ "h-entry" ],
  "properties" : {
    "name" : [ "Tane Piper (@tanepiper@tane.codes)" ],
    "summary" : [ "Attached: 1 image\n\nWhen you realise that people have been *planning* shitty jokes like this just for one day, for the likes" ],
    "featured" : [ "https://cdn.masto.host/tanecodes/media_attachments/files/112/196/546/528/299/722/original/5c9007ba582d6689.png" ],
    "url" : [ "https://tane.codes/@tanepiper/112196553731099663" ]
  }
}
