{
  "type" : [ "h-entry" ],
  "properties" : {
    "name" : [ "Leon Mika (@lmika@social.lol)" ],
    "summary" : [ "Spent the last few days building a small site which will convert an OPML file of RSS subscriptions into an HTML list of links to their respective websites. I needed it for a blogroll I’m planning to add, but I figured this might be something others may find useful. https://opml-to-blogroll.lmika.app" ],
    "url" : [ "https://social.lol/@lmika/111886319936403062" ]
  }
}
