{
  "type" : [ "h-card" ],
  "properties" : {
    "name" : [ "cryptael" ],
    "photo" : [ {
      "value" : "https://v1.image.11ty.dev/https%3A%2F%2Fwebmention.io%2Favatar%2Fcdn.masto.host%2Fab96c56f3fccf03a824156f958e915ce6c5d21e4bcd87d6fc3b450e1a3b988e5.png/jpeg/72/",
      "alt" : "cryptael"
    } ],
    "url" : [ "https://fediverse.zachleat.com/@zachleat/112917087819399708#reblogged-by-112920576049667857" ]
  },
  "lang" : "en"
}
