{
  "type" : [ "h-entry" ],
  "properties" : {
    "name" : [ "" ],
    "url" : [ "https://snarfed.org/2024-02-05_52058" ],
    "syndication" : [ "https://news.indieweb.org/en", "https://news.indieweb.org/en" ],
    "published" : [ "2024-02-05T13:43:25-08:00" ],
    "content" : [ {
      "html" : "<p class=\"right third\">\n <a href=\"https://blueskyweb.xyz/\">\n  <img decoding=\"async\" src=\"https://brid.gy//oauth_dropins_static/bluesky.svg\" style=\"width: 100%\">\n</a></p>\n<p>I’m happy to announce that <a href=\"https://brid.gy/about#publishing\">Bridgy Publish</a> now supports Bluesky! Big thanks to <a class=\"h-card\" href=\"https://www.joelotter.com/\">Joel Otter</a> who did much of the heavy lifting here, like with Bluesky backfeed.</p>\n<p>We’re still working on a few niceties, eg <a href=\"https://github.com/snarfed/granary/issues/675\">@-mentions, hashtags, links</a>, and <a href=\"https://github.com/snarfed/granary/issues/675#issuecomment-1928111387\">link preview cards</a>. Regardless, posts, replies, likes, and reposts should all work now. <a href=\"https://brid.gy/\">Feel free to try.</a> Feedback is welcome!</p>",
      "value" : "https://brid.gy//oauth_dropins_static/bluesky.svg\nI’m happy to announce that Bridgy Publish now supports Bluesky! Big thanks to Joel Otter who did much of the heavy lifting here, like with Bluesky backfeed.\nWe’re still working on a few niceties, eg @-mentions, hashtags, links, and link preview cards. Regardless, posts, replies, likes, and reposts should all work now. Feel free to try. Feedback is welcome!",
      "lang" : "en-US"
    } ],
    "author" : [ {
      "type" : [ "h-card" ],
      "properties" : {
        "name" : [ "Ryan Barrett" ],
        "photo" : [ {
          "value" : "https://secure.gravatar.com/avatar/947b5f3f323da0ef785b6f02d9c265d6?s=96&d=blank&r=g",
          "alt" : ""
        } ],
        "url" : [ "https://snarfed.org/" ]
      },
      "lang" : "en-US",
      "value" : "Ryan Barrett"
    } ]
  },
  "lang" : "en-US",
  "children" : [ {
    "type" : [ "h-card" ],
    "properties" : {
      "name" : [ "Ryan Barrett" ],
      "locality" : [ "San Francisco" ],
      "region" : [ "California" ],
      "photo" : [ {
        "value" : "https://snarfed.org/ryan_profile_medium.jpg",
        "alt" : "Ryan"
      } ],
      "email" : [ "mailto:public@ryanb.org" ],
      "key" : [ "https://snarfed.org/pubkey.txt" ],
      "url" : [ "https://snarfed.org/" ],
      "uid" : [ "https://snarfed.org/" ],
      "featured" : [ "https://snarfed.org/w/wp-content/uploads/2013/06/copy-cropped-iraq_bar.jpg" ]
    },
    "lang" : "en-US"
  }, {
    "type" : [ "h-card" ],
    "properties" : {
      "name" : [ "Joel Otter" ],
      "url" : [ "https://www.joelotter.com/" ]
    },
    "lang" : "en-US"
  } ]
}
