{
  "type" : [ "h-entry" ],
  "properties" : {
    "name" : [ "abadidea (@0xabad1dea@infosec.exchange)" ],
    "summary" : [ "Attached: 1 image\n\nThis is a graph of Discord’s algorithmically inferred gender (extracted from “request your data” json; axes are probability and days) for a user whose display name is “Tiffany”, whose bio is “she/her”, whose pfp is a drawing of a girl and whose profile theme color is pink. \n\nAlgorithmically inferred gender is worse than useless. Presumably the issue is that she talks about programming, and all the deliberate “I am explicitly telling you I am a girl” signaling in the world can’t convince a computer. I sometimes watch a livecoding streamer whose youtube stats claim his audience is 99% male even though you can see fem-coded chat participants regularly. Algorithms like this are deleting the women" ],
    "featured" : [ "https://media.infosec.exchange/infosec.exchange/media_attachments/files/112/539/972/815/084/791/original/da779f65c2d770d7.png" ],
    "url" : [ "https://infosec.exchange/@0xabad1dea/112539973036686033" ]
  }
}
