{
  "type" : [ "h-entry" ],
  "properties" : {
    "name" : [ "usrbinkat 🅅 (@usrbinkat.io)" ],
    "summary" : [ "I identify as \"network engineering curious\"." ],
    "url" : [ "https://bsky.app/profile/usrbinkat.io/post/3lh7oo2m4ds2i" ],
    "published" : [ "2025-02-02T18:43:49.353Z" ]
  }
}
