{
  "type" : [ "h-entry" ],
  "properties" : {
    "name" : [ "Cup o' Go | 🛡️ Focus on security & crypto w/ Filippo Valsorda" ],
    "summary" : [ "🛡️ Security releases. Upgrade now!Go 1.22.1 & 1.21.8google.golang.org/protobuf v1.33.0👭 Happy International Women's Day!Upcoming meetups & events🇬🇧 London Gophers, March 20🇮🇱 Go Israel, March 12🇬🇧 GopherCon UKConference, August 14-16CFP is open!Accepted proposals: Migrate x/crypto packages into..." ],
    "featured" : [ "https://images.transistor.fm/images/show/37862/medium_1674486898-artwork.jpg" ],
    "audio" : [ "https://media.transistor.fm/ce401376/a3b6a5dd.mp3" ],
    "url" : [ "https://share.transistor.fm/s/ce401376" ]
  }
}
