{
  "type" : [ "h-entry" ],
  "properties" : {
    "name" : [ "Dare Obasanjo (@carnage4life@mas.to)" ],
    "summary" : [ "Attached: 1 image\n\nMarvel fans after seeing the trailers for Thunderbolts and Captain America:,Brave New World." ],
    "featured" : [ "https://media.mas.to/media_attachments/files/113/457/795/792/745/793/small/8ef13d663b582c16.png" ],
    "audio" : [ "https://media.mas.to/media_attachments/files/113/457/795/792/745/793/original/8ef13d663b582c16.mp4" ],
    "url" : [ "https://mas.to/@carnage4life/113457796514517427" ]
  }
}
