{
  "type" : [ "h-entry" ],
  "properties" : {
    "name" : [ "Screaming in the Cloud | Crafting Tech Success from Bad Ideas with Xe Iaso" ],
    "summary" : [ "Xe Iaso, the Senior Technophilosopher at Fly.io, joins Corey to explore the world of unconventional thinking in technology. They discuss the magic of embracing bad ideas as stepping stones to innovation, the simplicity and power of deploying applications globally with a single command, and the..." ],
    "featured" : [ "https://img.transistor.fm/rmTxdsHIVn8jAhftmQ3wnuM4jVFWQOfKd7Oo7SLerYg/rs:fill:800:800:1/q:60/aHR0cHM6Ly9pbWct/dXBsb2FkLXByb2R1/Y3Rpb24udHJhbnNp/c3Rvci5mbS8wNzMx/ODgwODY5NzQ5MzJk/ZmRlY2RhYTZkNDg1/YjIxYi5wbmc.webp" ],
    "audio" : [ "https://dts.podtrac.com/redirect.mp3/media.transistor.fm/d8650b3f/03459d6c.mp3" ],
    "url" : [ "https://share.transistor.fm/s/d8650b3f" ]
  }
}
