{
  "type" : [ "h-entry" ],
  "properties" : {
    "name" : [ "When You Have to Fork a Project: All About Valkey | Open at Intel" ],
    "summary" : [ "In this episode, Madelyn Olson, a maintainer of the Valkey project and an AWS engineer, joins us to discuss the life of an open source maintainer and the experiences surrounding the launch of the Valkey project. We cover the pivotal moments that led to the creation of Valkey, a Redis fork, following the Redis license change. Madeline also shares insights on the challenges and pressures of being a maintainer, strategies to manage burnout, and the significance of creating a community-driven, open source project. The episode highlights the technical advancements and future directions for Valkey, working to leverage modern hardware, manage large clusters, and expand the extension ecosystem. \n \n00:00 Introduction \n00:48 Redis License Change and Birth of Valkey\n06:17 Maintainer Life and Burnout \n14:54 Forking a Repository: When and Why \n19:30 Community-Driven Open Source Projects \n21:32 Future of Valkey and Closing Remarks\n \nGuest:\n\nMadelyn Olson is a co-creator and maintainer of Valkey, a high-performance key-value datastore, and Principal Engineer at Amazon Web Services (AWS). She focuses on building secure and highly reliable features, with a passion in working with open-source communities.\n" ],
    "featured" : [ "https://d2bwo9zemjwxh5.cloudfront.net/image-logo/15590967/podbean-open-at-intel-1080x1080_wufum6_1200x628.jpg?s=738fb41dc7c5c3612a7bebf1cc383938&e=png" ],
    "author" : [ {
      "type" : [ "h-card" ],
      "properties" : {
        "name" : [ "PodBean Development" ]
      }
    } ],
    "url" : [ "https://openatintel.podbean.com/e/when-you-have-to-fork-a-project-all-about-valkey/" ]
  }
}
