{
  "type" : [ "h-entry" ],
  "properties" : {
    "name" : [ "Terence Eden (@Edent@mastodon.social)" ],
    "summary" : [ "Literal quote just now from @summerbeth@mastodon.me.uk \n\n> You've ruined my life.\n\nNow she's muttering about not having enough steel plate to make her solar panels." ],
    "url" : [ "https://mastodon.social/@Edent/113379102251924315" ]
  }
}
