{
  "type" : [ "h-entry" ],
  "properties" : {
    "name" : [ "GitHub - ankitpokhrel/jira-cli: 🔥 Feature-rich interactive Jira command line." ],
    "summary" : [ "🔥 Feature-rich interactive Jira command line. Contribute to ankitpokhrel/jira-cli development by creating an account on GitHub." ],
    "featured" : [ "https://opengraph.githubassets.com/f46695d168571a663c31d4f865c076061eabfa1640cdfbef7e5b7ca995cc99fa/ankitpokhrel/jira-cli" ],
    "url" : [ "https://github.com/ankitpokhrel/jira-cli" ]
  }
}
