{
  "type" : [ "h-entry" ],
  "properties" : {
    "name" : [ "⚡ Lightning Talk life ⚡ with Andy Joseph, Dylan Bourque, Cassie Coyle, Ehden Sinai, Jacob Hochstetler & Matt Dale (Go Time #327)" ],
    "summary" : [ "This episode focuses on the art of delivering concise Lightning Talks, a popular format at conferences worldwide where speakers present in a short timeframe. Joined by some of this year's GopherCon Lightning Talkers, we'll discuss their experiences, challenges & tips for effective communication within a limited time." ],
    "featured" : [ "https://snap.fly.dev/gotime/327/img" ],
    "audio" : [ "https://op3.dev/e/https://cdn.changelog.com/uploads/gotime/327/go-time-327.mp3" ],
    "url" : [ "https://changelog.com/gotime/327" ]
  }
}
