{
  "type" : [ "h-entry" ],
  "properties" : {
    "name" : [ "The Duke of SQLite: Litestream with Ben Johnson by Contributor" ],
    "summary" : [ "Ben Johnson (@benbjohnson) is the creator of Litestream and LiteFS, two open-source disaster recovery solution for SQLite. Litestream is designed to provide continuous backups for SQLite databases by streaming incremental changes, allowing for easy data recovery in the event of a server crash. LiteFS, on the other hand, is built on LiteStream but uses transactional control to focus on replication and high availability. Join us as Ben discusses the challenges and trade-offs of open source contributions and the future of databases.\nContributor is looking for a community manager! If you want to know more, shoot us an email at eric@scalevp.com.\nSubscribe to Contributor on Substack for email notifications!\nIn this episode we discuss:\n\n The history of how Ben got involved in SQLite development out of “spite”\n\n How Litestream “works on a fluke”\n\n  Different use cases for Litestream vs LiteFS\n\n  Why fully open contributions isn’t always Ben’s style\n\n  The greater server-side SQLite landscape\n\n\nLinks:\n\n  Litestream\n\n  LiteFS\n\n  Fly.io\n\n  BoltDB \n\n\nPeople mentioned:\n\n  Philip O’Toole (@general_order24)\n\n\nOther episodes:\n\n  The Social Miracle: rqlite with Philip O’Toole\n\n  The Big Fork: libSQL with Glauber Costa\n\n" ],
    "featured" : [ "https://d3t3ozftmdmh3i.cloudfront.net/staging/podcast_uploaded_episode400/330117/330117-1705443910966-0768c1ac12ea9.jpg" ],
    "url" : [ "https://podcasters.spotify.com/pod/show/contributor/episodes/The-Duke-of-SQLite-Litestream-with-Ben-Johnson-e2ehoap" ]
  }
}
