{
  "type" : [ "h-entry" ],
  "properties" : {
    "name" : [ "Fork Around And Find Out | An Oral History of the Kubernetes Revolution with Brian Grant" ],
    "summary" : [ "Kubernetes isn’t just a platform—it’s a revolution. On this episode of Fork Around and Find Out, Justin and Autumn sit down with Kubernetes co-creator Brian Grant to explore the origins of this game-changing technology. From Google’s internal tooling to the cloud-native juggernaut it is today,..." ],
    "featured" : [ "https://img.transistor.fm/ITt4T9xNHIVAg7LrbTU4BAKcNZkwy4wArAH-bkY8ym8/rs:fill:800:800:1/q:60/aHR0cHM6Ly9pbWct/dXBsb2FkLXByb2R1/Y3Rpb24udHJhbnNp/c3Rvci5mbS9iMzA2/YzA0NWVkZjliNDAy/ZmU0M2E2YjIxZDQ0/MzM3My5wbmc.webp" ],
    "audio" : [ "https://media.transistor.fm/fe4d45ce/4b6d3bc2.mp3" ],
    "url" : [ "https://share.transistor.fm/s/fe4d45ce" ]
  }
}
