{
  "type" : [ "h-entry" ],
  "properties" : {
    "name" : [ "Cup o' Go | Do Androids Dream of Electric Gophers? New Go releases & interview with Elliott Minns" ],
    "summary" : [ "Go 1.23.1 & 1.22.7 released🚫 Proposal accepted: encoding/json: add omitzero optionEpisode 34: Interview with Joe Tsai about encoding/json/v2✍️ script v0.23.0Episode 56: Interview wit xiaq, author of Elvish  Episode 21: Interview with John ArundelGo blog: Telemetry in Go 1.23 and beyond by Robert..." ],
    "featured" : [ "https://img.transistor.fm/viBzFgOPpNCvRB5mEq0BClMEWHySkoebRaEIerz0mOw/rs:fill:800:800:1/q:60/aHR0cHM6Ly9pbWct/dXBsb2FkLXByb2R1/Y3Rpb24udHJhbnNp/c3Rvci5mbS9zaG93/LzM3ODYyLzE2NzQ0/ODY4OTgtYXJ0d29y/ay5qcGc.webp" ],
    "audio" : [ "https://media.transistor.fm/32216dbb/b870afcf.mp3" ],
    "url" : [ "https://share.transistor.fm/s/32216dbb" ]
  }
}
