{
  "type" : [ "h-entry" ],
  "properties" : {
    "name" : [ "Jaana Dogan :unverified: (@rakyll@m.rakyll.org)" ],
    "summary" : [ "Attached: 3 images\n\nGot nostalgic about the old days when we had to make our own custom Go swag." ],
    "featured" : [ "https://cdn.masto.host/mrakyllorg/media_attachments/files/112/092/748/935/026/481/original/f33f627faed9729c.jpeg" ],
    "url" : [ "https://m.rakyll.org/@rakyll/112092763011904946" ]
  }
}
