{
  "type" : [ "h-entry" ],
  "properties" : {
    "name" : [ "Rizwana Akmal Khan (@rizwanakhan.com)" ],
    "summary" : [ "Looking forward to the rest of December to tend to other planned ships, mainly →\n\n- Moving to App Router\n- Posting EoY feels / 4️⃣ years @ ▲ post\n\n☕ 😌" ],
    "url" : [ "https://bsky.app/profile/rizwanakhan.com/post/3lcqwy2s7es25" ],
    "published" : [ "2024-12-08T00:21:53.912Z" ]
  }
}
