{
  "type" : [ "h-entry" ],
  "properties" : {
    "name" : [ "Reinventing Kafka on object storage with Ryan Worl, Co-founder & CTO at WarpStream (Changelog Interviews #606)" ],
    "summary" : [ "Ryan Worl, Co-founder and CTO at WarpStream, joins us to talk about the world of Kafka and data streaming and how WarpStream redesigned the idea of Kafka to run in modern cloud environments directly on top of object storage. Last year they posted a blog titled, \"Kafka is dead, long live Kafka\" that hit the top of Hacke..." ],
    "featured" : [ "https://snap.fly.dev/podcast/606/img" ],
    "audio" : [ "https://op3.dev/e/https://cdn.changelog.com/uploads/podcast/606/the-changelog-606.mp3" ],
    "url" : [ "https://changelog.com/podcast/606" ]
  }
}
