{
  "type" : [ "h-entry" ],
  "properties" : {
    "name" : [ "Schalk Neethling (@schalkneethling@hachyderm.io)" ],
    "summary" : [ "Klarna CEO Boasts His AI Can Do Work of 700 People After Laying Off 700 People in 2022 - https://gizmodo.com/klarna-ceo-ai-chatbot-customer-service-700-jobs-layoffs-1851293200" ],
    "url" : [ "https://hachyderm.io/@schalkneethling/112025601355232140" ]
  }
}
