{
  "type" : [ "h-entry" ],
  "properties" : {
    "name" : [ "Dare Obasanjo (@carnage4life@mas.to)" ],
    "summary" : [ "Silicon Valley CEOs are working overtime to ensure they never get asked questions about four day workweeks ever again." ],
    "url" : [ "https://mas.to/@carnage4life/111743102273436331" ]
  }
}
