{
  "type" : [ "h-entry" ],
  "properties" : {
    "name" : [ "Cassidy (@cassidoo.co)" ],
    "summary" : [ "\"that's why they pay me the big bucks! 😀\"" ],
    "url" : [ "https://bsky.app/profile/cassidoo.co/post/3lipf3di47225" ],
    "published" : [ "2025-02-21T18:00:05.847Z" ]
  }
}
