{
  "type" : [ "h-entry" ],
  "properties" : {
    "name" : [ "tldraw (@tldraw@mas.to)" ],
    "summary" : [ "Attached: 1 image\n\nheya London, we're running a Side Project Saturday this at the tldraw office, 9AM-noon. Come by and have some coffee, work on your thing, do some demos. Link in next post" ],
    "featured" : [ "https://media.mas.to/media_attachments/files/113/426/243/187/775/437/original/07e2f29ee5171c33.jpeg" ],
    "url" : [ "https://mas.to/@tldraw/113426243244813362" ]
  }
}
