{
	"type": [
		"h-entry"
	],
	"properties": {
		"name": [
			"Optimizing SQLite for servers"
		],
		"summary": [
			"SQLite is often misconceived as a &amp;#34;toy database&amp;#34;, only good for mobile applications and embedded systems because it&amp;#39;s default configuration is optimized for embedded use cases, so most people trying it will encounter poor performances and the dreaded SQLITE_BUSY error. But what if I told you that by tuning a"
		],
		"featured": [
			"https://kerkour.com/theme/images/pirate_flag_256.png"
		],
		"url": [
			"https://kerkour.com/sqlite-for-servers"
		]
	}
}
