{
  "type" : [ "h-entry" ],
  "properties" : {
    "name" : [ "April King (@april@macaw.social)" ],
    "summary" : [ "git blame, but it tells you who reviewed the code instead" ],
    "url" : [ "https://macaw.social/@april/111694095975414512" ]
  }
}
