{
  "type" : [ "h-entry" ],
  "properties" : {
    "name" : [ "Aaron Patterson ✅ (@tenderlove@mastodon.social)" ],
    "summary" : [ "I think maybe my best advice is: definitely get involved in open source, just make sure either nobody uses your software or you quit ASAP 😆" ],
    "url" : [ "https://mastodon.social/@tenderlove/112028931514060312" ]
  }
}
