{
  "type" : [ "h-entry" ],
  "properties" : {
    "name" : [ "Maartje @ FOSDEM (@maartje@blahaj.social)" ],
    "summary" : [ "Attached: 1 image\n\nMy favourite FOSDEM track… the fully empty women’s toilet 😂" ],
    "featured" : [ "https://cdn.blahaj.social/media_attachments/files/111/867/373/710/785/968/original/ed46791765e11377.jpeg" ],
    "url" : [ "https://blahaj.social/@maartje/111867437110647952" ]
  }
}
