{
  "type" : [ "h-entry" ],
  "properties" : {
    "name" : [ "Kat (@KatS@chaosfem.tw)" ],
    "summary" : [ "Attached: 1 image" ],
    "featured" : [ "https://chaosfemtw.files.fedi.monster/media_attachments/files/112/020/836/674/783/899/original/a0440af195adda68.jpg" ],
    "url" : [ "https://chaosfem.tw/@KatS/112020836694526570" ]
  }
}
