{
  "type" : [ "h-entry" ],
  "properties" : {
    "name" : [ "Ana Rodrigues (@anarodrigues@front-end.social)" ],
    "summary" : [ "I've written about it (https://www.smashingmagazine.com/2020/08/autonomy-online-indieweb/) and I don't even implement the stuff I mentioned! \nI promise you, nobody is judging." ],
    "url" : [ "https://front-end.social/@anarodrigues/113068397516049316" ]
  }
}
