{
  "type" : [ "h-entry" ],
  "properties" : {
    "name" : [ "Daniel (@mrtazz@chaos.social)" ],
    "summary" : [ "Also it's ironic that they keep giving AI traditional women's names when it clearly should be a white man given how much it is promoted on potential" ],
    "url" : [ "https://chaos.social/@mrtazz/112541130766641852" ]
  }
}
