{
  "type" : [ "h-entry" ],
  "properties" : {
    "name" : [ "Kim Possible (@kimlockhartga@beige.party)" ],
    "summary" : [ "Attached: 1 image\n\nTime to break out the Santa stripper leggings and head to the store." ],
    "featured" : [ "https://media.beige.party/media_attachments/files/113/697/213/990/242/276/original/02409001b9a6eb67.jpg" ],
    "url" : [ "https://beige.party/@kimlockhartga/113697235671461717" ]
  }
}
