{
  "type" : [ "h-entry" ],
  "properties" : {
    "name" : [ "Dare Obasanjo (@carnage4life@mas.to)" ],
    "summary" : [ "Attached: 1 image\n\nSeeing Jack in the booth with Jay-Z and Beyonce at the Super Bowl is a reminder that Square bought Tidal as an answer to the question - how much would you pay for dinner with Jay-Z?" ],
    "featured" : [ "https://media.mas.to/masto-public/media_attachments/files/111/916/127/274/400/843/original/ccf577aff565bea2.jpeg" ],
    "url" : [ "https://mas.to/@carnage4life/111916127584814489" ]
  }
}
