{
  "type": [
    "h-entry"
  ],
  "properties": {
    "name": [
      "Radical salary transparency FTW?"
    ],
    "summary": [
      "@JamieTanna talks about his decision to share his salary publicly on the \"Changelog & Friends\" podcast. Full audio 👉 https://changelog.com/friends/31Subscri..."
    ],
    "featured": [
      "https://i.ytimg.com/vi/Bzmu5bcR3HQ/maxresdefault.jpg"
    ],
    "url": [
      "https://www.youtube.com/watch?v=Bzmu5bcR3HQ"
    ]
  }
}
