{
  "type" : [ "h-entry" ],
  "properties" : {
    "name" : [ "Cup o' Go | A quick tour of some proposals, and a long chat about OpenAPI with Jamie Tanna" ],
    "summary" : [ "Go 1.22.3 & 1.22.10 releasedProposalsAccepted: add binary.Append functionLikely accept: new `go telemetry` subcommandLikely decline: Notify about new major versions of dependenciesPackt book bundleInterview with Jamie TannaBlog: Creating a more sustainable model for `oapi-codegen` in the..." ],
    "featured" : [ "https://img.transistor.fm/viBzFgOPpNCvRB5mEq0BClMEWHySkoebRaEIerz0mOw/rs:fill:800:800:1/q:60/aHR0cHM6Ly9pbWct/dXBsb2FkLXByb2R1/Y3Rpb24udHJhbnNp/c3Rvci5mbS9zaG93/LzM3ODYyLzE2NzQ0/ODY4OTgtYXJ0d29y/ay5qcGc.webp" ],
    "audio" : [ "https://media.transistor.fm/65bf8747/3acf879e.mp3" ],
    "url" : [ "https://share.transistor.fm/s/65bf8747" ]
  }
}
