{
  "type" : [ "h-entry" ],
  "properties" : {
    "name" : [ "The Business of Open Source | KubeCon Special Episode: Managing the Tension between Product and Project with Bobby DeSimone " ],
    "summary" : [ "Who pays for the future of infrastructure? In this special episode, I spoke to Bobby DeSimone, founder and CEO of Pomerium, about how he feels like infrastructure and security both have to be open source — but then, what does that mean about the future of the financial support for infrastructure..." ],
    "featured" : [ "https://img.transistor.fm/Lb7Bpu3aBT5bp3W_HYHhf1rD6x1UPhXhFzHEBTRywb0/rs:fill:800:800:1/q:60/aHR0cHM6Ly9pbWct/dXBsb2FkLXByb2R1/Y3Rpb24udHJhbnNp/c3Rvci5mbS9zaG93/LzEwNTI5LzE2NTY1/MTIwMDAtYXJ0d29y/ay5qcGc.webp" ],
    "audio" : [ "https://dts.podtrac.com/redirect.mp3/media.transistor.fm/d9454c0c/91ac9c96.mp3" ],
    "url" : [ "https://share.transistor.fm/s/d9454c0c" ]
  }
}
