{
  "type" : [ "h-entry" ],
  "properties" : {
    "name" : [ "Gophers Say! GopherCon EU Berlin 2024 with Cameron + Chioma + Ron vs Johnny + Travis + Paula (Go Time #320)" ],
    "summary" : [ "Our award winning worthy survey game show is back, this time Mat Ryer hosts it live on stage at GopherCon EU Berlin 2024! Join in &amp;amp; play along as we see which team can better guess what these GopherCon gophers had to say! " ],
    "featured" : [ "https://snap.fly.dev/gotime/320/img" ],
    "audio" : [ "https://op3.dev/e/https://cdn.changelog.com/uploads/gotime/320/go-time-320.mp3" ],
    "url" : [ "https://changelog.com/gotime/320" ]
  }
}
