{
  "type" : [ "h-entry" ],
  "properties" : {
    "name" : [ "Developer (un)happiness with Abi Noda, co-Founder & CEO at DX (Changelog & Friends #64)" ],
    "summary" : [ "Abi Noda, co-founder and CEO at DX, joins the show to talk through data shared from the Stack Overflow 2024 Developer Survey, why devs are really unhappy, and what they're doing at DX to help orgs and teams to understand the metrics behind their developer's happiness and productivity." ],
    "featured" : [ "https://snap.fly.dev/friends/64/img" ],
    "audio" : [ "https://op3.dev/e/https://cdn.changelog.com/uploads/friends/64/changelog--friends-64.mp3" ],
    "url" : [ "https://changelog.com/friends/64" ]
  }
}
