{
  "type" : [ "h-entry" ],
  "properties" : {
    "category" : [ "indieweb" ],
    "pk-num-likes" : [ "65" ],
    "pk-num-reposts" : [ "64" ],
    "pk-num-replies" : [ "10" ],
    "url" : [ "https://aaronparecki.com/2024/07/10/17/" ],
    "published" : [ "2024-07-10T16:11:02-07:00" ],
    "content" : [ {
      "html" : "If you have a personal website, which I assume you do if you're following me here, you should add yourself to the Internet Phonebook while the call for websites is still open! They even have an \"indie web\" category! <a href=\"https://internetphonebook.net\"><span class=\"protocol\">https://</span>internetphonebook.net</a>",
      "value" : "If you have a personal website, which I assume you do if you're following me here, you should add yourself to the Internet Phonebook while the call for websites is still open! They even have an \"indie web\" category! https://internetphonebook.net"
    } ],
    "author" : [ {
      "type" : [ "h-card" ],
      "properties" : {
        "name" : [ "Aaron Parecki" ],
        "url" : [ "https://aaronparecki.com/" ],
        "photo" : [ {
          "value" : "https://aaronparecki.com/images/profile.jpg",
          "alt" : "Aaron Parecki"
        } ]
      },
      "value" : "https://aaronparecki.com/"
    } ],
    "location" : [ {
      "type" : [ "h-adr" ],
      "properties" : {
        "locality" : [ "Portland" ],
        "region" : [ "Oregon" ],
        "country" : [ "USA" ]
      },
      "value" : "Portland, Oregon, USA"
    } ],
    "like" : [ {
      "type" : [ "h-cite" ],
      "properties" : {
        "url" : [ "https://mastodon.social/users/villasbc#likes/169917058" ],
        "author" : [ {
          "type" : [ "h-card" ],
          "properties" : {
            "name" : [ "Victor Villas" ],
            "photo" : [ "https://aaronparecki.com/assets/images/no-profile-photo.png" ],
            "url" : [ "https://mastodon.social/users/villasbc" ]
          },
          "value" : "Victor Villas"
        } ]
      },
      "value" : "https://aaronparecki.com/assets/images/no-profile-photo.png Victor Villas"
    }, {
      "type" : [ "h-cite" ],
      "properties" : {
        "url" : [ "https://toot.cafe/users/andybroomfield#likes/931051" ],
        "author" : [ {
          "type" : [ "h-card" ],
          "properties" : {
            "name" : [ "Andy Broomfield" ],
            "photo" : [ "https://aaronparecki.com/assets/images/no-profile-photo.png" ],
            "url" : [ "https://toot.cafe/users/andybroomfield" ]
          },
          "value" : "Andy Broomfield"
        } ]
      },
      "value" : "https://aaronparecki.com/assets/images/no-profile-photo.png Andy Broomfield"
    }, {
      "type" : [ "h-cite" ],
      "properties" : {
        "url" : [ "https://cosocial.ca/users/dylanmccall#likes/315221" ],
        "author" : [ {
          "type" : [ "h-card" ],
          "properties" : {
            "name" : [ "Dylan McCall" ],
            "photo" : [ "https://aaronparecki.com/assets/images/no-profile-photo.png" ],
            "url" : [ "https://cosocial.ca/users/dylanmccall" ]
          },
          "value" : "Dylan McCall"
        } ]
      },
      "value" : "https://aaronparecki.com/assets/images/no-profile-photo.png Dylan McCall"
    }, {
      "type" : [ "h-cite" ],
      "properties" : {
        "url" : [ "https://fedi.circuitlocution.com/activities/6da36a20-7f64-4b5d-81b7-dfc8bab787dd" ],
        "author" : [ {
          "type" : [ "h-card" ],
          "properties" : {
            "name" : [ "George Dorn" ],
            "photo" : [ "https://aaronparecki.com/assets/images/no-profile-photo.png" ],
            "url" : [ "https://fedi.circuitlocution.com/users/gdorn" ]
          },
          "value" : "George Dorn"
        } ]
      },
      "value" : "https://aaronparecki.com/assets/images/no-profile-photo.png George Dorn"
    }, {
      "type" : [ "h-cite" ],
      "properties" : {
        "url" : [ "https://bananachips.club/users/qwazix#likes/456174" ],
        "author" : [ {
          "type" : [ "h-card" ],
          "properties" : {
            "name" : [ "qwazix" ],
            "photo" : [ "https://aaronparecki.com/assets/images/no-profile-photo.png" ],
            "url" : [ "https://bananachips.club/users/qwazix" ]
          },
          "value" : "qwazix"
        } ]
      },
      "value" : "https://aaronparecki.com/assets/images/no-profile-photo.png qwazix"
    }, {
      "type" : [ "h-cite" ],
      "properties" : {
        "url" : [ "https://social.lol/users/jedda#likes/871730" ],
        "author" : [ {
          "type" : [ "h-card" ],
          "properties" : {
            "name" : [ "JCProbably :prami_pride:" ],
            "photo" : [ "https://aaronparecki.com/assets/images/no-profile-photo.png" ],
            "url" : [ "https://social.lol/users/jedda" ]
          },
          "value" : "JCProbably :prami_pride:"
        } ]
      },
      "value" : "https://aaronparecki.com/assets/images/no-profile-photo.png JCProbably :prami_pride:"
    }, {
      "type" : [ "h-cite" ],
      "properties" : {
        "url" : [ "https://dragon.style/users/Filene#likes/1259468" ],
        "author" : [ {
          "type" : [ "h-card" ],
          "properties" : {
            "name" : [ "Filene" ],
            "photo" : [ "https://aaronparecki.com/assets/images/no-profile-photo.png" ],
            "url" : [ "https://dragon.style/users/Filene" ]
          },
          "value" : "Filene"
        } ]
      },
      "value" : "https://aaronparecki.com/assets/images/no-profile-photo.png Filene"
    }, {
      "type" : [ "h-cite" ],
      "properties" : {
        "url" : [ "https://indieweb.social/users/amblergee#likes/1772666" ],
        "author" : [ {
          "type" : [ "h-card" ],
          "properties" : {
            "name" : [ "Agyei Gyasi" ],
            "photo" : [ "https://aaronparecki.com/assets/images/no-profile-photo.png" ],
            "url" : [ "https://indieweb.social/users/amblergee" ]
          },
          "value" : "Agyei Gyasi"
        } ]
      },
      "value" : "https://aaronparecki.com/assets/images/no-profile-photo.png Agyei Gyasi"
    }, {
      "type" : [ "h-cite" ],
      "properties" : {
        "url" : [ "https://c.im/users/jake4480#likes/4361229" ],
        "author" : [ {
          "type" : [ "h-card" ],
          "properties" : {
            "name" : [ "Jake in the desert" ],
            "photo" : [ "https://aaronparecki.com/assets/images/no-profile-photo.png" ],
            "url" : [ "https://c.im/users/jake4480" ]
          },
          "value" : "Jake in the desert"
        } ]
      },
      "value" : "https://aaronparecki.com/assets/images/no-profile-photo.png Jake in the desert"
    }, {
      "type" : [ "h-cite" ],
      "properties" : {
        "url" : [ "https://degrowth.social/users/yala#likes/17238" ],
        "author" : [ {
          "type" : [ "h-card" ],
          "properties" : {
            "name" : [ "jon ⚝" ],
            "photo" : [ "https://aaronparecki.com/assets/images/no-profile-photo.png" ],
            "url" : [ "https://degrowth.social/users/yala" ]
          },
          "value" : "jon ⚝"
        } ]
      },
      "value" : "https://aaronparecki.com/assets/images/no-profile-photo.png jon ⚝"
    }, {
      "type" : [ "h-cite" ],
      "properties" : {
        "url" : [ "https://mastodon.social/users/philbetts#likes/169560667" ],
        "author" : [ {
          "type" : [ "h-card" ],
          "properties" : {
            "name" : [ "Dr Phil(ip) Betts" ],
            "photo" : [ "https://aaronparecki.com/assets/images/no-profile-photo.png" ],
            "url" : [ "https://mastodon.social/users/philbetts" ]
          },
          "value" : "Dr Phil(ip) Betts"
        } ]
      },
      "value" : "https://aaronparecki.com/assets/images/no-profile-photo.png Dr Phil(ip) Betts"
    }, {
      "type" : [ "h-cite" ],
      "properties" : {
        "url" : [ "https://hachyderm.io/users/snacktraces#likes/11077746" ],
        "author" : [ {
          "type" : [ "h-card" ],
          "properties" : {
            "name" : [ "SnackTraces" ],
            "photo" : [ "https://aaronparecki.com/assets/images/no-profile-photo.png" ],
            "url" : [ "https://hachyderm.io/users/snacktraces" ]
          },
          "value" : "SnackTraces"
        } ]
      },
      "value" : "https://aaronparecki.com/assets/images/no-profile-photo.png SnackTraces"
    }, {
      "type" : [ "h-cite" ],
      "properties" : {
        "url" : [ "https://mastodon.social/users/cemk#likes/169558991" ],
        "author" : [ {
          "type" : [ "h-card" ],
          "properties" : {
            "name" : [ "Cem K." ],
            "photo" : [ "https://aaronparecki.com/assets/images/no-profile-photo.png" ],
            "url" : [ "https://mastodon.social/users/cemk" ]
          },
          "value" : "Cem K."
        } ]
      },
      "value" : "https://aaronparecki.com/assets/images/no-profile-photo.png Cem K."
    }, {
      "type" : [ "h-cite" ],
      "properties" : {
        "url" : [ "https://mastodon.social/users/welrbraga#likes/169558801" ],
        "author" : [ {
          "type" : [ "h-card" ],
          "properties" : {
            "name" : [ "Welington 🐘" ],
            "photo" : [ "https://aaronparecki.com/assets/images/no-profile-photo.png" ],
            "url" : [ "https://mastodon.social/users/welrbraga" ]
          },
          "value" : "Welington 🐘"
        } ]
      },
      "value" : "https://aaronparecki.com/assets/images/no-profile-photo.png Welington 🐘"
    }, {
      "type" : [ "h-cite" ],
      "properties" : {
        "url" : [ "https://metalhead.club/users/axemonkey#likes/2083831" ],
        "author" : [ {
          "type" : [ "h-card" ],
          "properties" : {
            "name" : [ "axemonkey" ],
            "photo" : [ "https://aaronparecki.com/assets/images/no-profile-photo.png" ],
            "url" : [ "https://metalhead.club/users/axemonkey" ]
          },
          "value" : "axemonkey"
        } ]
      },
      "value" : "https://aaronparecki.com/assets/images/no-profile-photo.png axemonkey"
    }, {
      "type" : [ "h-cite" ],
      "properties" : {
        "url" : [ "https://mastodon.social/users/skry#likes/169556818" ],
        "author" : [ {
          "type" : [ "h-card" ],
          "properties" : {
            "name" : [ "skry" ],
            "photo" : [ "https://aaronparecki.com/assets/images/no-profile-photo.png" ],
            "url" : [ "https://mastodon.social/users/skry" ]
          },
          "value" : "skry"
        } ]
      },
      "value" : "https://aaronparecki.com/assets/images/no-profile-photo.png skry"
    }, {
      "type" : [ "h-cite" ],
      "properties" : {
        "url" : [ "https://seocommunity.social/users/ilovechoclates_#likes/76815" ],
        "author" : [ {
          "type" : [ "h-card" ],
          "properties" : {
            "name" : [ "Preeti Gupta" ],
            "photo" : [ "https://aaronparecki.com/assets/images/no-profile-photo.png" ],
            "url" : [ "https://seocommunity.social/users/ilovechoclates_" ]
          },
          "value" : "Preeti Gupta"
        } ]
      },
      "value" : "https://aaronparecki.com/assets/images/no-profile-photo.png Preeti Gupta"
    }, {
      "type" : [ "h-cite" ],
      "properties" : {
        "url" : [ "https://mastodon.design/users/timotheegoguely#likes/354730" ],
        "author" : [ {
          "type" : [ "h-card" ],
          "properties" : {
            "name" : [ "Timothée Goguely" ],
            "photo" : [ "https://aaronparecki.com/assets/images/no-profile-photo.png" ],
            "url" : [ "https://mastodon.design/users/timotheegoguely" ]
          },
          "value" : "Timothée Goguely"
        } ]
      },
      "value" : "https://aaronparecki.com/assets/images/no-profile-photo.png Timothée Goguely"
    }, {
      "type" : [ "h-cite" ],
      "properties" : {
        "url" : [ "https://social.tchncs.de/users/pixelcode#likes/8407610" ],
        "author" : [ {
          "type" : [ "h-card" ],
          "properties" : {
            "name" : [ "Pixelcode 💙💛🕊️" ],
            "photo" : [ "https://aaronparecki.com/assets/images/no-profile-photo.png" ],
            "url" : [ "https://social.tchncs.de/users/pixelcode" ]
          },
          "value" : "Pixelcode 💙💛🕊️"
        } ]
      },
      "value" : "https://aaronparecki.com/assets/images/no-profile-photo.png Pixelcode 💙💛🕊️"
    }, {
      "type" : [ "h-cite" ],
      "properties" : {
        "url" : [ "https://social.tchncs.de/users/pixelcode#likes/8407609" ],
        "author" : [ {
          "type" : [ "h-card" ],
          "properties" : {
            "name" : [ "Pixelcode 💙💛🕊️" ],
            "photo" : [ "https://aaronparecki.com/assets/images/no-profile-photo.png" ],
            "url" : [ "https://social.tchncs.de/users/pixelcode" ]
          },
          "value" : "Pixelcode 💙💛🕊️"
        } ]
      },
      "value" : "https://aaronparecki.com/assets/images/no-profile-photo.png Pixelcode 💙💛🕊️"
    }, {
      "type" : [ "h-cite" ],
      "properties" : {
        "url" : [ "https://nona.social/users/dominik#likes/10703" ],
        "author" : [ {
          "type" : [ "h-card" ],
          "properties" : {
            "name" : [ "dominik schwind" ],
            "url" : [ "https://nona.social/users/dominik" ]
          },
          "value" : "dominik schwind"
        } ]
      },
      "value" : "https://aaronparecki.com/assets/images/no-profile-photo.png dominik schwind"
    }, {
      "type" : [ "h-cite" ],
      "properties" : {
        "url" : [ "https://fandom.ink/users/silver_huskey#likes/849772" ],
        "author" : [ {
          "type" : [ "h-card" ],
          "properties" : {
            "name" : [ "Silver Huskey 🔜 Otakon, FD" ],
            "photo" : [ "https://aaronparecki.com/assets/images/no-profile-photo.png" ],
            "url" : [ "https://fandom.ink/users/silver_huskey" ]
          },
          "value" : "Silver Huskey 🔜 Otakon, FD"
        } ]
      },
      "value" : "https://aaronparecki.com/assets/images/no-profile-photo.png Silver Huskey 🔜 Otakon, FD"
    }, {
      "type" : [ "h-cite" ],
      "properties" : {
        "url" : [ "https://mastodon.social/users/Kovah#likes/169538295" ],
        "author" : [ {
          "type" : [ "h-card" ],
          "properties" : {
            "name" : [ "Kevin Woblick" ],
            "photo" : [ "https://aaronparecki.com/assets/images/no-profile-photo.png" ],
            "url" : [ "https://mastodon.social/users/Kovah" ]
          },
          "value" : "Kevin Woblick"
        } ]
      },
      "value" : "https://aaronparecki.com/assets/images/no-profile-photo.png Kevin Woblick"
    }, {
      "type" : [ "h-cite" ],
      "properties" : {
        "url" : [ "https://weirder.earth/users/TQ#likes/5663511" ],
        "author" : [ {
          "type" : [ "h-card" ],
          "properties" : {
            "name" : [ "TQ ✨" ],
            "photo" : [ "https://aaronparecki.com/assets/images/no-profile-photo.png" ],
            "url" : [ "https://weirder.earth/users/TQ" ]
          },
          "value" : "TQ ✨"
        } ]
      },
      "value" : "https://aaronparecki.com/assets/images/no-profile-photo.png TQ ✨"
    }, {
      "type" : [ "h-cite" ],
      "properties" : {
        "url" : [ "https://s.zholnay.name/users/kirill#likes/23917" ],
        "author" : [ {
          "type" : [ "h-card" ],
          "properties" : {
            "name" : [ "Kirill Zholnay" ],
            "photo" : [ "https://aaronparecki.com/assets/images/no-profile-photo.png" ],
            "url" : [ "https://s.zholnay.name/users/kirill" ]
          },
          "value" : "Kirill Zholnay"
        } ]
      },
      "value" : "https://aaronparecki.com/assets/images/no-profile-photo.png Kirill Zholnay"
    }, {
      "type" : [ "h-cite" ],
      "properties" : {
        "url" : [ "https://ibe.social/likes/9vkflc8kh3" ],
        "author" : [ {
          "type" : [ "h-card" ],
          "properties" : {
            "name" : [ "Amy ☣" ],
            "photo" : [ "https://aaronparecki.com/assets/images/no-profile-photo.png" ],
            "url" : [ "https://ibe.social/users/9i2jn926l10lr1df" ]
          },
          "value" : "Amy ☣"
        } ]
      },
      "value" : "https://aaronparecki.com/assets/images/no-profile-photo.png Amy ☣"
    }, {
      "type" : [ "h-cite" ],
      "properties" : {
        "url" : [ "https://social.ds106.us/users/jimgroom#likes/38935" ],
        "author" : [ {
          "type" : [ "h-card" ],
          "properties" : {
            "name" : [ "jimgroom" ],
            "photo" : [ "https://aaronparecki.com/assets/images/no-profile-photo.png" ],
            "url" : [ "https://social.ds106.us/users/jimgroom" ]
          },
          "value" : "jimgroom"
        } ]
      },
      "value" : "https://aaronparecki.com/assets/images/no-profile-photo.png jimgroom"
    }, {
      "type" : [ "h-cite" ],
      "properties" : {
        "url" : [ "https://mastodon.art/users/Pepperly#likes/15724032" ],
        "author" : [ {
          "type" : [ "h-card" ],
          "properties" : {
            "name" : [ "Pepperly" ],
            "photo" : [ "https://aaronparecki.com/assets/images/no-profile-photo.png" ],
            "url" : [ "https://mastodon.art/users/Pepperly" ]
          },
          "value" : "Pepperly"
        } ]
      },
      "value" : "https://aaronparecki.com/assets/images/no-profile-photo.png Pepperly"
    }, {
      "type" : [ "h-cite" ],
      "properties" : {
        "url" : [ "https://sociale.network/users/oblomov#likes/839187" ],
        "author" : [ {
          "type" : [ "h-card" ],
          "properties" : {
            "name" : [ "Oblomov" ],
            "photo" : [ "https://aaronparecki.com/assets/images/no-profile-photo.png" ],
            "url" : [ "https://sociale.network/users/oblomov" ]
          },
          "value" : "Oblomov"
        } ]
      },
      "value" : "https://aaronparecki.com/assets/images/no-profile-photo.png Oblomov"
    }, {
      "type" : [ "h-cite" ],
      "properties" : {
        "url" : [ "https://ruby.social/users/ruben#likes/637348" ],
        "author" : [ {
          "type" : [ "h-card" ],
          "properties" : {
            "name" : [ "Ruben Arakelyan" ],
            "photo" : [ "https://aaronparecki.com/assets/images/no-profile-photo.png" ],
            "url" : [ "https://ruby.social/users/ruben" ]
          },
          "value" : "Ruben Arakelyan"
        } ]
      },
      "value" : "https://aaronparecki.com/assets/images/no-profile-photo.png Ruben Arakelyan"
    }, {
      "type" : [ "h-cite" ],
      "properties" : {
        "url" : [ "https://collapsible.systems/users/uthark#likes/2714" ],
        "author" : [ {
          "type" : [ "h-card" ],
          "properties" : {
            "name" : [ "hwps 🍄 🌱" ],
            "photo" : [ "https://aaronparecki.com/assets/images/no-profile-photo.png" ],
            "url" : [ "https://collapsible.systems/users/uthark" ]
          },
          "value" : "hwps 🍄 🌱"
        } ]
      },
      "value" : "https://aaronparecki.com/assets/images/no-profile-photo.png hwps 🍄 🌱"
    }, {
      "type" : [ "h-cite" ],
      "properties" : {
        "url" : [ "https://ioc.exchange/users/rye#likes/850648" ],
        "author" : [ {
          "type" : [ "h-card" ],
          "properties" : {
            "name" : [ "Rye" ],
            "photo" : [ "https://aaronparecki.com/assets/images/no-profile-photo.png" ],
            "url" : [ "https://ioc.exchange/users/rye" ]
          },
          "value" : "Rye"
        } ]
      },
      "value" : "https://aaronparecki.com/assets/images/no-profile-photo.png Rye"
    }, {
      "type" : [ "h-cite" ],
      "properties" : {
        "url" : [ "https://bsd.network/users/AFresh1#likes/1528296" ],
        "author" : [ {
          "type" : [ "h-card" ],
          "properties" : {
            "name" : [ "Andrew Hewus Fresh" ],
            "photo" : [ "https://aaronparecki.com/assets/images/no-profile-photo.png" ],
            "url" : [ "https://bsd.network/users/AFresh1" ]
          },
          "value" : "Andrew Hewus Fresh"
        } ]
      },
      "value" : "https://aaronparecki.com/assets/images/no-profile-photo.png Andrew Hewus Fresh"
    }, {
      "type" : [ "h-cite" ],
      "properties" : {
        "url" : [ "https://chirp.enworld.org/users/taichara#likes/164965" ],
        "author" : [ {
          "type" : [ "h-card" ],
          "properties" : {
            "name" : [ "taichara" ],
            "photo" : [ "https://aaronparecki.com/assets/images/no-profile-photo.png" ],
            "url" : [ "https://chirp.enworld.org/users/taichara" ]
          },
          "value" : "taichara"
        } ]
      },
      "value" : "https://aaronparecki.com/assets/images/no-profile-photo.png taichara"
    }, {
      "type" : [ "h-cite" ],
      "properties" : {
        "url" : [ "https://gladtech.social/users/happystardiaz#likes/41547" ],
        "author" : [ {
          "type" : [ "h-card" ],
          "properties" : {
            "name" : [ "HappyStarDiaz" ],
            "photo" : [ "https://aaronparecki.com/assets/images/no-profile-photo.png" ],
            "url" : [ "https://gladtech.social/users/happystardiaz" ]
          },
          "value" : "HappyStarDiaz"
        } ]
      },
      "value" : "https://aaronparecki.com/assets/images/no-profile-photo.png HappyStarDiaz"
    }, {
      "type" : [ "h-cite" ],
      "properties" : {
        "url" : [ "https://mastodon.social/users/whiteja#likes/169514510" ],
        "author" : [ {
          "type" : [ "h-card" ],
          "properties" : {
            "name" : [ "JW" ],
            "photo" : [ "https://aaronparecki.com/assets/images/no-profile-photo.png" ],
            "url" : [ "https://mastodon.social/users/whiteja" ]
          },
          "value" : "JW"
        } ]
      },
      "value" : "https://aaronparecki.com/assets/images/no-profile-photo.png JW"
    }, {
      "type" : [ "h-cite" ],
      "properties" : {
        "url" : [ "https://ruby.social/users/mcphat#likes/637303" ],
        "author" : [ {
          "type" : [ "h-card" ],
          "properties" : {
            "name" : [ "Jeff McFadden" ],
            "photo" : [ "https://aaronparecki.com/assets/images/no-profile-photo.png" ],
            "url" : [ "https://ruby.social/users/mcphat" ]
          },
          "value" : "Jeff McFadden"
        } ]
      },
      "value" : "https://aaronparecki.com/assets/images/no-profile-photo.png Jeff McFadden"
    }, {
      "type" : [ "h-cite" ],
      "properties" : {
        "url" : [ "https://mastodon.social/users/conniptions#likes/169510289" ],
        "author" : [ {
          "type" : [ "h-card" ],
          "properties" : {
            "name" : [ "Wayne Myers" ],
            "photo" : [ "https://aaronparecki.com/assets/images/no-profile-photo.png" ],
            "url" : [ "https://mastodon.social/users/conniptions" ]
          },
          "value" : "Wayne Myers"
        } ]
      },
      "value" : "https://aaronparecki.com/assets/images/no-profile-photo.png Wayne Myers"
    }, {
      "type" : [ "h-cite" ],
      "properties" : {
        "url" : [ "https://mastodon.online/users/carpetbomberz#likes/20246622" ],
        "author" : [ {
          "type" : [ "h-card" ],
          "properties" : {
            "name" : [ "carpetbomberz" ],
            "photo" : [ "https://aaronparecki.com/assets/images/no-profile-photo.png" ],
            "url" : [ "https://mastodon.online/users/carpetbomberz" ]
          },
          "value" : "carpetbomberz"
        } ]
      },
      "value" : "https://aaronparecki.com/assets/images/no-profile-photo.png carpetbomberz"
    }, {
      "type" : [ "h-cite" ],
      "properties" : {
        "url" : [ "https://mas.to/users/asayakkara#likes/19347191" ],
        "author" : [ {
          "type" : [ "h-card" ],
          "properties" : {
            "name" : [ "Asanka Sayakkara" ],
            "photo" : [ "https://aaronparecki.com/assets/images/no-profile-photo.png" ],
            "url" : [ "https://mas.to/users/asayakkara" ]
          },
          "value" : "Asanka Sayakkara"
        } ]
      },
      "value" : "https://aaronparecki.com/assets/images/no-profile-photo.png Asanka Sayakkara"
    }, {
      "type" : [ "h-cite" ],
      "properties" : {
        "url" : [ "https://fosstodon.org/users/nattukaran#likes/9581478" ],
        "author" : [ {
          "type" : [ "h-card" ],
          "properties" : {
            "name" : [ "vachan" ],
            "photo" : [ "https://aaronparecki.com/assets/images/no-profile-photo.png" ],
            "url" : [ "https://fosstodon.org/users/nattukaran" ]
          },
          "value" : "vachan"
        } ]
      },
      "value" : "https://aaronparecki.com/assets/images/no-profile-photo.png vachan"
    }, {
      "type" : [ "h-cite" ],
      "properties" : {
        "url" : [ "https://ak.infernal.garden/activities/57d14f93-37c6-48a3-acc3-7d4c20c5d115" ],
        "author" : [ {
          "type" : [ "h-card" ],
          "properties" : {
            "name" : [ "curly | 水ちちゃん" ],
            "photo" : [ "https://aaronparecki.com/assets/images/no-profile-photo.png" ],
            "url" : [ "https://ak.infernal.garden/users/glass" ]
          },
          "value" : "curly | 水ちちゃん"
        } ]
      },
      "value" : "https://aaronparecki.com/assets/images/no-profile-photo.png curly | 水ちちゃん"
    }, {
      "type" : [ "h-cite" ],
      "properties" : {
        "url" : [ "https://techhub.social/users/diazona#likes/2776802" ],
        "author" : [ {
          "type" : [ "h-card" ],
          "properties" : {
            "name" : [ "David Zaslavsky" ],
            "photo" : [ "https://aaronparecki.com/assets/images/no-profile-photo.png" ],
            "url" : [ "https://techhub.social/users/diazona" ]
          },
          "value" : "David Zaslavsky"
        } ]
      },
      "value" : "https://aaronparecki.com/assets/images/no-profile-photo.png David Zaslavsky"
    }, {
      "type" : [ "h-cite" ],
      "properties" : {
        "url" : [ "https://indieweb.social/users/edward#likes/1772145" ],
        "author" : [ {
          "type" : [ "h-card" ],
          "properties" : {
            "name" : [ "Edward Loveall" ],
            "photo" : [ "https://aaronparecki.com/assets/images/no-profile-photo.png" ],
            "url" : [ "https://indieweb.social/users/edward" ]
          },
          "value" : "Edward Loveall"
        } ]
      },
      "value" : "https://aaronparecki.com/assets/images/no-profile-photo.png Edward Loveall"
    }, {
      "type" : [ "h-cite" ],
      "properties" : {
        "url" : [ "https://merveilles.town/users/FredBednarski#likes/2166952" ],
        "author" : [ {
          "type" : [ "h-card" ],
          "properties" : {
            "name" : [ "frd💾" ],
            "photo" : [ "https://aaronparecki.com/assets/images/no-profile-photo.png" ],
            "url" : [ "https://merveilles.town/users/FredBednarski" ]
          },
          "value" : "frd💾"
        } ]
      },
      "value" : "https://aaronparecki.com/assets/images/no-profile-photo.png frd💾"
    }, {
      "type" : [ "h-cite" ],
      "properties" : {
        "url" : [ "https://hachyderm.io/users/facundoolano#likes/11072934" ],
        "author" : [ {
          "type" : [ "h-card" ],
          "properties" : {
            "name" : [ "Facundo Olano" ],
            "photo" : [ "https://aaronparecki.com/assets/images/no-profile-photo.png" ],
            "url" : [ "https://hachyderm.io/users/facundoolano" ]
          },
          "value" : "Facundo Olano"
        } ]
      },
      "value" : "https://aaronparecki.com/assets/images/no-profile-photo.png Facundo Olano"
    }, {
      "type" : [ "h-cite" ],
      "properties" : {
        "url" : [ "https://social.lol/users/ww#likes/870858" ],
        "author" : [ {
          "type" : [ "h-card" ],
          "properties" : {
            "name" : [ "Westley Winks" ],
            "photo" : [ "https://aaronparecki.com/assets/images/no-profile-photo.png" ],
            "url" : [ "https://social.lol/users/ww" ]
          },
          "value" : "Westley Winks"
        } ]
      },
      "value" : "https://aaronparecki.com/assets/images/no-profile-photo.png Westley Winks"
    }, {
      "type" : [ "h-cite" ],
      "properties" : {
        "url" : [ "https://tech.lgbt/users/nina_kali_nina#likes/14307970" ],
        "author" : [ {
          "type" : [ "h-card" ],
          "properties" : {
            "name" : [ "Nina Kalinina" ],
            "photo" : [ "https://aaronparecki.com/assets/images/no-profile-photo.png" ],
            "url" : [ "https://tech.lgbt/users/nina_kali_nina" ]
          },
          "value" : "Nina Kalinina"
        } ]
      },
      "value" : "https://aaronparecki.com/assets/images/no-profile-photo.png Nina Kalinina"
    }, {
      "type" : [ "h-cite" ],
      "properties" : {
        "url" : [ "https://social.lol/users/allaboutgeorge#likes/870837" ],
        "author" : [ {
          "type" : [ "h-card" ],
          "properties" : {
            "name" : [ "" ],
            "url" : [ "https://social.lol/users/allaboutgeorge" ]
          },
          "value" : "https://aaronparecki.com/assets/images/no-profile-photo.png"
        } ]
      },
      "value" : "https://aaronparecki.com/assets/images/no-profile-photo.png"
    }, {
      "type" : [ "h-cite" ],
      "properties" : {
        "url" : [ "https://vis.social/users/kristinHenry#likes/658286" ],
        "author" : [ {
          "type" : [ "h-card" ],
          "properties" : {
            "name" : [ "Kristin Henry" ],
            "photo" : [ "https://aaronparecki.com/assets/images/no-profile-photo.png" ],
            "url" : [ "https://vis.social/users/kristinHenry" ]
          },
          "value" : "Kristin Henry"
        } ]
      },
      "value" : "https://aaronparecki.com/assets/images/no-profile-photo.png Kristin Henry"
    }, {
      "type" : [ "h-cite" ],
      "properties" : {
        "url" : [ "https://gamedev.lgbt/users/renkotsuban#likes/211828" ],
        "author" : [ {
          "type" : [ "h-card" ],
          "properties" : {
            "name" : [ "Renkon" ],
            "photo" : [ "https://aaronparecki.com/assets/images/no-profile-photo.png" ],
            "url" : [ "https://gamedev.lgbt/users/renkotsuban" ]
          },
          "value" : "Renkon"
        } ]
      },
      "value" : "https://aaronparecki.com/assets/images/no-profile-photo.png Renkon"
    }, {
      "type" : [ "h-cite" ],
      "properties" : {
        "url" : [ "https://c.im/users/Lilmikesf#likes/4359815" ],
        "author" : [ {
          "type" : [ "h-card" ],
          "properties" : {
            "name" : [ "LilMikeSF" ],
            "photo" : [ "https://aaronparecki.com/assets/images/no-profile-photo.png" ],
            "url" : [ "https://c.im/users/Lilmikesf" ]
          },
          "value" : "LilMikeSF"
        } ]
      },
      "value" : "https://aaronparecki.com/assets/images/no-profile-photo.png LilMikeSF"
    }, {
      "type" : [ "h-cite" ],
      "properties" : {
        "url" : [ "https://pdx.social/users/a#likes/518138" ],
        "author" : [ {
          "type" : [ "h-card" ],
          "properties" : {
            "name" : [ "Anthony Sorace" ],
            "photo" : [ "https://aaronparecki.com/assets/images/no-profile-photo.png" ],
            "url" : [ "https://pdx.social/users/a" ]
          },
          "value" : "Anthony Sorace"
        } ]
      },
      "value" : "https://aaronparecki.com/assets/images/no-profile-photo.png Anthony Sorace"
    }, {
      "type" : [ "h-cite" ],
      "properties" : {
        "url" : [ "https://mastodon.social/users/rowanda#likes/169499544" ],
        "author" : [ {
          "type" : [ "h-card" ],
          "properties" : {
            "name" : [ "rowanda" ],
            "photo" : [ "https://aaronparecki.com/assets/images/no-profile-photo.png" ],
            "url" : [ "https://mastodon.social/users/rowanda" ]
          },
          "value" : "rowanda"
        } ]
      },
      "value" : "https://aaronparecki.com/assets/images/no-profile-photo.png rowanda"
    }, {
      "type" : [ "h-cite" ],
      "properties" : {
        "url" : [ "https://hcommons.social/users/ryanrandall#likes/520099" ],
        "author" : [ {
          "type" : [ "h-card" ],
          "properties" : {
            "name" : [ "Ryan P. Randall" ],
            "photo" : [ "https://aaronparecki.com/assets/images/no-profile-photo.png" ],
            "url" : [ "https://hcommons.social/users/ryanrandall" ]
          },
          "value" : "Ryan P. Randall"
        } ]
      },
      "value" : "https://aaronparecki.com/assets/images/no-profile-photo.png Ryan P. Randall"
    }, {
      "type" : [ "h-cite" ],
      "properties" : {
        "url" : [ "https://infosec.exchange/users/tychotithonus#likes/11111907" ],
        "author" : [ {
          "type" : [ "h-card" ],
          "properties" : {
            "name" : [ "Royce Williams" ],
            "photo" : [ "https://aaronparecki.com/assets/images/no-profile-photo.png" ],
            "url" : [ "https://infosec.exchange/users/tychotithonus" ]
          },
          "value" : "Royce Williams"
        } ]
      },
      "value" : "https://aaronparecki.com/assets/images/no-profile-photo.png Royce Williams"
    }, {
      "type" : [ "h-cite" ],
      "properties" : {
        "url" : [ "https://mstdn.games/users/shaneisgames#likes/1233754" ],
        "author" : [ {
          "type" : [ "h-card" ],
          "properties" : {
            "name" : [ "ShaneIsGames" ],
            "photo" : [ "https://aaronparecki.com/assets/images/no-profile-photo.png" ],
            "url" : [ "https://mstdn.games/users/shaneisgames" ]
          },
          "value" : "ShaneIsGames"
        } ]
      },
      "value" : "https://aaronparecki.com/assets/images/no-profile-photo.png ShaneIsGames"
    }, {
      "type" : [ "h-cite" ],
      "properties" : {
        "url" : [ "https://mastodon.social/users/waynedixon#likes/169497026" ],
        "author" : [ {
          "type" : [ "h-card" ],
          "properties" : {
            "name" : [ "Wayne Dixon" ],
            "photo" : [ "https://aaronparecki.com/assets/images/no-profile-photo.png" ],
            "url" : [ "https://mastodon.social/users/waynedixon" ]
          },
          "value" : "Wayne Dixon"
        } ]
      },
      "value" : "https://aaronparecki.com/assets/images/no-profile-photo.png Wayne Dixon"
    }, {
      "type" : [ "h-cite" ],
      "properties" : {
        "url" : [ "https://mastodon.social/users/SeanMarsala#likes/169496307" ],
        "author" : [ {
          "type" : [ "h-card" ],
          "properties" : {
            "name" : [ "Sean" ],
            "photo" : [ "https://aaronparecki.com/assets/images/no-profile-photo.png" ],
            "url" : [ "https://mastodon.social/users/SeanMarsala" ]
          },
          "value" : "Sean"
        } ]
      },
      "value" : "https://aaronparecki.com/assets/images/no-profile-photo.png Sean"
    }, {
      "type" : [ "h-cite" ],
      "properties" : {
        "url" : [ "https://mastodon.social/users/franciswashere#likes/169496042" ],
        "author" : [ {
          "type" : [ "h-card" ],
          "properties" : {
            "name" : [ "Francis Mangion (M)" ],
            "photo" : [ "https://aaronparecki.com/assets/images/no-profile-photo.png" ],
            "url" : [ "https://mastodon.social/users/franciswashere" ]
          },
          "value" : "Francis Mangion (M)"
        } ]
      },
      "value" : "https://aaronparecki.com/assets/images/no-profile-photo.png Francis Mangion (M)"
    }, {
      "type" : [ "h-cite" ],
      "properties" : {
        "url" : [ "https://hachyderm.io/users/joby#likes/11072122" ],
        "author" : [ {
          "type" : [ "h-card" ],
          "properties" : {
            "name" : [ "Joby (chaotic good)" ],
            "photo" : [ "https://aaronparecki.com/assets/images/no-profile-photo.png" ],
            "url" : [ "https://hachyderm.io/users/joby" ]
          },
          "value" : "Joby (chaotic good)"
        } ]
      },
      "value" : "https://aaronparecki.com/assets/images/no-profile-photo.png Joby (chaotic good)"
    }, {
      "type" : [ "h-cite" ],
      "properties" : {
        "url" : [ "https://wears.tigerpajamas.com/users/jon#likes/3326" ],
        "author" : [ {
          "type" : [ "h-card" ],
          "properties" : {
            "name" : [ "Jon Mitchell" ],
            "photo" : [ "https://aaronparecki.com/assets/images/no-profile-photo.png" ],
            "url" : [ "https://wears.tigerpajamas.com/users/jon" ]
          },
          "value" : "Jon Mitchell"
        } ]
      },
      "value" : "https://aaronparecki.com/assets/images/no-profile-photo.png Jon Mitchell"
    }, {
      "type" : [ "h-cite" ],
      "properties" : {
        "url" : [ "https://indieweb.social/users/caesar#likes/1772022" ],
        "author" : [ {
          "type" : [ "h-card" ],
          "properties" : {
            "name" : [ "Caesar" ],
            "url" : [ "https://indieweb.social/users/caesar" ]
          },
          "value" : "Caesar"
        } ]
      },
      "value" : "https://aaronparecki.com/assets/images/no-profile-photo.png Caesar"
    }, {
      "type" : [ "h-cite" ],
      "properties" : {
        "url" : [ "https://mastodon.social/users/karabaic#likes/169494271" ],
        "author" : [ {
          "type" : [ "h-card" ],
          "properties" : {
            "name" : [ "jack the nonabrasive" ],
            "photo" : [ "https://aaronparecki.com/assets/images/no-profile-photo.png" ],
            "url" : [ "https://mastodon.social/users/karabaic" ]
          },
          "value" : "jack the nonabrasive"
        } ]
      },
      "value" : "https://aaronparecki.com/assets/images/no-profile-photo.png jack the nonabrasive"
    }, {
      "type" : [ "h-cite" ],
      "properties" : {
        "url" : [ "https://hachyderm.io/users/levlaz#likes/11071814" ],
        "author" : [ {
          "type" : [ "h-card" ],
          "properties" : {
            "name" : [ "Lev Lazinskiy 🏳️‍🌈" ],
            "photo" : [ "https://aaronparecki.com/assets/images/no-profile-photo.png" ],
            "url" : [ "https://hachyderm.io/users/levlaz" ]
          },
          "value" : "Lev Lazinskiy 🏳️‍🌈"
        } ]
      },
      "value" : "https://aaronparecki.com/assets/images/no-profile-photo.png Lev Lazinskiy 🏳️‍🌈"
    } ],
    "repost" : [ {
      "type" : [ "h-cite" ],
      "properties" : {
        "url" : [ "https://mastodon.social/users/adamkowol/statuses/112770087889513390/activity" ],
        "author" : [ {
          "type" : [ "h-card" ],
          "properties" : {
            "name" : [ "Adam Kowol" ],
            "photo" : [ "https://aaronparecki.com/assets/images/no-profile-photo.png" ],
            "url" : [ "https://mastodon.social/users/adamkowol" ]
          },
          "value" : "Adam Kowol"
        } ]
      },
      "value" : "https://aaronparecki.com/assets/images/no-profile-photo.png Adam Kowol"
    }, {
      "type" : [ "h-cite" ],
      "properties" : {
        "url" : [ "https://mastodon.social/users/salixsericea/statuses/112769820046662477/activity" ],
        "author" : [ {
          "type" : [ "h-card" ],
          "properties" : {
            "name" : [ "salix sericea (@Ripple13216)" ],
            "photo" : [ "https://aaronparecki.com/assets/images/no-profile-photo.png" ],
            "url" : [ "https://mastodon.social/users/salixsericea" ]
          },
          "value" : "salix sericea (@Ripple13216)"
        } ]
      },
      "value" : "https://aaronparecki.com/assets/images/no-profile-photo.png salix sericea (@Ripple13216)"
    }, {
      "type" : [ "h-cite" ],
      "properties" : {
        "url" : [ "https://indieweb.social/users/amblergee/statuses/112769461828416411/activity" ],
        "author" : [ {
          "type" : [ "h-card" ],
          "properties" : {
            "name" : [ "Agyei Gyasi" ],
            "photo" : [ "https://aaronparecki.com/assets/images/no-profile-photo.png" ],
            "url" : [ "https://indieweb.social/users/amblergee" ]
          },
          "value" : "Agyei Gyasi"
        } ]
      },
      "value" : "https://aaronparecki.com/assets/images/no-profile-photo.png Agyei Gyasi"
    }, {
      "type" : [ "h-cite" ],
      "properties" : {
        "url" : [ "https://mastodon.social/users/gregdaynes/statuses/112768581164202592/activity" ],
        "author" : [ {
          "type" : [ "h-card" ],
          "properties" : {
            "name" : [ "Gregory Daynes" ],
            "photo" : [ "https://aaronparecki.com/assets/images/no-profile-photo.png" ],
            "url" : [ "https://mastodon.social/users/gregdaynes" ]
          },
          "value" : "Gregory Daynes"
        } ]
      },
      "value" : "https://aaronparecki.com/assets/images/no-profile-photo.png Gregory Daynes"
    }, {
      "type" : [ "h-cite" ],
      "properties" : {
        "url" : [ "https://bananachips.club/users/qwazix/statuses/112768448610441059/activity" ],
        "author" : [ {
          "type" : [ "h-card" ],
          "properties" : {
            "name" : [ "qwazix" ],
            "photo" : [ "https://aaronparecki.com/assets/images/no-profile-photo.png" ],
            "url" : [ "https://bananachips.club/users/qwazix" ]
          },
          "value" : "qwazix"
        } ]
      },
      "value" : "https://aaronparecki.com/assets/images/no-profile-photo.png qwazix"
    }, {
      "type" : [ "h-cite" ],
      "properties" : {
        "url" : [ "https://perkins.pub/users/alec/statuses/112767989697188794/activity" ],
        "author" : [ {
          "type" : [ "h-card" ],
          "properties" : {
            "name" : [ "Alec Perkins" ],
            "photo" : [ "https://aaronparecki.com/assets/images/no-profile-photo.png" ],
            "url" : [ "https://perkins.pub/users/alec" ]
          },
          "value" : "Alec Perkins"
        } ]
      },
      "value" : "https://aaronparecki.com/assets/images/no-profile-photo.png Alec Perkins"
    }, {
      "type" : [ "h-cite" ],
      "properties" : {
        "url" : [ "https://tabletop.social/users/mxfraud/statuses/112767936644527933/activity" ],
        "author" : [ {
          "type" : [ "h-card" ],
          "properties" : {
            "name" : [ "MxFraud" ],
            "photo" : [ "https://aaronparecki.com/assets/images/no-profile-photo.png" ],
            "url" : [ "https://tabletop.social/users/mxfraud" ]
          },
          "value" : "MxFraud"
        } ]
      },
      "value" : "https://aaronparecki.com/assets/images/no-profile-photo.png MxFraud"
    }, {
      "type" : [ "h-cite" ],
      "properties" : {
        "url" : [ "https://toolsforthought.social/users/billseitz/statuses/112767915713430092/activity" ],
        "author" : [ {
          "type" : [ "h-card" ],
          "properties" : {
            "name" : [ "Bill Seitz" ],
            "photo" : [ "https://aaronparecki.com/assets/images/no-profile-photo.png" ],
            "url" : [ "https://toolsforthought.social/users/billseitz" ]
          },
          "value" : "Bill Seitz"
        } ]
      },
      "value" : "https://aaronparecki.com/assets/images/no-profile-photo.png Bill Seitz"
    }, {
      "type" : [ "h-cite" ],
      "properties" : {
        "url" : [ "https://mastodon.gamedev.place/users/kzurawel/statuses/112767865537947558/activity" ],
        "author" : [ {
          "type" : [ "h-card" ],
          "properties" : {
            "name" : [ "kzurawel" ],
            "photo" : [ "https://aaronparecki.com/assets/images/no-profile-photo.png" ],
            "url" : [ "https://mastodon.gamedev.place/users/kzurawel" ]
          },
          "value" : "kzurawel"
        } ]
      },
      "value" : "https://aaronparecki.com/assets/images/no-profile-photo.png kzurawel"
    }, {
      "type" : [ "h-cite" ],
      "properties" : {
        "url" : [ "https://social.coop/users/brainwane/statuses/112767762347922083/activity" ],
        "author" : [ {
          "type" : [ "h-card" ],
          "properties" : {
            "name" : [ "Sumana Harihareswara" ],
            "photo" : [ "https://aaronparecki.com/assets/images/no-profile-photo.png" ],
            "url" : [ "https://social.coop/users/brainwane" ]
          },
          "value" : "Sumana Harihareswara"
        } ]
      },
      "value" : "https://aaronparecki.com/assets/images/no-profile-photo.png Sumana Harihareswara"
    }, {
      "type" : [ "h-cite" ],
      "properties" : {
        "url" : [ "https://degrowth.social/users/yala/statuses/112767612249064953/activity" ],
        "author" : [ {
          "type" : [ "h-card" ],
          "properties" : {
            "name" : [ "jon ⚝" ],
            "photo" : [ "https://aaronparecki.com/assets/images/no-profile-photo.png" ],
            "url" : [ "https://degrowth.social/users/yala" ]
          },
          "value" : "jon ⚝"
        } ]
      },
      "value" : "https://aaronparecki.com/assets/images/no-profile-photo.png jon ⚝"
    }, {
      "type" : [ "h-cite" ],
      "properties" : {
        "url" : [ "https://fedihum.org/users/dta_cthomas/statuses/112767578980234827/activity" ],
        "author" : [ {
          "type" : [ "h-card" ],
          "properties" : {
            "name" : [ "Christian Thomas" ],
            "photo" : [ "https://aaronparecki.com/assets/images/no-profile-photo.png" ],
            "url" : [ "https://fedihum.org/users/dta_cthomas" ]
          },
          "value" : "Christian Thomas"
        } ]
      },
      "value" : "https://aaronparecki.com/assets/images/no-profile-photo.png Christian Thomas"
    }, {
      "type" : [ "h-cite" ],
      "properties" : {
        "url" : [ "https://mastodon.ie/users/artnacrea/statuses/112767525451697954/activity" ],
        "author" : [ {
          "type" : [ "h-card" ],
          "properties" : {
            "name" : [ "Andy Linton ✅" ],
            "photo" : [ "https://aaronparecki.com/assets/images/no-profile-photo.png" ],
            "url" : [ "https://mastodon.ie/users/artnacrea" ]
          },
          "value" : "Andy Linton ✅"
        } ]
      },
      "value" : "https://aaronparecki.com/assets/images/no-profile-photo.png Andy Linton ✅"
    }, {
      "type" : [ "h-cite" ],
      "properties" : {
        "url" : [ "https://mstdn.social/users/BridgetAlmas/statuses/112767490572199832/activity" ],
        "author" : [ {
          "type" : [ "h-card" ],
          "properties" : {
            "name" : [ "Bridget Almas" ],
            "photo" : [ "https://aaronparecki.com/assets/images/no-profile-photo.png" ],
            "url" : [ "https://mstdn.social/users/BridgetAlmas" ]
          },
          "value" : "Bridget Almas"
        } ]
      },
      "value" : "https://aaronparecki.com/assets/images/no-profile-photo.png Bridget Almas"
    }, {
      "type" : [ "h-cite" ],
      "properties" : {
        "url" : [ "https://mastodon.social/users/welrbraga/statuses/112767490710917062/activity" ],
        "author" : [ {
          "type" : [ "h-card" ],
          "properties" : {
            "name" : [ "Welington 🐘" ],
            "photo" : [ "https://aaronparecki.com/assets/images/no-profile-photo.png" ],
            "url" : [ "https://mastodon.social/users/welrbraga" ]
          },
          "value" : "Welington 🐘"
        } ]
      },
      "value" : "https://aaronparecki.com/assets/images/no-profile-photo.png Welington 🐘"
    }, {
      "type" : [ "h-cite" ],
      "properties" : {
        "url" : [ "https://mastodon.social/users/skry/statuses/112767413581751140/activity" ],
        "author" : [ {
          "type" : [ "h-card" ],
          "properties" : {
            "name" : [ "skry" ],
            "photo" : [ "https://aaronparecki.com/assets/images/no-profile-photo.png" ],
            "url" : [ "https://mastodon.social/users/skry" ]
          },
          "value" : "skry"
        } ]
      },
      "value" : "https://aaronparecki.com/assets/images/no-profile-photo.png skry"
    }, {
      "type" : [ "h-cite" ],
      "properties" : {
        "url" : [ "https://seocommunity.social/users/ilovechoclates_/statuses/112767406670063652/activity" ],
        "author" : [ {
          "type" : [ "h-card" ],
          "properties" : {
            "name" : [ "Preeti Gupta" ],
            "photo" : [ "https://aaronparecki.com/assets/images/no-profile-photo.png" ],
            "url" : [ "https://seocommunity.social/users/ilovechoclates_" ]
          },
          "value" : "Preeti Gupta"
        } ]
      },
      "value" : "https://aaronparecki.com/assets/images/no-profile-photo.png Preeti Gupta"
    }, {
      "type" : [ "h-cite" ],
      "properties" : {
        "url" : [ "https://mastodon.design/users/timotheegoguely/statuses/112767346303866306/activity" ],
        "author" : [ {
          "type" : [ "h-card" ],
          "properties" : {
            "name" : [ "Timothée Goguely" ],
            "photo" : [ "https://aaronparecki.com/assets/images/no-profile-photo.png" ],
            "url" : [ "https://mastodon.design/users/timotheegoguely" ]
          },
          "value" : "Timothée Goguely"
        } ]
      },
      "value" : "https://aaronparecki.com/assets/images/no-profile-photo.png Timothée Goguely"
    }, {
      "type" : [ "h-cite" ],
      "properties" : {
        "url" : [ "https://mastodon.design/users/kajou/statuses/112767252478237483/activity" ],
        "author" : [ {
          "type" : [ "h-card" ],
          "properties" : {
            "name" : [ "kiara" ],
            "photo" : [ "https://aaronparecki.com/assets/images/no-profile-photo.png" ],
            "url" : [ "https://mastodon.design/users/kajou" ]
          },
          "value" : "kiara"
        } ]
      },
      "value" : "https://aaronparecki.com/assets/images/no-profile-photo.png kiara"
    }, {
      "type" : [ "h-cite" ],
      "properties" : {
        "url" : [ "https://seocommunity.social/users/simoncox/statuses/112767117693126592/activity" ],
        "author" : [ {
          "type" : [ "h-card" ],
          "properties" : {
            "name" : [ "Simon Cox :SEO:" ],
            "photo" : [ "https://aaronparecki.com/assets/images/no-profile-photo.png" ],
            "url" : [ "https://seocommunity.social/users/simoncox" ]
          },
          "value" : "Simon Cox :SEO:"
        } ]
      },
      "value" : "https://aaronparecki.com/assets/images/no-profile-photo.png Simon Cox :SEO:"
    }, {
      "type" : [ "h-cite" ],
      "properties" : {
        "url" : [ "https://mastodon.social/users/adactio/statuses/112767086802855614/activity" ],
        "author" : [ {
          "type" : [ "h-card" ],
          "properties" : {
            "name" : [ "Jeremy Keith" ],
            "photo" : [ "https://aaronparecki.com/assets/images/no-profile-photo.png" ],
            "url" : [ "https://mastodon.social/users/adactio" ]
          },
          "value" : "Jeremy Keith"
        } ]
      },
      "value" : "https://aaronparecki.com/assets/images/no-profile-photo.png Jeremy Keith"
    }, {
      "type" : [ "h-cite" ],
      "properties" : {
        "url" : [ "https://fosstodon.org/users/ttntm/statuses/112766774633668778/activity" ],
        "author" : [ {
          "type" : [ "h-card" ],
          "properties" : {
            "name" : [ "ttntm 🚀" ],
            "photo" : [ "https://aaronparecki.com/assets/images/no-profile-photo.png" ],
            "url" : [ "https://fosstodon.org/users/ttntm" ]
          },
          "value" : "ttntm 🚀"
        } ]
      },
      "value" : "https://aaronparecki.com/assets/images/no-profile-photo.png ttntm 🚀"
    }, {
      "type" : [ "h-cite" ],
      "properties" : {
        "url" : [ "https://mastodon.social/users/Kovah/statuses/112766648790257523/activity" ],
        "author" : [ {
          "type" : [ "h-card" ],
          "properties" : {
            "name" : [ "Kevin Woblick" ],
            "photo" : [ "https://aaronparecki.com/assets/images/no-profile-photo.png" ],
            "url" : [ "https://mastodon.social/users/Kovah" ]
          },
          "value" : "Kevin Woblick"
        } ]
      },
      "value" : "https://aaronparecki.com/assets/images/no-profile-photo.png Kevin Woblick"
    }, {
      "type" : [ "h-cite" ],
      "properties" : {
        "url" : [ "https://indieweb.social/users/immarisabel/statuses/112766617469084419/activity" ],
        "author" : [ {
          "type" : [ "h-card" ],
          "properties" : {
            "name" : [ "Marisabel Munoz" ],
            "photo" : [ "https://aaronparecki.com/assets/images/no-profile-photo.png" ],
            "url" : [ "https://indieweb.social/users/immarisabel" ]
          },
          "value" : "Marisabel Munoz"
        } ]
      },
      "value" : "https://aaronparecki.com/assets/images/no-profile-photo.png Marisabel Munoz"
    }, {
      "type" : [ "h-cite" ],
      "properties" : {
        "url" : [ "https://cosocial.ca/users/cogdog/statuses/112766531206016587/activity" ],
        "author" : [ {
          "type" : [ "h-card" ],
          "properties" : {
            "name" : [ "Alan Levine" ],
            "photo" : [ "https://aaronparecki.com/assets/images/no-profile-photo.png" ],
            "url" : [ "https://cosocial.ca/users/cogdog" ]
          },
          "value" : "Alan Levine"
        } ]
      },
      "value" : "https://aaronparecki.com/assets/images/no-profile-photo.png Alan Levine"
    }, {
      "type" : [ "h-cite" ],
      "properties" : {
        "url" : [ "https://digitalcourage.social/users/mro/statuses/112766471206400485/activity" ],
        "author" : [ {
          "type" : [ "h-card" ],
          "properties" : {
            "name" : [ "Marcus Rohrmoser 🌍" ],
            "photo" : [ "https://aaronparecki.com/assets/images/no-profile-photo.png" ],
            "url" : [ "https://digitalcourage.social/users/mro" ]
          },
          "value" : "Marcus Rohrmoser 🌍"
        } ]
      },
      "value" : "https://aaronparecki.com/assets/images/no-profile-photo.png Marcus Rohrmoser 🌍"
    }, {
      "type" : [ "h-cite" ],
      "properties" : {
        "url" : [ "https://crispsandwi.ch/users/mattround/statuses/112766466839258108/activity" ],
        "author" : [ {
          "type" : [ "h-card" ],
          "properties" : {
            "name" : [ "Matt Round" ],
            "photo" : [ "https://aaronparecki.com/assets/images/no-profile-photo.png" ],
            "url" : [ "https://crispsandwi.ch/users/mattround" ]
          },
          "value" : "Matt Round"
        } ]
      },
      "value" : "https://aaronparecki.com/assets/images/no-profile-photo.png Matt Round"
    }, {
      "type" : [ "h-cite" ],
      "properties" : {
        "url" : [ "https://dosgame.club/users/lunarloony/statuses/112766325264124014/activity" ],
        "author" : [ {
          "type" : [ "h-card" ],
          "properties" : {
            "name" : [ "Lunar 🛸 ♾" ],
            "photo" : [ "https://aaronparecki.com/assets/images/no-profile-photo.png" ],
            "url" : [ "https://dosgame.club/users/lunarloony" ]
          },
          "value" : "Lunar 🛸 ♾"
        } ]
      },
      "value" : "https://aaronparecki.com/assets/images/no-profile-photo.png Lunar 🛸 ♾"
    }, {
      "type" : [ "h-cite" ],
      "properties" : {
        "url" : [ "https://rewarp.com/notes/9vkeo0kz75/activity" ],
        "author" : [ {
          "type" : [ "h-card" ],
          "properties" : {
            "name" : [ "rewarp" ],
            "photo" : [ "https://aaronparecki.com/assets/images/no-profile-photo.png" ],
            "url" : [ "https://rewarp.com/users/9tp9deuul4" ]
          },
          "value" : "rewarp"
        } ]
      },
      "value" : "https://aaronparecki.com/assets/images/no-profile-photo.png rewarp"
    }, {
      "type" : [ "h-cite" ],
      "properties" : {
        "url" : [ "https://sociale.network/users/oblomov/statuses/112766210445279433/activity" ],
        "author" : [ {
          "type" : [ "h-card" ],
          "properties" : {
            "name" : [ "Oblomov" ],
            "photo" : [ "https://aaronparecki.com/assets/images/no-profile-photo.png" ],
            "url" : [ "https://sociale.network/users/oblomov" ]
          },
          "value" : "Oblomov"
        } ]
      },
      "value" : "https://aaronparecki.com/assets/images/no-profile-photo.png Oblomov"
    }, {
      "type" : [ "h-cite" ],
      "properties" : {
        "url" : [ "https://mastodon.art/users/RussSharek/statuses/112766199760411336/activity" ],
        "author" : [ {
          "type" : [ "h-card" ],
          "properties" : {
            "name" : [ "Russ Sharek" ],
            "photo" : [ "https://aaronparecki.com/assets/images/no-profile-photo.png" ],
            "url" : [ "https://mastodon.art/users/RussSharek" ]
          },
          "value" : "Russ Sharek"
        } ]
      },
      "value" : "https://aaronparecki.com/assets/images/no-profile-photo.png Russ Sharek"
    }, {
      "type" : [ "h-cite" ],
      "properties" : {
        "url" : [ "https://ioc.exchange/users/rye/statuses/112765938296239476/activity" ],
        "author" : [ {
          "type" : [ "h-card" ],
          "properties" : {
            "name" : [ "Rye" ],
            "photo" : [ "https://aaronparecki.com/assets/images/no-profile-photo.png" ],
            "url" : [ "https://ioc.exchange/users/rye" ]
          },
          "value" : "Rye"
        } ]
      },
      "value" : "https://aaronparecki.com/assets/images/no-profile-photo.png Rye"
    }, {
      "type" : [ "h-cite" ],
      "properties" : {
        "url" : [ "https://mstdn.social/users/clmerle/statuses/112765851454225616/activity" ],
        "author" : [ {
          "type" : [ "h-card" ],
          "properties" : {
            "name" : [ "Chris Merle" ],
            "photo" : [ "https://aaronparecki.com/assets/images/no-profile-photo.png" ],
            "url" : [ "https://mstdn.social/users/clmerle" ]
          },
          "value" : "Chris Merle"
        } ]
      },
      "value" : "https://aaronparecki.com/assets/images/no-profile-photo.png Chris Merle"
    }, {
      "type" : [ "h-cite" ],
      "properties" : {
        "url" : [ "https://anti.social.sungo.cloud/activities/047d4e0a-50dd-4111-be20-96fd260d7a92" ],
        "author" : [ {
          "type" : [ "h-card" ],
          "properties" : {
            "name" : [ "sungo" ],
            "photo" : [ "https://aaronparecki.com/assets/images/no-profile-photo.png" ],
            "url" : [ "https://anti.social.sungo.cloud/users/sungo" ]
          },
          "value" : "sungo"
        } ]
      },
      "value" : "https://aaronparecki.com/assets/images/no-profile-photo.png sungo"
    }, {
      "type" : [ "h-cite" ],
      "properties" : {
        "url" : [ "https://mastodon.social/users/aschuman/statuses/112765843885594757/activity" ],
        "author" : [ {
          "type" : [ "h-card" ],
          "properties" : {
            "name" : [ "Aaron" ],
            "photo" : [ "https://aaronparecki.com/assets/images/no-profile-photo.png" ],
            "url" : [ "https://mastodon.social/users/aschuman" ]
          },
          "value" : "Aaron"
        } ]
      },
      "value" : "https://aaronparecki.com/assets/images/no-profile-photo.png Aaron"
    }, {
      "type" : [ "h-cite" ],
      "properties" : {
        "url" : [ "https://bsd.network/users/AFresh1/statuses/112765812092849694/activity" ],
        "author" : [ {
          "type" : [ "h-card" ],
          "properties" : {
            "name" : [ "Andrew Hewus Fresh" ],
            "photo" : [ "https://aaronparecki.com/assets/images/no-profile-photo.png" ],
            "url" : [ "https://bsd.network/users/AFresh1" ]
          },
          "value" : "Andrew Hewus Fresh"
        } ]
      },
      "value" : "https://aaronparecki.com/assets/images/no-profile-photo.png Andrew Hewus Fresh"
    }, {
      "type" : [ "h-cite" ],
      "properties" : {
        "url" : [ "https://chirp.enworld.org/users/taichara/statuses/112765737533213043/activity" ],
        "author" : [ {
          "type" : [ "h-card" ],
          "properties" : {
            "name" : [ "taichara" ],
            "photo" : [ "https://aaronparecki.com/assets/images/no-profile-photo.png" ],
            "url" : [ "https://chirp.enworld.org/users/taichara" ]
          },
          "value" : "taichara"
        } ]
      },
      "value" : "https://aaronparecki.com/assets/images/no-profile-photo.png taichara"
    }, {
      "type" : [ "h-cite" ],
      "properties" : {
        "url" : [ "https://mastodon.social/users/whiteja/statuses/112765659263673745/activity" ],
        "author" : [ {
          "type" : [ "h-card" ],
          "properties" : {
            "name" : [ "JW" ],
            "photo" : [ "https://aaronparecki.com/assets/images/no-profile-photo.png" ],
            "url" : [ "https://mastodon.social/users/whiteja" ]
          },
          "value" : "JW"
        } ]
      },
      "value" : "https://aaronparecki.com/assets/images/no-profile-photo.png JW"
    }, {
      "type" : [ "h-cite" ],
      "properties" : {
        "url" : [ "https://mastodon.online/users/carpetbomberz/statuses/112765397099153122/activity" ],
        "author" : [ {
          "type" : [ "h-card" ],
          "properties" : {
            "name" : [ "carpetbomberz" ],
            "photo" : [ "https://aaronparecki.com/assets/images/no-profile-photo.png" ],
            "url" : [ "https://mastodon.online/users/carpetbomberz" ]
          },
          "value" : "carpetbomberz"
        } ]
      },
      "value" : "https://aaronparecki.com/assets/images/no-profile-photo.png carpetbomberz"
    }, {
      "type" : [ "h-cite" ],
      "properties" : {
        "url" : [ "https://mas.to/users/asayakkara/statuses/112765362073268044/activity" ],
        "author" : [ {
          "type" : [ "h-card" ],
          "properties" : {
            "name" : [ "Asanka Sayakkara" ],
            "photo" : [ "https://aaronparecki.com/assets/images/no-profile-photo.png" ],
            "url" : [ "https://mas.to/users/asayakkara" ]
          },
          "value" : "Asanka Sayakkara"
        } ]
      },
      "value" : "https://aaronparecki.com/assets/images/no-profile-photo.png Asanka Sayakkara"
    }, {
      "type" : [ "h-cite" ],
      "properties" : {
        "url" : [ "https://infosec.exchange/users/nebriv/statuses/112765349872829134/activity" ],
        "author" : [ {
          "type" : [ "h-card" ],
          "properties" : {
            "name" : [ "Ben Virgilio" ],
            "photo" : [ "https://aaronparecki.com/assets/images/no-profile-photo.png" ],
            "url" : [ "https://infosec.exchange/users/nebriv" ]
          },
          "value" : "Ben Virgilio"
        } ]
      },
      "value" : "https://aaronparecki.com/assets/images/no-profile-photo.png Ben Virgilio"
    }, {
      "type" : [ "h-cite" ],
      "properties" : {
        "url" : [ "https://zirk.us/users/noplasticshower/statuses/112765288904854329/activity" ],
        "author" : [ {
          "type" : [ "h-card" ],
          "properties" : {
            "name" : [ "noplasticshower" ],
            "photo" : [ "https://aaronparecki.com/assets/images/no-profile-photo.png" ],
            "url" : [ "https://zirk.us/users/noplasticshower" ]
          },
          "value" : "noplasticshower"
        } ]
      },
      "value" : "https://aaronparecki.com/assets/images/no-profile-photo.png noplasticshower"
    }, {
      "type" : [ "h-cite" ],
      "properties" : {
        "url" : [ "https://notacult.social/users/darth_mall/statuses/112765241924985919/activity" ],
        "author" : [ {
          "type" : [ "h-card" ],
          "properties" : {
            "name" : [ "Evan" ],
            "photo" : [ "https://aaronparecki.com/assets/images/no-profile-photo.png" ],
            "url" : [ "https://notacult.social/users/darth_mall" ]
          },
          "value" : "Evan"
        } ]
      },
      "value" : "https://aaronparecki.com/assets/images/no-profile-photo.png Evan"
    }, {
      "type" : [ "h-cite" ],
      "properties" : {
        "url" : [ "https://techhub.social/users/diazona/statuses/112765199064880853/activity" ],
        "author" : [ {
          "type" : [ "h-card" ],
          "properties" : {
            "name" : [ "David Zaslavsky" ],
            "photo" : [ "https://aaronparecki.com/assets/images/no-profile-photo.png" ],
            "url" : [ "https://techhub.social/users/diazona" ]
          },
          "value" : "David Zaslavsky"
        } ]
      },
      "value" : "https://aaronparecki.com/assets/images/no-profile-photo.png David Zaslavsky"
    }, {
      "type" : [ "h-cite" ],
      "properties" : {
        "url" : [ "https://indieweb.social/users/edward/statuses/112765192364818214/activity" ],
        "author" : [ {
          "type" : [ "h-card" ],
          "properties" : {
            "name" : [ "Edward Loveall" ],
            "photo" : [ "https://aaronparecki.com/assets/images/no-profile-photo.png" ],
            "url" : [ "https://indieweb.social/users/edward" ]
          },
          "value" : "Edward Loveall"
        } ]
      },
      "value" : "https://aaronparecki.com/assets/images/no-profile-photo.png Edward Loveall"
    }, {
      "type" : [ "h-cite" ],
      "properties" : {
        "url" : [ "https://m.g3l.org/users/mmu_man/statuses/112765172581799146/activity" ],
        "author" : [ {
          "type" : [ "h-card" ],
          "properties" : {
            "name" : [ "mmu_man" ],
            "photo" : [ "https://aaronparecki.com/assets/images/no-profile-photo.png" ],
            "url" : [ "https://m.g3l.org/users/mmu_man" ]
          },
          "value" : "mmu_man"
        } ]
      },
      "value" : "https://aaronparecki.com/assets/images/no-profile-photo.png mmu_man"
    }, {
      "type" : [ "h-cite" ],
      "properties" : {
        "url" : [ "https://tech.lgbt/users/nina_kali_nina/statuses/112765094006912539/activity" ],
        "author" : [ {
          "type" : [ "h-card" ],
          "properties" : {
            "name" : [ "Nina Kalinina" ],
            "photo" : [ "https://aaronparecki.com/assets/images/no-profile-photo.png" ],
            "url" : [ "https://tech.lgbt/users/nina_kali_nina" ]
          },
          "value" : "Nina Kalinina"
        } ]
      },
      "value" : "https://aaronparecki.com/assets/images/no-profile-photo.png Nina Kalinina"
    }, {
      "type" : [ "h-cite" ],
      "properties" : {
        "url" : [ "https://toot.jeena.net/users/jeena/statuses/112765015535039551/activity" ],
        "author" : [ {
          "type" : [ "h-card" ],
          "properties" : {
            "name" : [ "Jeena" ],
            "photo" : [ "https://aaronparecki.com/assets/images/no-profile-photo.png" ],
            "url" : [ "https://toot.jeena.net/users/jeena" ]
          },
          "value" : "Jeena"
        } ]
      },
      "value" : "https://aaronparecki.com/assets/images/no-profile-photo.png Jeena"
    }, {
      "type" : [ "h-cite" ],
      "properties" : {
        "url" : [ "https://gamedev.lgbt/users/renkotsuban/statuses/112765009997875773/activity" ],
        "author" : [ {
          "type" : [ "h-card" ],
          "properties" : {
            "name" : [ "Renkon" ],
            "photo" : [ "https://aaronparecki.com/assets/images/no-profile-photo.png" ],
            "url" : [ "https://gamedev.lgbt/users/renkotsuban" ]
          },
          "value" : "Renkon"
        } ]
      },
      "value" : "https://aaronparecki.com/assets/images/no-profile-photo.png Renkon"
    }, {
      "type" : [ "h-cite" ],
      "properties" : {
        "url" : [ "https://vis.social/users/candide/statuses/112764976040190705/activity" ],
        "author" : [ {
          "type" : [ "h-card" ],
          "properties" : {
            "name" : [ "candide.xyz" ],
            "photo" : [ "https://aaronparecki.com/assets/images/no-profile-photo.png" ],
            "url" : [ "https://vis.social/users/candide" ]
          },
          "value" : "candide.xyz"
        } ]
      },
      "value" : "https://aaronparecki.com/assets/images/no-profile-photo.png candide.xyz"
    }, {
      "type" : [ "h-cite" ],
      "properties" : {
        "url" : [ "https://dice.camp/users/shannonmcmaster/statuses/112764967523654678/activity" ],
        "author" : [ {
          "type" : [ "h-card" ],
          "properties" : {
            "name" : [ "Shannon McMaster" ],
            "photo" : [ "https://aaronparecki.com/assets/images/no-profile-photo.png" ],
            "url" : [ "https://dice.camp/users/shannonmcmaster" ]
          },
          "value" : "Shannon McMaster"
        } ]
      },
      "value" : "https://aaronparecki.com/assets/images/no-profile-photo.png Shannon McMaster"
    }, {
      "type" : [ "h-cite" ],
      "properties" : {
        "url" : [ "https://scholar.social/users/troypatterson/statuses/112764911571326045/activity" ],
        "author" : [ {
          "type" : [ "h-card" ],
          "properties" : {
            "name" : [ "Troy Patterson" ],
            "photo" : [ "https://aaronparecki.com/assets/images/no-profile-photo.png" ],
            "url" : [ "https://scholar.social/users/troypatterson" ]
          },
          "value" : "Troy Patterson"
        } ]
      },
      "value" : "https://aaronparecki.com/assets/images/no-profile-photo.png Troy Patterson"
    }, {
      "type" : [ "h-cite" ],
      "properties" : {
        "url" : [ "https://sunspot.garden/users/erbridge/statuses/112764879803194599/activity" ],
        "author" : [ {
          "type" : [ "h-card" ],
          "properties" : {
            "name" : [ "» F «" ],
            "photo" : [ "https://aaronparecki.com/assets/images/no-profile-photo.png" ],
            "url" : [ "https://sunspot.garden/users/erbridge" ]
          },
          "value" : "» F «"
        } ]
      },
      "value" : "https://aaronparecki.com/assets/images/no-profile-photo.png » F «"
    }, {
      "type" : [ "h-cite" ],
      "properties" : {
        "url" : [ "https://mastodon.social/users/SeanMarsala/statuses/112764840581514207/activity" ],
        "author" : [ {
          "type" : [ "h-card" ],
          "properties" : {
            "name" : [ "Sean" ],
            "photo" : [ "https://aaronparecki.com/assets/images/no-profile-photo.png" ],
            "url" : [ "https://mastodon.social/users/SeanMarsala" ]
          },
          "value" : "Sean"
        } ]
      },
      "value" : "https://aaronparecki.com/assets/images/no-profile-photo.png Sean"
    }, {
      "type" : [ "h-cite" ],
      "properties" : {
        "url" : [ "https://mastodon.social/users/franciswashere/statuses/112764827964253218/activity" ],
        "author" : [ {
          "type" : [ "h-card" ],
          "properties" : {
            "name" : [ "Francis Mangion (M)" ],
            "photo" : [ "https://aaronparecki.com/assets/images/no-profile-photo.png" ],
            "url" : [ "https://mastodon.social/users/franciswashere" ]
          },
          "value" : "Francis Mangion (M)"
        } ]
      },
      "value" : "https://aaronparecki.com/assets/images/no-profile-photo.png Francis Mangion (M)"
    }, {
      "type" : [ "h-cite" ],
      "properties" : {
        "url" : [ "https://hachyderm.io/users/joby/statuses/112764826201842566/activity" ],
        "author" : [ {
          "type" : [ "h-card" ],
          "properties" : {
            "name" : [ "Joby (chaotic good)" ],
            "photo" : [ "https://aaronparecki.com/assets/images/no-profile-photo.png" ],
            "url" : [ "https://hachyderm.io/users/joby" ]
          },
          "value" : "Joby (chaotic good)"
        } ]
      },
      "value" : "https://aaronparecki.com/assets/images/no-profile-photo.png Joby (chaotic good)"
    }, {
      "type" : [ "h-cite" ],
      "properties" : {
        "url" : [ "https://indieweb.social/users/clhenrick/statuses/112764819002505136/activity" ],
        "author" : [ {
          "type" : [ "h-card" ],
          "properties" : {
            "name" : [ "Chris Henrick" ],
            "photo" : [ "https://aaronparecki.com/assets/images/no-profile-photo.png" ],
            "url" : [ "https://indieweb.social/users/clhenrick" ]
          },
          "value" : "Chris Henrick"
        } ]
      },
      "value" : "https://aaronparecki.com/assets/images/no-profile-photo.png Chris Henrick"
    }, {
      "type" : [ "h-cite" ],
      "properties" : {
        "url" : [ "https://dosgame.club/users/MichaelKlamerus/statuses/112764816666667248/activity" ],
        "author" : [ {
          "type" : [ "h-card" ],
          "properties" : {
            "name" : [ "Michael Klamerus" ],
            "photo" : [ "https://aaronparecki.com/assets/images/no-profile-photo.png" ],
            "url" : [ "https://dosgame.club/users/MichaelKlamerus" ]
          },
          "value" : "Michael Klamerus"
        } ]
      },
      "value" : "https://aaronparecki.com/assets/images/no-profile-photo.png Michael Klamerus"
    }, {
      "type" : [ "h-cite" ],
      "properties" : {
        "url" : [ "https://xoxo.zone/users/KevinMarks/statuses/112764799619385826/activity" ],
        "author" : [ {
          "type" : [ "h-card" ],
          "properties" : {
            "name" : [ "Kevin Marks" ],
            "photo" : [ "https://aaronparecki.com/assets/images/no-profile-photo.png" ],
            "url" : [ "https://xoxo.zone/users/KevinMarks" ]
          },
          "value" : "Kevin Marks"
        } ]
      },
      "value" : "https://aaronparecki.com/assets/images/no-profile-photo.png Kevin Marks"
    }, {
      "type" : [ "h-cite" ],
      "properties" : {
        "url" : [ "https://indieweb.social/users/caesar/statuses/112764767155869608/activity" ],
        "author" : [ {
          "type" : [ "h-card" ],
          "properties" : {
            "name" : [ "Caesar" ],
            "url" : [ "https://indieweb.social/users/caesar" ]
          },
          "value" : "Caesar"
        } ]
      },
      "value" : "https://aaronparecki.com/assets/images/no-profile-photo.png Caesar"
    }, {
      "type" : [ "h-cite" ],
      "properties" : {
        "url" : [ "https://mastodon.social/users/karabaic/statuses/112764757429604074/activity" ],
        "author" : [ {
          "type" : [ "h-card" ],
          "properties" : {
            "name" : [ "jack the nonabrasive" ],
            "photo" : [ "https://aaronparecki.com/assets/images/no-profile-photo.png" ],
            "url" : [ "https://mastodon.social/users/karabaic" ]
          },
          "value" : "jack the nonabrasive"
        } ]
      },
      "value" : "https://aaronparecki.com/assets/images/no-profile-photo.png jack the nonabrasive"
    }, {
      "type" : [ "h-cite" ],
      "properties" : {
        "url" : [ "https://fosstodon.org/users/dsofeir/statuses/112764746112883932/activity" ],
        "author" : [ {
          "type" : [ "h-card" ],
          "properties" : {
            "name" : [ "Daithí Seán Ó Foghlú 🖖🏽" ],
            "photo" : [ "https://aaronparecki.com/assets/images/no-profile-photo.png" ],
            "url" : [ "https://fosstodon.org/users/dsofeir" ]
          },
          "value" : "Daithí Seán Ó Foghlú 🖖🏽"
        } ]
      },
      "value" : "https://aaronparecki.com/assets/images/no-profile-photo.png Daithí Seán Ó Foghlú 🖖🏽"
    }, {
      "type" : [ "h-cite" ],
      "properties" : {
        "url" : [ "https://social.tchncs.de/users/teleclimber/statuses/112764740354736334/activity" ],
        "author" : [ {
          "type" : [ "h-card" ],
          "properties" : {
            "name" : [ "Olivier Forget" ],
            "photo" : [ "https://aaronparecki.com/assets/images/no-profile-photo.png" ],
            "url" : [ "https://social.tchncs.de/users/teleclimber" ]
          },
          "value" : "Olivier Forget"
        } ]
      },
      "value" : "https://aaronparecki.com/assets/images/no-profile-photo.png Olivier Forget"
    }, {
      "type" : [ "h-cite" ],
      "properties" : {
        "url" : [ "https://hachyderm.io/users/levlaz/statuses/112764732178240648/activity" ],
        "author" : [ {
          "type" : [ "h-card" ],
          "properties" : {
            "name" : [ "Lev Lazinskiy 🏳️‍🌈" ],
            "photo" : [ "https://aaronparecki.com/assets/images/no-profile-photo.png" ],
            "url" : [ "https://hachyderm.io/users/levlaz" ]
          },
          "value" : "Lev Lazinskiy 🏳️‍🌈"
        } ]
      },
      "value" : "https://aaronparecki.com/assets/images/no-profile-photo.png Lev Lazinskiy 🏳️‍🌈"
    } ],
    "comment" : [ {
      "type" : [ "h-cite" ],
      "properties" : {
        "url" : [ "https://infosec.exchange/@montar/112769752805208683" ],
        "published" : [ "2024-07-11T13:31:10-07:00" ],
        "content" : [ {
          "html" : "<p><span class=\"h-card\"><a href=\"https://aaronparecki.com/aaronpk\" class=\"u-url\">@<span>aaronpk</span></a></span> added, cool</p>",
          "value" : "@aaronpk added, cool"
        } ],
        "author" : [ {
          "type" : [ "h-card" ],
          "properties" : {
            "name" : [ "montar" ],
            "photo" : [ "https://aaronparecki.com/assets/images/no-profile-photo.png" ],
            "url" : [ "https://infosec.exchange/users/montar" ]
          },
          "value" : "montar"
        } ]
      },
      "children" : [ {
        "type" : [ "h-card" ],
        "properties" : {
          "url" : [ "https://aaronparecki.com/aaronpk" ],
          "name" : [ "@aaronpk" ]
        }
      } ],
      "value" : "https://aaronparecki.com/assets/images/no-profile-photo.png montar infosec.exchange/users/montar\n@aaronpk added, cool Thu, Jul 11, 2024 1:31pm -07:00"
    }, {
      "type" : [ "h-cite" ],
      "properties" : {
        "url" : [ "https://mastodontech.de/@jak2k/112767491978321623" ],
        "published" : [ "2024-07-11T03:56:13-07:00" ],
        "content" : [ {
          "html" : "<p><span class=\"h-card\"><a href=\"https://aaronparecki.com/aaronpk\" class=\"u-url\">@<span>aaronpk</span></a></span> <br>My personal website doesn't fit into any category :blobcatsad:</p>",
          "value" : "@aaronpk\nMy personal website doesn't fit into any category :blobcatsad:"
        } ],
        "author" : [ {
          "type" : [ "h-card" ],
          "properties" : {
            "name" : [ "Jak2k" ],
            "photo" : [ "https://aaronparecki.com/assets/images/no-profile-photo.png" ],
            "url" : [ "https://mastodontech.de/users/jak2k" ]
          },
          "value" : "Jak2k"
        } ]
      },
      "children" : [ {
        "type" : [ "h-card" ],
        "properties" : {
          "url" : [ "https://aaronparecki.com/aaronpk" ],
          "name" : [ "@aaronpk" ]
        }
      } ],
      "value" : "https://aaronparecki.com/assets/images/no-profile-photo.png Jak2k mastodontech.de/users/jak2k\n@aaronpk\nMy personal website doesn't fit into any category :blobcatsad: Thu, Jul 11, 2024 3:56am -07:00"
    }, {
      "type" : [ "h-cite" ],
      "properties" : {
        "url" : [ "https://social.tchncs.de/@pixelcode/112767428738472559" ],
        "published" : [ "2024-07-11T03:40:08-07:00" ],
        "content" : [ {
          "html" : "<p><span class=\"h-card\"><a href=\"https://aaronparecki.com/aaronpk\" class=\"u-url\">@<span>aaronpk</span></a></span> What counts as a “personal” website?</p>",
          "value" : "@aaronpk What counts as a “personal” website?"
        } ],
        "author" : [ {
          "type" : [ "h-card" ],
          "properties" : {
            "name" : [ "Pixelcode 💙💛🕊️" ],
            "photo" : [ "https://aaronparecki.com/assets/images/no-profile-photo.png" ],
            "url" : [ "https://social.tchncs.de/users/pixelcode" ]
          },
          "value" : "Pixelcode 💙💛🕊️"
        } ]
      },
      "children" : [ {
        "type" : [ "h-card" ],
        "properties" : {
          "url" : [ "https://aaronparecki.com/aaronpk" ],
          "name" : [ "@aaronpk" ]
        }
      } ],
      "value" : "https://aaronparecki.com/assets/images/no-profile-photo.png Pixelcode 💙💛🕊️ social.tchncs.de/users/pixelcode\n@aaronpk What counts as a “personal” website? Thu, Jul 11, 2024 3:40am -07:00"
    }, {
      "type" : [ "h-cite" ],
      "properties" : {
        "url" : [ "https://front-end.social/@keithjgrant/112767273325255574" ],
        "published" : [ "2024-07-11T03:00:36-07:00" ],
        "content" : [ {
          "html" : "<p><span class=\"h-card\"><a href=\"https://aaronparecki.com/aaronpk\" class=\"u-url\">@<span>aaronpk</span></a></span> These categories are very confusing 🤔</p>",
          "value" : "@aaronpk These categories are very confusing 🤔"
        } ],
        "author" : [ {
          "type" : [ "h-card" ],
          "properties" : {
            "name" : [ "Keith J Grant" ],
            "photo" : [ "https://aaronparecki.com/assets/images/no-profile-photo.png" ],
            "url" : [ "https://front-end.social/users/keithjgrant" ]
          },
          "value" : "Keith J Grant"
        } ]
      },
      "children" : [ {
        "type" : [ "h-card" ],
        "properties" : {
          "url" : [ "https://aaronparecki.com/aaronpk" ],
          "name" : [ "@aaronpk" ]
        }
      } ],
      "value" : "https://aaronparecki.com/assets/images/no-profile-photo.png Keith J Grant front-end.social/users/keithjgrant\n@aaronpk These categories are very confusing 🤔 Thu, Jul 11, 2024 3:00am -07:00"
    }, {
      "type" : [ "h-cite" ],
      "properties" : {
        "url" : [ "https://indieweb.social/@fnh/112767039064813494" ],
        "published" : [ "2024-07-11T02:01:02-07:00" ],
        "content" : [ {
          "html" : "<p><span class=\"h-card\"><a href=\"https://aaronparecki.com/aaronpk\" class=\"u-url\">@<span>aaronpk</span></a></span> <br>Is time indeed a flat circle? Last year I wrote about a printed web directory from the late 90s/early 00s: </p><p><a href=\"https://holzer.online/articles/2023-04-12-an-old-book-and-todays-web/\"><span>https://</span><span>holzer.online/articles/2023-04</span><span>-12-an-old-book-and-todays-web/</span></a></p><p>That is a such cool project, I think I'll submit my little site as well.</p>",
          "value" : "@aaronpk\nIs time indeed a flat circle? Last year I wrote about a printed web directory from the late 90s/early 00s:\nhttps://holzer.online/articles/2023-04-12-an-old-book-and-todays-web/\nThat is a such cool project, I think I'll submit my little site as well."
        } ],
        "author" : [ {
          "type" : [ "h-card" ],
          "properties" : {
            "name" : [ "Fabian" ],
            "url" : [ "https://indieweb.social/users/fnh" ]
          },
          "value" : "Fabian"
        } ]
      },
      "children" : [ {
        "type" : [ "h-card" ],
        "properties" : {
          "url" : [ "https://aaronparecki.com/aaronpk" ],
          "name" : [ "@aaronpk" ]
        }
      } ],
      "value" : "https://aaronparecki.com/assets/images/no-profile-photo.png Fabian indieweb.social/users/fnh\n@aaronpk\nIs time indeed a flat circle? Last year I wrote about a printed web directory from the late 90s/early 00s:\nhttps://holzer.online/articles/2023-04-12-an-old-book-and-todays-web/\nThat is a such cool project, I think I'll submit my little site as well. Thu, Jul 11, 2024 2:01am -07:00"
    }, {
      "type" : [ "h-cite" ],
      "properties" : {
        "url" : [ "https://mastodon.social/@Sdavidprince/112766996569796551" ],
        "published" : [ "2024-07-11T01:50:13-07:00" ],
        "content" : [ {
          "html" : "<p><span class=\"h-card\"><a href=\"https://aaronparecki.com/aaronpk\" class=\"u-url\">@<span>aaronpk</span></a></span>  I made the decision to go the indieway I hope by next week I should have everything setup <a href=\"https://mastodon.social/tags/indieweb\">#<span>indieweb</span></a></p>",
          "value" : "@aaronpk I made the decision to go the indieway I hope by next week I should have everything setup #indieweb"
        } ],
        "author" : [ {
          "type" : [ "h-card" ],
          "properties" : {
            "name" : [ "S David Prince" ],
            "photo" : [ "https://aaronparecki.com/assets/images/no-profile-photo.png" ],
            "url" : [ "https://mastodon.social/users/Sdavidprince" ]
          },
          "value" : "S David Prince"
        } ]
      },
      "children" : [ {
        "type" : [ "h-card" ],
        "properties" : {
          "url" : [ "https://aaronparecki.com/aaronpk" ],
          "name" : [ "@aaronpk" ]
        }
      } ],
      "value" : "https://aaronparecki.com/assets/images/no-profile-photo.png S David Prince mastodon.social/users/Sdavidprince\n@aaronpk I made the decision to go the indieway I hope by next week I should have everything setup #indieweb Thu, Jul 11, 2024 1:50am -07:00"
    }, {
      "type" : [ "h-cite" ],
      "properties" : {
        "url" : [ "https://mastodon.online/@carpetbomberz/112765398069057881" ],
        "published" : [ "2024-07-10T19:03:42-07:00" ],
        "content" : [ {
          "html" : "<p><span class=\"h-card\"><a href=\"https://aaronparecki.com/aaronpk\" class=\"u-url\">@<span>aaronpk</span></a></span> Done!</p>",
          "value" : "@aaronpk Done!"
        } ],
        "author" : [ {
          "type" : [ "h-card" ],
          "properties" : {
            "name" : [ "carpetbomberz" ],
            "photo" : [ "https://aaronparecki.com/assets/images/no-profile-photo.png" ],
            "url" : [ "https://mastodon.online/users/carpetbomberz" ]
          },
          "value" : "carpetbomberz"
        } ]
      },
      "children" : [ {
        "type" : [ "h-card" ],
        "properties" : {
          "url" : [ "https://aaronparecki.com/aaronpk" ],
          "name" : [ "@aaronpk" ]
        }
      } ],
      "value" : "https://aaronparecki.com/assets/images/no-profile-photo.png carpetbomberz mastodon.online/users/carpetbomberz\n@aaronpk Done! Wed, Jul 10, 2024 7:03pm -07:00"
    }, {
      "type" : [ "h-cite" ],
      "properties" : {
        "url" : [ "https://zirk.us/@noplasticshower/112765290334558127" ],
        "published" : [ "2024-07-10T18:36:18-07:00" ],
        "content" : [ {
          "html" : "<p><span class=\"h-card\"><a href=\"https://aaronparecki.com/aaronpk\" class=\"u-url\">@<span>aaronpk</span></a></span> done.  Thrice</p>",
          "value" : "@aaronpk done. Thrice"
        } ],
        "author" : [ {
          "type" : [ "h-card" ],
          "properties" : {
            "name" : [ "noplasticshower" ],
            "photo" : [ "https://aaronparecki.com/assets/images/no-profile-photo.png" ],
            "url" : [ "https://zirk.us/users/noplasticshower" ]
          },
          "value" : "noplasticshower"
        } ]
      },
      "children" : [ {
        "type" : [ "h-card" ],
        "properties" : {
          "url" : [ "https://aaronparecki.com/aaronpk" ],
          "name" : [ "@aaronpk" ]
        }
      } ],
      "value" : "https://aaronparecki.com/assets/images/no-profile-photo.png noplasticshower zirk.us/users/noplasticshower\n@aaronpk done. Thrice Wed, Jul 10, 2024 6:36pm -07:00"
    }, {
      "type" : [ "h-cite" ],
      "properties" : {
        "url" : [ "https://corneill.es/@crowdagger/112765188120439506" ],
        "published" : [ "2024-07-10T18:10:19-07:00" ],
        "content" : [ {
          "html" : "<p><span class=\"h-card\"><a href=\"https://aaronparecki.com/aaronpk\" class=\"u-url\">@<span>aaronpk</span></a></span> is it english-only ? </p>",
          "value" : "@aaronpk is it english-only ? "
        } ],
        "author" : [ {
          "type" : [ "h-card" ],
          "properties" : {
            "name" : [ "LIZZIE CROWDAGGER :neocat_flag_trans:" ],
            "photo" : [ "https://aaronparecki.com/assets/images/no-profile-photo.png" ],
            "url" : [ "https://corneill.es/users/crowdagger" ]
          },
          "value" : "LIZZIE CROWDAGGER :neocat_flag_trans:"
        } ]
      },
      "children" : [ {
        "type" : [ "h-card" ],
        "properties" : {
          "url" : [ "https://aaronparecki.com/aaronpk" ],
          "name" : [ "@aaronpk" ]
        }
      } ],
      "value" : "https://aaronparecki.com/assets/images/no-profile-photo.png LIZZIE CROWDAGGER :neocat_flag_trans: corneill.es/users/crowdagger\n@aaronpk is it english-only ?  Wed, Jul 10, 2024 6:10pm -07:00"
    }, {
      "type" : [ "h-cite" ],
      "properties" : {
        "url" : [ "https://hachyderm.io/@levlaz/112764732494745845" ],
        "published" : [ "2024-07-10T16:14:26-07:00" ],
        "content" : [ {
          "html" : "<p><span class=\"h-card\"><a href=\"https://aaronparecki.com/aaronpk\" class=\"u-url\">@<span>aaronpk</span></a></span> really cool project !</p>",
          "value" : "@aaronpk really cool project !"
        } ],
        "author" : [ {
          "type" : [ "h-card" ],
          "properties" : {
            "name" : [ "Lev Lazinskiy 🏳️‍🌈" ],
            "photo" : [ "https://aaronparecki.com/assets/images/no-profile-photo.png" ],
            "url" : [ "https://hachyderm.io/users/levlaz" ]
          },
          "value" : "Lev Lazinskiy 🏳️‍🌈"
        } ]
      },
      "children" : [ {
        "type" : [ "h-card" ],
        "properties" : {
          "url" : [ "https://aaronparecki.com/aaronpk" ],
          "name" : [ "@aaronpk" ]
        }
      } ],
      "value" : "https://aaronparecki.com/assets/images/no-profile-photo.png Lev Lazinskiy 🏳️‍🌈 hachyderm.io/users/levlaz\n@aaronpk really cool project ! Wed, Jul 10, 2024 4:14pm -07:00"
    } ]
  },
  "id" : "post-id-106536"
}
