{
  "type" : [ "h-entry" ],
  "properties" : {
    "name" : [ "lornajane (@lornajane@indieweb.social)" ],
    "summary" : [ "Doing #AdventOfCode in a language I used to know well enough to dream in but haven’t used for years, with Copliot enabled, is quite the experience. Like trying to do something with half a dozen incredibly smart and helpful 9 year olds … I think I know what’s happening, everyone is brilliant, but some of these brilliant and helpful things are totally the wrong thing so I’ve really got to pay attention!!" ],
    "url" : [ "https://indieweb.social/@lornajane/113577628748922364" ]
  }
}
