{
  "type" : [ "h-entry" ],
  "properties" : {
    "name" : [ "Scaling DevTools" ],
    "summary" : [ "Lessons from 100+ DevTool founders - DevTools successes, failures and stories in a free weekly email and podcast." ],
    "featured" : [ "https://storage.scalingdevtools.com/og-image.png" ],
    "url" : [ "https://scalingdevtools.com/podcast/episodes/rasmus-makwarth" ]
  }
}
