{
  "type" : [ "h-entry" ],
  "properties" : {
    "name" : [ "Slight Reliability Episode 85 - Feeling SaaSsy - Slight Reliability" ],
    "summary" : [ "This week I talk about the impact of SaaS-first technology strategies on the work of an SRE. I pose questions about observability, ownership, on-call, and how much control we have over reliability.You can find the Bleeding Tech blog on Medium: htt..." ],
    "featured" : [ "https://www.buzzsprout.com/rails/active_storage/representations/redirect/eyJfcmFpbHMiOnsibWVzc2FnZSI6IkJBaHBCQTZhUFFjPSIsImV4cCI6bnVsbCwicHVyIjoiYmxvYl9pZCJ9fQ==--f2a92495e3a843fa58d38b9adb8b89530ba7af03/eyJfcmFpbHMiOnsibWVzc2FnZSI6IkJBaDdDVG9MWm05eWJXRjBPZ2hxY0djNkUzSmxjMmw2WlY5MGIxOW1hV3hzV3docEFmcHBBZnA3QmpvSlkzSnZjRG9MWTJWdWRISmxPZ3B6WVhabGNuc0dPZ3h4ZFdGc2FYUjVhVUU2RUdOdmJHOTFjbk53WVdObFNTSUpjM0puWWdZNkJrVlUiLCJleHAiOm51bGwsInB1ciI6InZhcmlhdGlvbiJ9fQ==--bfdad5b04912fa8a9db85eb3989e46c5908e2723/Slight%20Reliability%20S02E85%20Buzzsprout.png" ],
    "audio" : [ "https://www.buzzsprout.com/1698445/14995929-slight-reliability-episode-85-feeling-saassy.mp3?client_source=buzzsprout_site&referrer=https%3A%2F%2Fwww.buzzsprout.com%2F1698445%2F14995929-slight-reliability-episode-85-feeling-saassy" ],
    "url" : [ "https://www.buzzsprout.com/1698445/14995929-slight-reliability-episode-85-feeling-saassy" ]
  }
}
