{
  "type" : [ "h-entry" ],
  "properties" : {
    "name" : [ "FOSDEM - The Good Parts and the Not-So-Good Parts" ],
    "category" : [ "conference", "fosdem" ],
    "url" : [ "https://shkspr.mobi/blog/2025/02/fosdem-the-good-parts-and-the-not-so-good-parts/" ],
    "published" : [ "2025-02-05" ],
    "updated" : [ "2025-02-05" ],
    "author" : [ {
      "type" : [ "h-card" ],
      "properties" : {
        "name" : [ "@edent" ],
        "photo" : [ {
          "value" : "https://shkspr.mobi/apple-touch-icon.png",
          "alt" : ""
        } ]
      },
      "lang" : "en-GB",
      "value" : "@edent"
    } ]
  },
  "lang" : "en-GB"
}
