{
  "type" : [ "h-entry" ],
  "properties" : {
    "name" : [ "IndieWeb Assimilation" ],
    "photo" : [ "https://shellsharks-images.s3.amazonaws.com/surfshark.png" ],
    "url" : [ "https://shellsharks.com/indieweb" ],
    "uid" : [ "https://shellsharks.com/indieweb" ],
    "published" : [ "July 16, 2023" ],
    "content" : [ {
      "html" : "<p>I’ve been a <a href=\"https://shellsharks.com/you-should-blog\">huge advocate for independent blogging</a> for a while now, both for personal <em>and</em> professional reasons. In fact, I’ve written countless replies to early-career folks about documenting their learning journey <a href=\"https://shellsharks.com/cyber-clout#blog\">via a blog</a>. Since I first founded <a href=\"https://shellsharks.com/\">shellsharks</a> (<em>circa 2019</em>), I’ve devoted a fair bit of time not only to writing “content” but also into a lot of little features that, to me, collectively gave the site depth as well as that sense of “having everything a site <em>should</em> have”. Some of these features include, an <a href=\"https://shellsharks.com/feeds/feed.xml\">RSS feed</a>, <a href=\"https://shellsharks.com/robots.txt\">robots.txt</a>, <a href=\"https://shellsharks.com/humans.txt\">humans.txt</a>, <a href=\"https://shellsharks.com/.well-known/security.txt\">security.txt</a>, <a href=\"https://shellsharks.com/about\">about</a> page, <a href=\"https://shellsharks.com/tags\">tags</a>, search, <a href=\"https://shellsharks.com/changelog\">change log</a>, <a href=\"https://shellsharks.com/disclaimer\">license &amp; disclaimer</a> and more. I’ve poured my creativity, whimsy and mind into the aesthetic, writing and functionality of the site and as a result it has served as an ever-present source of identity and pride for me on the web.</p><p>Recently, I was introduced to the concept of the “<a href=\"https://shellsharks.com/indieweb#indieweb\">IndieWeb</a>” (or <em>small web</em>), a “<em>people-focused alternative to the corporate web</em>”. Intriguing right? My curiosity piqued, I soon discovered <a href=\"https://indieweb.org\">IndieWeb.org</a>, an organization dedicated to the proliferation of IndieWeb resources, guides, community and more. They describe the IndieWeb as…</p><blockquote><p>…a community of independent &amp; personal websites connected by simple standards, based on the principles of: owning your domain &amp; using it as your primary identity, publishing on your own site (optionally syndicating elsewhere), and owning your data. <strong><sup>1</sup></strong></p></blockquote><p><em>Sound familiar?</em> Sounds kinda like what I’ve been doing with my site for a while now! But what makes the IndieWeb special? Why should you or I care? Is there anything else to it? Read on to learn more!</p><h1 id=\"indieweb\">IndieWeb</h1><p>The <strong><a href=\"https://indieweb.org\">IndieWeb</a></strong> (or “<a href=\"https://ar.al/2020/08/07/what-is-the-small-web/\">small web</a>”) is a collection of people-focused websites which share a core set of <a href=\"https://indieweb.org/principles\">principles</a>. The IndieWeb is not simply a missionless multitude however, the IndieWeb <em>movement</em> is all about reclaiming the web by de-centralizing what has become all too centralized, encouraging ownership (of your site and your content), and bringing a truer sense of <a href=\"https://shellsharks.com/indieweb#the-delightful-small-web\">fun and individuality</a> back to the Internet. So <em><a href=\"https://indieweb.org/why\">why</a></em> is the IndieWeb important? I’d suggest reading the following pieces by <a href=\"https://dangillmor.com/2014/04/25/indie-web-important/\">Dan Gillmor</a>, <a href=\"https://www.jvt.me/posts/2019/10/20/indieweb-talk/\">Jamie Tanna</a> &amp; <a href=\"https://ariadne.space/2022/07/01/a-silo-can-never-provide-digital-autonomy-to-its-users/\">Ariadne Conill</a>, as they do a far more eloquent job than I probably would in explaining this. <strong><sup>1, 2</sup></strong></p><p>I’ve previously made known <a href=\"https://shellsharks.com/you-should-blog#so-why-blog\">my reasons for blogging</a>, but now with a better understanding of the IndieWeb, and <a href=\"https://shellsharks.com/threadiversal-travel#title\">what’s at stake</a> if we don’t embrace it, I now recognize that my infinitesimally small slice of the Internet guarantees me an incorruptible continuum for my content and my identity on the web. (<em>Check out my <a href=\"https://shellsharks.com/indieweb.txt\">IndieWeb.txt</a> file!</em>)</p><p><em>Awesome</em>! Now that we have a rough understanding of the IndieWeb ethos, let’s cover what is in my mind the <a href=\"https://shellsharks.com/indieweb#principle-mechanics\">principle mechanics of the IndieWeb</a>.</p><h2 id=\"principle-mechanics\">Principle Mechanics</h2><p>This section does not provide exhaustive coverage of how to implement <a href=\"https://shellsharks.com/indieweb#indieweb\">IndieWeb</a> functionality. Instead, I simply summarize five core primitives which I feel comprise an IndieWeb site. For a more <em>official</em> gauge on where a site scores within the IndieWeb spectrum, consider leveraging <a href=\"https://shellsharks.com/indieweb#indiemark\">IndieMark</a>!</p><ul><li><p><strong>Hosting</strong>: You need a place to <a href=\"https://shellsharks.com/blogging-from-ipad\">host your site</a> and store your content. There are <a href=\"https://indieweb.org/web_hosting\">a lot of great options</a> out there. Ideally, choose one that allows you the ability to make some under-the-hood changes and does not limit your content portability.<li></p><p><strong>Syndication</strong>: Share your content with the world! There are two preferred methods for syndication, <a href=\"https://indieweb.org/PESOS\">PESOS</a> and <a href=\"https://indieweb.org/POSSE\">POSSE</a>. <a href=\"https://elizabethtai.com/2023/07/02/posse-and-pesos-better-ways-to-publish-content/\">This resource</a> does a great job explaining both! For more examples of how this is done, check <a href=\"https://elizabethtai.com/2023/07/03/how-i-am-blogging-the-indieweb-way/\">this</a> and <a href=\"https://kevquirk.com/how-it-all-connects\">this</a> out. <a href=\"https://shellsharks.com/an-ode-to-rss#title\">RSS is a great starting point</a> for helping others subscribe to new content on your site.<li></p><p><strong>Writing</strong>: Though your site <em>could</em> simply serve as a more static point/identity on the web, with little to no “content” being regularly added, I recommend <a href=\"https://shellsharks.com/you-should-blog\">writing</a>!<li></p><p><strong>Interactivity</strong>: One of the more advanced concepts within the IndieWeb world, the ability to bake in native comments, replies, likes, etc is a greay way to build community. This interactivity helps mitigate reliance on centralized social networks for communication within Indie communities. One example of IndieWeb interactivity is <a href=\"https://indieweb.org/Webmention\">Webmentions</a>.<li></p><p><strong>Identity</strong>: Make it unique, make it fun, make it yours. The corporate web is sterile and suffocating. Let’s bring back the <a href=\"https://shellsharks.com/indieweb#the-delightful-small-web\">whimsy of the old web</a>.</p></li></ul><h6 id=\"indiemark\">IndieMark</h6><p><strong><a href=\"https://indieweb.org/IndieMark\">IndieMark</a></strong> is a progressive set of requirements (from <a href=\"https://indieweb.org\">IndieWeb.org</a>) which provide quantitative and level-based measurement of the <em>indieweb-ness</em> of a site. I’ll maintain a current score for <a href=\"https://shellsharks.com/\">shellsharks.com</a> here –&gt; <a href=\"https://shellsharks.com/indiemark-score\">Shellsharks IndieMark Score</a>.</p><h2 id=\"the-delightful-small-web\">The Delightful Small Web</h2><p>The Internet is vast, yet collectively we spend most of our time these days (sadly) within boring, behemoth, centralized corporate-web watering holes. Beyond the corporate web lies countless relics of the old web, unique destinations of the IndieWeb and <a href=\"https://shellsharks.com/indieweb#indieweb-delights\">delights</a> of the small web.</p><h3 id=\"webrings\">Webrings</h3><p>A <strong><a href=\"https://indieweb.org/webring\">webring</a></strong> is a collection of websites that are linked together, each pointing to and from another site in the ring. They serve as a fun way to build community and facilitate discovery of new sites! Some Webrings and -related resources are provided below.</p><ul><li>Public Interest Tech Webring by <a href=\"https://billhunt.dev/blog/2022/12/30/bringing-webrings-back/\">Bill Hunt</a> (<a href=\"https://github.com/krusynth/public-interest-tech-webring/issues/new?assignees=krusynth&amp;labels=new+site+request&amp;template=new-site-request.md&amp;title=\">Join!</a> or <a href=\"https://github.com/krusynth/webring-starter\">host your own with webring-starter</a>)</li><li><a href=\"https://webring.xxiivv.com\">webring.xxiivv</a> (per <a href=\"https://tech.lgbt/@ghostzero/110368175541059652\">@IPXFong@mastodon.sdf.org</a>)</li><li><a href=\"https://fediverse-webring-enthusiasts.glitch.me\">Webring Enthusiasts of the Fediverse</a> (<a href=\"https://fediverse-webring-enthusiasts.glitch.me/profiles/shellsharks_infosec.exchange/index.html\">Shellsharks is on there!</a>)</li><li><a href=\"https://fediring.net\">Fediring.net</a></li><li><a href=\"https://sadgrl.online/cyberspace/webrings\">Webrings | sadgrl.online</a> - A collection of Webrings.</li><li><a href=\"https://weirdwidewebring.net\">Weird Wide Webring</a></li><li><a href=\"https://%F0%9F%95%B8%F0%9F%92%8D.ws/directory\">🕸💍.ws</a></li><li><a href=\"https://wake.st/webring/\">merveilles wonder webring</a></li><li><a href=\"https://www.cyberdragon.digital/rings/draconic/\">Draconic Webring</a></li><li><a href=\"https://geekring.net\">geekring</a></li><li><a href=\"https://feelingmachine.moe/alterring/\">Alterhuman Summoning Circle</a></li><li><a href=\"https://silly.city\">silly city</a></li><li><a href=\"https://genlissa.neocities.org\">generation Lissa</a></li><li><a href=\"https://a11y-webring.club\">a11y-webring.club</a></li><li><a href=\"https://hotlinewebring.club\">Hotline Webring</a></li><li><a href=\"https://webring.dinhe.net\">Retronaut</a></li></ul><h3 id=\"blogrolls\">Blogrolls</h3><p>Some /blogrolls that people have published…</p><ul><li><a href=\"https://mxb.dev/blogroll/\">Max Böck blogroll</a></li></ul><h3 id=\"explore-the-indieweb\">Explore the IndieWeb</h3><p>The sites below are ways to discover, explore and find the sites of the <a href=\"https://shellsharks.com/indieweb#indieweb\">IndieWeb</a></p><ul><li><a href=\"https://ooh.directory\">ooh.directory</a></li><li><a href=\"https://www.marginalia.nu%5D\">marginalia.nu</a></li><li><a href=\"https://indieseek.xyz\">indieseek.xyz</a></li><li><a href=\"https://kagi.com/smallweb/\">kagi.com/smallweb/</a></li><li><a href=\"https://searchmysite.net\">searchmysite.net</a></li><li><a href=\"https://whimsical.club\">whimsical.club</a></li><li><a href=\"https://theuselessweb.com\">theuselessweb.com</a></li><li><a href=\"https://theforest.link\">theforest.link</a></li><li><a href=\"https://personalsit.es\">personalsit.es</a></li><li><a href=\"https://indieweb-directory.glitch.me\">indieweb-directory.glitch.me</a></li><li><a href=\"https://godteeth.com/misc/randomweb\">godteeth.com/misc/randomweb</a></li><li><a href=\"https://blogroll.org\">blogroll.org</a></li><li><a href=\"https://indieblog.page\">indieblog.page</a></li><li><a href=\"https://blogs.hn\">blogs.hn</a></li><li><a href=\"https://neocities.org/browse\">neocities.org/browse</a></li><li><a href=\"https://wiby.me\">wiby.me</a></li><li><a href=\"https://oldavista.com\">Old’aVista</a></li><li><a href=\"https://curlie.org\">Curlie</a></li><li><a href=\"https://directory.joejenett.com\">i.webthings directory</a></li><li><a href=\"https://discuss.32bit.cafe/wiki/resources#directories-listings\">32-Bit Cafe Directories &amp; Listings</a></li><li>Webrings: <a href=\"https://foreverliketh.is/blog/exploring-the-personal-web/\">foreverliketh.is/blog/exploring-the-personal-web/</a></li></ul><h3 id=\"indieweb-delights\">IndieWeb Delights</h3><p>Other fun discoveries of the <a href=\"https://shellsharks.com/indieweb#indieweb\">IndieWeb</a> are provided below.</p><ul><li><a href=\"https://wiby.me/surprise/\">wiby.me/surprise</a> (per <a href=\"https://mastodon.social/@Haste/110720564543168205\">@Haste@mastodon.social</a>)</li><li><a href=\"https://www.cameronsworld.net\">Cameron’s World</a> (per <a href=\"https://infosec.exchange/@mttaggart/110720782567478240\">@mttaggart@infosec.exchange</a>)</li><li><a href=\"https://devon.lol/blog/the-old-web/\">The Old Web | Devon.LOL</a></li><li><a href=\"https://shellsharks.com/infosec-blogs#boutique-security-blogs\">Boutique Security Blogs</a></li><li><a href=\"https://news.indieweb.org\">IndieNews</a></li><li><a href=\"http://logiclrd.cx\">Logic Lord</a></li><li><a href=\"https://localghost.dev\">Localghost</a> (<em>very cool site</em>)</li><li><a href=\"https://marigold.town\">Marigold Town</a> [<a href=\"https://tilde.zone/@xandra/111209519497071133\">~</a>]</li><li><a href=\"https://ctrl-c.club\">Ctrl-C Club</a></li><li><a href=\"https://www.indieforums.net\">IndieForums</a></li><li><a href=\"https://home.omg.lol\">omg.lol</a></li><li><a href=\"https://maple.pet\">maple.pet</a></li><li><a href=\"https://potato.cheap\">The “Cheap” Web</a></li><li><a href=\"https://wetnoodle.neocities.org\">Wet Noodle</a></li><li><a href=\"https://projects.kwon.nyc/internet-is-fun/\">The Internet used to be fun</a></li><li><a href=\"https://32bit.cafe\">32-Bit Cafe</a></li></ul><h3 id=\"hosting\">Hosting</h3><p>Being on the IndieWeb means first hosting a site. Here are some good Indie options.</p><ul><li><a href=\"https://write.as\">Write.as</a></li><li><a href=\"https://home.omg.lol\">omg.lol</a></li><li><a href=\"https://pika.page\">Pika</a> (from <a href=\"https://goodenough.us\">Good Enough</a>)</li><li><a href=\"https://yay.boo/\">Yay.Boo</a> (<em>also from</em> <a href=\"https://goodenough.us\">Good Enough</a>)</li><li><a href=\"https://mmm.page\">mmm.page</a></li><li><a href=\"https://micro.blog\">Micro.blog</a></li><li><a href=\"https://ghost.org\">Ghost</a> (and <a href=\"https://outpost.pub\">Outpost.pub</a>)</li><li><a href=\"https://posthaven.com\">Posthaven</a></li><li><a href=\"https://scribbles.page\">Scribbles</a></li><li><a href=\"https://pico.sh/prose\">prose.sh | pico.sh</a></li><li><a href=\"https://bearblog.dev\">Bear</a></li><li><a href=\"https://mataroa.blog\">Mataroa</a></li><li><a href=\"https://smol.pub\">Smol Pub</a></li><li><a href=\"https://montaigne.io\">Montaigne</a></li><li><a href=\"https://havenweb.org\">Haven</a></li><li><a href=\"https://glitch.com\">Glitch</a></li></ul><hr><h1 id=\"references\">References</h1><ul><li><strong><sup>1</sup></strong> <a href=\"https://indieweb.org\">What is the IndieWeb | Indieweb.org</a></li><li><strong><sup>2</sup></strong> <a href=\"https://ar.al/2020/08/07/what-is-the-small-web/\">What is the Small Web? | Aral Balkan</a></li><li><a href=\"https://www.thisdaysportion.com/posts/itfc-indieweb/\">Why organisations should have an indieweb publication strategy</a></li><li><a href=\"https://tracydurnell.com/2022/11/27/making-the-indieweb-more-approachable/\">Making the IndieWeb more approachable | Tracy Durnell</a></li><li><a href=\"https://www.theverge.com/2023/7/3/23782607/social-web-public-apps-end-reddit-twitter-mastodon\">So where are we all supposed to go now? | The Verge</a></li><li><a href=\"https://eftegarie.com/every-person-on-the-planet-should-have-their-own-website/\">Every person on the planet should have their own website | EFTEGARIE</a></li><li><a href=\"https://moddedbear.com/go-start-a-blog/\">Go Start a Blog | moddedBear</a></li><li><a href=\"https://elizabethtai.com/2023/07/03/how-i-am-blogging-the-indieweb-way/\">How I am blogging the IndieWeb way | Elizabeth Tai</a></li><li><a href=\"https://elizabethtai.com/2023/07/02/posse-and-pesos-better-ways-to-publish-content/\">POSSE and PESOS: Better ways to publish content | Elizabeth Tai</a></li><li><a href=\"https://kevquirk.com/how-it-all-connects\">How it all Connects | Kev Quirk</a></li><li><a href=\"https://www.rssboard.org/news/213/atom-feed-format-born-20-years-ago\">Atom Feed Format Was Born 20 Years Ago | RSS Board</a></li><li><a href=\"https://www.oauth.com/oauth2-servers/indieauth/\">IndieAuth | Okta</a></li><li><a href=\"https://rknight.me/adding-webmentions-to-your-site/\">Adding Webmentions to Your Site</a></li><li><a href=\"https://aaronparecki.com/2018/06/30/11/your-first-webmention\">Send your First Webmention from Scratch | Aaron Parecki</a></li><li><a href=\"https://emissary.dev\">Emissary</a></li><li><a href=\"https://en.m.wikipedia.org/wiki/FriendFeed\">FriendFeed</a></li><li><a href=\"https://mxb.dev/blog/webring-kit/\">A Webring Kit | Max Böck</a></li><li><a href=\"https://dead.garden/blog/i-love-ugly-internet-sites-that-cant-do-anything.html\">I love “ugly” internet sites that “can’t do anything”</a></li></ul><h1 id=\"resources\">Resources</h1><ul><li><a href=\"https://therebelweb.org\">The Rebel Web</a></li><li><a href=\"https://discuss.32bit.cafe/wiki/resources\">Resources List for the Personal Web</a></li><li><a href=\"https://feedland.org\">FeedLand</a></li><li><a href=\"https://indiewebify.me\">IndieWebify.Me</a></li><li><a href=\"https://smolweb.org\">smolweb</a></li></ul>",
      "value" : "I’ve been a huge advocate for independent blogging for a while now, both for personal and professional reasons. In fact, I’ve written countless replies to early-career folks about documenting their learning journey via a blog. Since I first founded shellsharks (circa 2019), I’ve devoted a fair bit of time not only to writing “content” but also into a lot of little features that, to me, collectively gave the site depth as well as that sense of “having everything a site should have”. Some of these features include, an RSS feed, robots.txt, humans.txt, security.txt, about page, tags, search, change log, license & disclaimer and more. I’ve poured my creativity, whimsy and mind into the aesthetic, writing and functionality of the site and as a result it has served as an ever-present source of identity and pride for me on the web.\nRecently, I was introduced to the concept of the “IndieWeb” (or small web), a “people-focused alternative to the corporate web”. Intriguing right? My curiosity piqued, I soon discovered IndieWeb.org, an organization dedicated to the proliferation of IndieWeb resources, guides, community and more. They describe the IndieWeb as…\n…a community of independent & personal websites connected by simple standards, based on the principles of: owning your domain & using it as your primary identity, publishing on your own site (optionally syndicating elsewhere), and owning your data. 1\nSound familiar? Sounds kinda like what I’ve been doing with my site for a while now! But what makes the IndieWeb special? Why should you or I care? Is there anything else to it? Read on to learn more!IndieWeb\nThe IndieWeb (or “small web”) is a collection of people-focused websites which share a core set of principles. The IndieWeb is not simply a missionless multitude however, the IndieWeb movement is all about reclaiming the web by de-centralizing what has become all too centralized, encouraging ownership (of your site and your content), and bringing a truer sense of fun and individuality back to the Internet. So why is the IndieWeb important? I’d suggest reading the following pieces by Dan Gillmor, Jamie Tanna & Ariadne Conill, as they do a far more eloquent job than I probably would in explaining this. 1, 2\nI’ve previously made known my reasons for blogging, but now with a better understanding of the IndieWeb, and what’s at stake if we don’t embrace it, I now recognize that my infinitesimally small slice of the Internet guarantees me an incorruptible continuum for my content and my identity on the web. (Check out my IndieWeb.txt file!)\nAwesome! Now that we have a rough understanding of the IndieWeb ethos, let’s cover what is in my mind the principle mechanics of the IndieWeb.Principle Mechanics\nThis section does not provide exhaustive coverage of how to implement IndieWeb functionality. Instead, I simply summarize five core primitives which I feel comprise an IndieWeb site. For a more official gauge on where a site scores within the IndieWeb spectrum, consider leveraging IndieMark!\nHosting: You need a place to host your site and store your content. There are a lot of great options out there. Ideally, choose one that allows you the ability to make some under-the-hood changes and does not limit your content portability.\nSyndication: Share your content with the world! There are two preferred methods for syndication, PESOS and POSSE. This resource does a great job explaining both! For more examples of how this is done, check this and this out. RSS is a great starting point for helping others subscribe to new content on your site.\nWriting: Though your site could simply serve as a more static point/identity on the web, with little to no “content” being regularly added, I recommend writing!\nInteractivity: One of the more advanced concepts within the IndieWeb world, the ability to bake in native comments, replies, likes, etc is a greay way to build community. This interactivity helps mitigate reliance on centralized social networks for communication within Indie communities. One example of IndieWeb interactivity is Webmentions.\nIdentity: Make it unique, make it fun, make it yours. The corporate web is sterile and suffocating. Let’s bring back the whimsy of the old web.IndieMark\nIndieMark is a progressive set of requirements (from IndieWeb.org) which provide quantitative and level-based measurement of the indieweb-ness of a site. I’ll maintain a current score for shellsharks.com here –> Shellsharks IndieMark Score.The Delightful Small Web\nThe Internet is vast, yet collectively we spend most of our time these days (sadly) within boring, behemoth, centralized corporate-web watering holes. Beyond the corporate web lies countless relics of the old web, unique destinations of the IndieWeb and delights of the small web.Webrings\nA webring is a collection of websites that are linked together, each pointing to and from another site in the ring. They serve as a fun way to build community and facilitate discovery of new sites! Some Webrings and -related resources are provided below.Public Interest Tech Webring by Bill Hunt (Join! or host your own with webring-starter)webring.xxiivv (per @IPXFong@mastodon.sdf.org)Webring Enthusiasts of the Fediverse (Shellsharks is on there!)Fediring.netWebrings | sadgrl.online - A collection of Webrings.Weird Wide Webring🕸💍.wsmerveilles wonder webringDraconic WebringgeekringAlterhuman Summoning Circlesilly citygeneration Lissaa11y-webring.clubHotline WebringRetronautBlogrolls\nSome /blogrolls that people have published…Max Böck blogrollExplore the IndieWeb\nThe sites below are ways to discover, explore and find the sites of the IndieWebooh.directorymarginalia.nuindieseek.xyzkagi.com/smallweb/searchmysite.netwhimsical.clubtheuselessweb.comtheforest.linkpersonalsit.esindieweb-directory.glitch.megodteeth.com/misc/randomwebblogroll.orgindieblog.pageblogs.hnneocities.org/browsewiby.meOld’aVistaCurliei.webthings directory32-Bit Cafe Directories & ListingsWebrings: foreverliketh.is/blog/exploring-the-personal-web/IndieWeb Delights\nOther fun discoveries of the IndieWeb are provided below.wiby.me/surprise (per @Haste@mastodon.social)Cameron’s World (per @mttaggart@infosec.exchange)The Old Web | Devon.LOLBoutique Security BlogsIndieNewsLogic LordLocalghost (very cool site)Marigold Town [~]Ctrl-C ClubIndieForumsomg.lolmaple.petThe “Cheap” WebWet NoodleThe Internet used to be fun32-Bit CafeHosting\nBeing on the IndieWeb means first hosting a site. Here are some good Indie options.Write.asomg.lolPika (from Good Enough)Yay.Boo (also from Good Enough)mmm.pageMicro.blogGhost (and Outpost.pub)PosthavenScribblesprose.sh | pico.shBearMataroaSmol PubMontaigneHavenGlitchReferences1 What is the IndieWeb | Indieweb.org2 What is the Small Web? | Aral BalkanWhy organisations should have an indieweb publication strategyMaking the IndieWeb more approachable | Tracy DurnellSo where are we all supposed to go now? | The VergeEvery person on the planet should have their own website | EFTEGARIEGo Start a Blog | moddedBearHow I am blogging the IndieWeb way | Elizabeth TaiPOSSE and PESOS: Better ways to publish content | Elizabeth TaiHow it all Connects | Kev QuirkAtom Feed Format Was Born 20 Years Ago | RSS BoardIndieAuth | OktaAdding Webmentions to Your SiteSend your First Webmention from Scratch | Aaron PareckiEmissaryFriendFeedA Webring Kit | Max BöckI love “ugly” internet sites that “can’t do anything”ResourcesThe Rebel WebResources List for the Personal WebFeedLandIndieWebify.Mesmolweb"
    } ],
    "author" : [ {
      "type" : [ "h-card" ],
      "properties" : {
        "name" : [ "Mike Sass" ]
      },
      "value" : "Mike Sass"
    } ]
  }
}
