{
  "type" : [ "h-entry" ],
  "properties" : {
    "name" : [ "Ben Cotton (he/him) (@funnelfiasco@hachyderm.io)" ],
    "summary" : [ "What I told my kids this morning https://funnelfiasco.com/blog/2024/11/06/what-i-told-my-kids-this-morning/" ],
    "url" : [ "https://hachyderm.io/@funnelfiasco/113436562977140332" ]
  }
}
