{
  "type" : [ "h-entry" ],
  "properties" : {
    "name" : [ "*IRL & ONLINE* Jenkins 101, Tue, Jun 25, 2024, 6:30 PM   | Meetup" ],
    "summary" : [ "**The Talk;**\n\nAn overview of Jenkins, it’s history, and how it works.\n\n**Agenda**;\n\n18:30; Doors Open\n19:00; Speaker delivers talk\n19:45; Pizza and catch up\n20:30; Doors c" ],
    "featured" : [ "https://secure.meetupstatic.com/photos/event/2/0/c/9/600_521648393.jpeg" ],
    "url" : [ "https://www.meetup.com/devops-notts/events/301554693/" ]
  }
}
