{
  "type" : [ "h-entry" ],
  "properties" : {
    "name" : [ "Chris \"Not So\" Short 🇺🇦 (@ChrisShort@hachyderm.io)" ],
    "summary" : [ "If you have a Jekyll-based web site with a container to build it locally, can you link me to it, please? I've got some unexplainable issues/errors." ],
    "url" : [ "https://hachyderm.io/@ChrisShort/112253706902229085" ]
  }
}
