{
  "type" : [ "h-entry" ],
  "properties" : {
    "name" : [ "Malvika Sharan on the The Turing Way" ],
    "summary" : [ "Malvika explores _The Turing Way_, a resource on how to build open source together in the sciences. She talks about the significance of acknowledging contributions, rewarding contributors, and the enduring spirit of volunteerism in open source." ],
    "featured" : [ "https://assets.fireside.fm/file/fireside-images/podcasts/images/2/27729c65-f4a6-4496-8c86-820e7f13b285/episodes/c/ce643790-864e-459e-9dd1-892135d01ceb/cover_medium.jpg?v=1" ],
    "audio" : [ "https://aphid.fireside.fm/d/1437767933/27729c65-f4a6-4496-8c86-820e7f13b285/ce643790-864e-459e-9dd1-892135d01ceb.mp3" ],
    "author" : [ {
      "type" : [ "h-card" ],
      "properties" : {
        "name" : [ "SustainOSS" ]
      }
    } ],
    "url" : [ "https://podcast.sustainoss.org/221" ]
  }
}
