{
  "type" : [ "h-entry" ],
  "properties" : {
    "name" : [ "GitHub - pb33f/libopenapi: libopenapi is a fully featured, high performance OpenAPI 3.1, 3.0 and Swagger parser, library, validator and toolkit for golang applications." ],
    "summary" : [ "libopenapi is a fully featured, high performance OpenAPI 3.1, 3.0 and Swagger parser, library, validator and toolkit for golang applications. - pb33f/libopenapi" ],
    "featured" : [ "https://opengraph.githubassets.com/df8b1e0f74b2690145d4c23e6ee10f589f670a45cffb2b146f19d1365044aaf6/pb33f/libopenapi" ],
    "url" : [ "https://github.com/pb33f/libopenapi" ]
  }
}
