{
  "type" : [ "h-entry" ],
  "properties" : {
    "name" : [ "Hazel Weakly (@hazelweakly@hachyderm.io)" ],
    "summary" : [ "Y'know how there's a pattern of behavior where someone says something is bad about the tech industry or community or OSS software or something, and then every single nerd within a 50 square mile radius says *WELL ACKTUALLY*?? \n\nI just realized that if, like, even 10% of them just... Sat down and spent some energy fixing the problem instead of insulting someone for experiencing it, we would've solved all those issues by now" ],
    "url" : [ "https://hachyderm.io/@hazelweakly/112544697743298932" ]
  }
}
