{
  "type" : [ "h-entry" ],
  "properties" : {
    "name" : [ "Ian Coldwater 📦💥 (@lookitup.baby)" ],
    "summary" : [ "Apparently my model of dishwasher goes on strike if you neglect it and refuses to run any cycle but Machine Care until you descale and put salt in it\n\nAnd you know what? I respect that" ],
    "url" : [ "https://bsky.app/profile/lookitup.baby/post/3ljc2kxazpc2z" ],
    "published" : [ "2025-03-01T04:12:32.555Z" ]
  }
}
