{
  "type" : [ "h-entry" ],
  "properties" : {
    "name" : [ "Jumping into an existing codebase (Go Time #307)" ],
    "summary" : [ "Jumping into a codebase you’re unfamiliar with can be challenging. Are there better &amp;amp; worse ways to go about it? In this episode, Ian gathers a panel (Johnny, Kris &amp;amp; Jon) to discuss the ins &amp;amp; outs of familiarizing yourself with an existing codebase. " ],
    "featured" : [ "https://cdn.changelog.com/static/images/share/twitter-gotime-a47cdd7bb3e3357398eda827d9cc3615.png" ],
    "audio" : [ "https://op3.dev/e/https://cdn.changelog.com/uploads/gotime/307/go-time-307.mp3" ],
    "url" : [ "https://changelog.com/gotime/307" ]
  }
}
