{
  "type" : [ "h-entry" ],
  "properties" : {
    "name" : [ "Rob Whitaker (@RobW@iosdev.space)" ],
    "summary" : [ "@www.jvt.me@www.jvt.me Jamie, politely, bollocks are you that young." ],
    "url" : [ "https://iosdev.space/@RobW/112113028597314583" ]
  }
}
