{
  "type" : [ "h-entry" ],
  "properties" : {
    "name" : [ "Wouter (@jefklak@dosgame.club)" ],
    "summary" : [ "@www.jvt.me@www.jvt.me anything worthwhile willing to share?" ],
    "url" : [ "https://dosgame.club/@jefklak/112875959608134586" ]
  }
}
