{
  "type" : [ "h-entry" ],
  "properties" : {
    "name" : [ "Tanya (@solderandchaos@mastodon.me.uk)" ],
    "summary" : [ "Attached: 1 image\n\nWhy would anyone want a phone without a keyboard? I mean, he’s not wrong. #blackberry" ],
    "featured" : [ "https://mastodon.me.uk/system/media_attachments/files/112/299/467/586/118/637/original/3c8c16be9d77524a.png" ],
    "url" : [ "https://mastodon.me.uk/@solderandchaos/112299471780495417" ]
  }
}
