{
  "type" : [ "h-entry" ],
  "properties" : {
    "name" : [ "mcc (@mcc@mastodon.social)" ],
    "summary" : [ "Attached: 1 image\n\n2025" ],
    "featured" : [ "https://files.mastodon.social/media_attachments/files/113/795/195/518/456/453/original/7bbb5d0d9dd9e9e6.png" ],
    "url" : [ "https://mastodon.social/@mcc/113795198442673774" ]
  }
}
