{
  "type" : [ "h-entry" ],
  "properties" : {
    "name" : [ "Chris \"Not So\" Short (@ChrisShort@hachyderm.io)" ],
    "summary" : [ "@coldclimate It's not morality. It's protecting my peace. If that happens to be morally correct then so be it. The number of organizational changes the past two weeks has been wild." ],
    "url" : [ "https://hachyderm.io/@ChrisShort/113889634835529964" ]
  }
}
