{
  "type" : [ "h-entry" ],
  "properties" : {
    "name" : [ "ghorwood↙↙↙ (@ghorwood@mastodon.social)" ],
    "summary" : [ "Attached: 1 image" ],
    "featured" : [ "https://files.mastodon.social/media_attachments/files/112/457/175/897/365/953/original/ec79362ecf50bc0a.jpg" ],
    "url" : [ "https://mastodon.social/@ghorwood/112457177500348230" ]
  }
}
