{
  "type" : [ "h-entry" ],
  "properties" : {
    "name" : [ "Waldo Jaquith (@waldoj@mastodon.social)" ],
    "summary" : [ "$1 million budget: 90% test coverage, comprehensive DevOps pipeline, all work rooted in user research, delivery every two weeks, all code in an open repo.\n\n$300 million budget: No tests, no CI/CD,  no user research, delivery on an annual cadence, code is a secret because it's a trash fire." ],
    "url" : [ "https://mastodon.social/@waldoj/112140824061220484" ]
  }
}
