{
  "type" : [ "h-card" ],
  "properties" : {
    "name" : [ "haliphax ????" ],
    "photo" : [ {
      "value" : "https://v1.image.11ty.dev/https%3A%2F%2Fwebmention.io%2Favatar%2Fcdn.masto.host%2F228b77d961c69780574b98a0db6e59127abebe4467d49471d5e20ae089084284.jpg/jpeg/72/",
      "alt" : "haliphax ????"
    } ],
    "url" : [ "https://fediverse.zachleat.com/@zachleat/112917087819399708#favorited-by-109369141298839313" ]
  },
  "lang" : "en"
}
