{
  "type" : [ "h-entry" ],
  "properties" : {
    "name" : [ "Changelog (@changelog@changelog.social)" ],
    "summary" : [ "Starting in January, we’ll be focusing all of our efforts on producing The Changelog (News, Interviews, Friends) as the single best developer podcast experience.\n\nhttps://changelog.com/posts/a-new-era-for-the-changelog-podcast-universe" ],
    "url" : [ "https://changelog.social/@changelog/113606179991991617" ]
  }
}
