{
  "type" : [ "h-entry" ],
  "properties" : {
    "name" : [ "Dan Pope (@danielthepope@mastodon.me.uk)" ],
    "summary" : [ "This game came by at just the right time. Covid gave me the perfect excuse to play this game for hours on end without feeling guilty, and now I’ve finally achieved 5 stars!\n\n🐶💩⛳️ I binned the bag in 4 throws, rating ⭐️⭐️⭐️⭐️⭐️\nhttps://vole.wtf/dog-poo-golf/" ],
    "url" : [ "https://mastodon.me.uk/@danielthepope/112180989495420422" ]
  }
}
