{
  "type" : [ "h-entry" ],
  "properties" : {
    "name" : [ "Ryan 🏳️‍⚧️ (@ryanhoulihan@mastodon.social)" ],
    "summary" : [ "Why is the aid that I get conditional but the aid that Israel gets isn’t?" ],
    "url" : [ "https://mastodon.social/@ryanhoulihan/111885733505081986" ]
  }
}
