{
  "type" : [ "h-entry" ],
  "properties" : {
    "name" : [ "Filippo Valsorda (@filippo.abyssdomain.expert)" ],
    "summary" : [ "Can we bring it to the physical world. As a toggle." ],
    "url" : [ "https://bsky.app/profile/filippo.abyssdomain.expert/post/3le2zq2sgq22c" ],
    "published" : [ "2024-12-24T18:02:54.351Z" ]
  }
}
