{
  "type" : [ "h-card" ],
  "properties" : {
    "name" : [ "Tom Stafford" ],
    "photo" : [ {
      "value" : "https://files.mastodon.social/cache/accounts/avatars/109/262/685/082/011/649/original/0a75941d5bd3a4ef.png",
      "alt" : ""
    } ],
    "url" : [ "https://mastodon.online/@tomstafford/113675024264688431" ]
  },
  "lang" : "en-GB"
}
