{
  "type" : [ "h-entry" ],
  "properties" : {
    "name" : [ "Tane Piper ⁂ (@tanepiper@tane.codes)" ],
    "summary" : [ "Attached: 1 image\n\nHow passive aggressive are you this morning?" ],
    "featured" : [ "https://cdn.masto.host/tanecodes/media_attachments/files/113/276/121/733/731/595/original/dc0dbbaa71b2837b.png" ],
    "url" : [ "https://tane.codes/@tanepiper/113276123223680713" ]
  }
}
