{
  "type" : [ "h-entry" ],
  "properties" : {
    "name" : [ "@davevans.bsky.social" ],
    "summary" : [ "Light snow just starting in ng12 #snow #uksnow\nuksnowmap.com" ],
    "url" : [ "https://bsky.app/profile/davevans.bsky.social/post/3lex4u4ekq22u" ],
    "published" : [ "2025-01-04T22:13:34.654Z" ]
  }
}
