{
  "type" : [ "h-entry" ],
  "properties" : {
    "name" : [ "Luna (@luna@pony.social)" ],
    "summary" : [ "Did you know? The best reason to get a studio-quality microphone is so you can get real close to it and whisper soft flirty affirmations to your friends and make them blush!" ],
    "url" : [ "https://pony.social/@luna/111308137459131301" ]
  }
}
