{
  "type" : [ "h-entry" ],
  "properties" : {
    "name" : [ "WiT Notts (@witnotts@mastodon.social)" ],
    "summary" : [ "Hello World 💜 💛" ],
    "url" : [ "https://mastodon.social/@witnotts/112315038460669475" ]
  }
}
