{
  "type" : [ "h-entry" ],
  "properties" : {
    "name" : [ "Ludic 🧛 (@ludicity@mastodon.sprawl.club)" ],
    "summary" : [ "I've just invented a new way to filter out employers that haven't done any diligence:\n\nhttps://github.com/Nikhil-Suresh/did-you-actually-check-my-github/tree/main" ],
    "url" : [ "https://mastodon.sprawl.club/@ludicity/112453810988519482" ]
  }
}
