{
  "type" : [ "h-entry" ],
  "properties" : {
    "name" : [ "Dan Hon (@danhon@dan.mastohon.com)" ],
    "summary" : [ "Attached: 1 image\n\nThey're here.\n\nFinally.\n\nhttps://donotreply.cards/\n\nOh, and subscribe for when the stickers are out. \n\n(You want the stickers.)\n\nMade with @Ffangohr@mastodon.social with a lot of fun." ],
    "featured" : [ "https://cdn.masto.host/danmastohoncom/media_attachments/files/112/022/612/898/196/192/original/88d2745b797ebe37.jpeg" ],
    "url" : [ "https://dan.mastohon.com/@danhon/112022613240712505" ]
  }
}
