{
  "type" : [ "h-entry" ],
  "properties" : {
    "name" : [ "Sophie (@sophie@social.lol)" ],
    "summary" : [ "Attached: 1 image\n\nThis is the energy I need" ],
    "featured" : [ "https://media.social.lol/media_attachments/files/111/935/060/379/414/464/original/12d7cb2422aed693.png" ],
    "url" : [ "https://social.lol/@sophie/111935065635970834" ]
  }
}
