{
  "type" : [ "h-entry" ],
  "properties" : {
    "name" : [ "What's New in Neovim 0.10" ],
    "url" : [ "https://gpanders.com/blog/whats-new-in-neovim-0.10/" ],
    "uid" : [ "https://gpanders.com/blog/whats-new-in-neovim-0.10/" ],
    "published" : [ "2024-05-16T00:00:00Z" ],
    "updated" : [ "2024-05-16T00:00:00Z00:00Z" ],
    "content" : [ {
      "html" : "<p>Neovim 0.10 was the longest release cycle since the heady days of the 0.5\nrelease. There are a ton of new features in this release (as well as some\nbreaking changes), so be sure to check the full <a href=\"https://neovim.io/doc/user/news-0.10.html\">release notes</a>. You can\nview the release notes directly in Nvim with <code>:h news</code>. The news file includes\ninformation on new features, deprecations, and breaking changes. I especially\nurge plugin authors to read this file carefully.</p>\n<p>Like <a href=\"https://gpanders.com/blog/whats-new-in-neovim-0-7/\">last time</a>, in this post I’ll cover a subset of the new features.\nAs I said, it’s a big release, and I won’t write about everything, but these\nare some of the highlights.</p>\n<h2 id=\"table-of-contents\">\n  <a href=\"https://gpanders.com/blog/whats-new-in-neovim-0.10/#table-of-contents\">Table of Contents</a>\n</h2>\n<ul>\n<li><a href=\"https://gpanders.com/blog/whats-new-in-neovim-0.10/#defaults\">Defaults</a></li>\n<li><a href=\"https://gpanders.com/blog/whats-new-in-neovim-0.10/#builtin-commenting\">Builtin commenting</a></li>\n<li><a href=\"https://gpanders.com/blog/whats-new-in-neovim-0.10/#terminal-ui-enhancements\">Terminal UI enhancements</a></li>\n<li><a href=\"https://gpanders.com/blog/whats-new-in-neovim-0.10/#lsp-inlay-hints\">LSP inlay hints</a></li>\n<li><a href=\"https://gpanders.com/blog/whats-new-in-neovim-0.10/#tree-sitter-query-editor\">Tree-sitter query editor</a></li>\n<li><a href=\"https://gpanders.com/blog/whats-new-in-neovim-0.10/#miscellaneous\">Miscellaneous</a></li>\n<li><a href=\"https://gpanders.com/blog/whats-new-in-neovim-0.10/#roadmap\">Roadmap</a></li>\n</ul>\n<h2 id=\"defaults\">\n  <a href=\"https://gpanders.com/blog/whats-new-in-neovim-0.10/#defaults\">Defaults</a>\n</h2>\n<h3 id=\"colorscheme\">\n  <a href=\"https://gpanders.com/blog/whats-new-in-neovim-0.10/#colorscheme\">Colorscheme</a>\n</h3>\n<p>Nvim has been in need of a new default colorscheme for a long time. While the\ndefault colors have some charm and nostalgia, there are serious accessibility\nand aesthetic issues, particular when using Nvim is a diff viewer. The\nscreenshot below shows the default colorscheme before Nvim 0.10:</p>\n<figure><img src=\"https://gpanders.com/img/nvim-colorscheme-old.png\" alt=\"Neovim's default colorscheme before 0.10\">\n</figure>\n\n<p>Nvim 0.10 now ships with a new default colorscheme, which you can see below:</p>\n<figure><img src=\"https://gpanders.com/img/nvim-colorscheme-new.png\" alt=\"Neovim's new default colorscheme\">\n</figure>\n\n<p>The new default colorscheme was heroically contributed by <a href=\"https://github.com/echasnovski\">Evgeni\nChasnovski</a>, who endured seemingly endless bikeshedding and\nsuccessfully navigated the treacherous waters of such a subjective change.\nThere were many constraints imposed on the design of the colorscheme, which\nyou can read in the <a href=\"https://github.com/neovim/neovim/pull/26334\">PR</a> (and the many follow up PRs and issues linked\ntherein). It is quite literally impossible to please <em>everyone</em> with a single\ncolorscheme, and there is no expectation that we have achieved that, but the\nnew colorscheme does, hopefully, improve the default experience for many\npeople.</p>\n<h3 id=\"lsp-and-diagnostics-mappings\">\n  <a href=\"https://gpanders.com/blog/whats-new-in-neovim-0.10/#lsp-and-diagnostics-mappings\">LSP and Diagnostics Mappings</a>\n</h3>\n<p>Nvim 0.10 adds a new <a href=\"https://github.com/neovim/neovim/pull/24331\">default mapping</a>: <code>K</code> in Normal mode maps to\n<code>vim.lsp.buf.hover()</code> whenever a buffer attaches to an LSP client, unless\n<code>'keywordprg'</code> is already set to a non-default value. Use this to view\ninformation about the function or variable under the cursor. This in addition\nto the existing defaults mentioned in <code>:h lsp-defaults</code> which were added in\nthe previous release.</p>\n<p>In addition, there are new <a href=\"https://github.com/neovim/neovim/pull/16230\">default mappings</a> for navigating\ndiagnostics:</p>\n<ul>\n<li><code>[d</code> and <code>]d</code> in Normal mode map to <code>vim.diagnostic.goto_prev()</code> and\n<code>vim.diagnostic.goto_next()</code>, respectively. Use these to navigate between\ndiagnostics in the current buffer.</li>\n<li><code>&lt;C-W&gt;d</code> (and <code>&lt;C-W&gt;&lt;C-D&gt;</code>) in Normal mode map to\n<code>vim.diagnostic.open_float()</code>. Use this to view information about any\ndiagnostics under the cursor in a floating window.</li>\n</ul>\n<p>The diagnostics mappings override builtin mappings. These builtin mappings are\nnot often used, but if you <em>do</em> use them you can delete the new default\nmappings with <code>vim.keymap.del()</code> or <code>:unmap</code>.</p>\n<p>The intention behind providing more default mappings is to make it easier to\nget started with LSP in Neovim. The hope is that most users should be able to\nget up and running with useful LSP features with little to no configuration\nand without needing to write a bunch of Lua code. We have plans to add more\ndefaults in future releases, though as you might imagine this is a fraught\nexercise. It is quite difficult to change default behavior in a tool as\nextensible and customizable as Nvim without breaking users'\n<a href=\"https://xkcd.com/1172/\">workflows</a>.</p>\n<p>Two features which many users rely on for their LSP experience are snippets\nsupport and autocompletion. Both of these features are on the roadmap to be\nincluded in Nvim core (see <a href=\"https://github.com/neovim/neovim/pull/27339\">#27339</a>, <a href=\"https://github.com/neovim/neovim/issues/25696\">#25696</a>, and <a href=\"https://github.com/neovim/neovim/issues/25670\">#25670</a>) which\nwill, hopefully, make the experience of using LSP in Neovim even smoother in\nthe future.</p>\n<h2 id=\"builtin-commenting\">\n  <a href=\"https://gpanders.com/blog/whats-new-in-neovim-0.10/#builtin-commenting\">Builtin Commenting</a>\n</h2>\n<p>Longtime Vim users are likely familiar with the venerable <a href=\"https://github.com/tpope/vim-commentary\">vim-commentary</a>\nplugin, which creates mappings and operators for commenting and uncommenting\ntext. Thanks to <a href=\"https://github.com/echasnovski\">Evgeni Chasnovski</a>, Nvim 0.10 now <a href=\"https://github.com/neovim/neovim/pull/28176\">bundles this\nfunctionality</a> by default, using a from-scratch implementation in\nLua. Unlike vim-commentary, Nvim’s builtin implementation provides a text\nobject and supports Tree-sitter, which is useful when working in injected\nlanguages (example: if you comment text inside a <code>&lt;script&gt;</code> tag in an HTML\nbuffer, it will correctly use the Javascript <code>//</code> comment string rather than\nHTML’s <code>&lt;!-- --&gt;</code> comment string).</p>\n<p>See <code>:h commenting</code> for more details.</p>\n<h2 id=\"terminal-ui-enhancements\">\n  <a href=\"https://gpanders.com/blog/whats-new-in-neovim-0.10/#terminal-ui-enhancements\">Terminal UI enhancements</a>\n</h2>\n<p>Nvim 0.10 adds support for many new terminal based capabilities.</p>\n<h3 id=\"synchronized-output\">\n  <a href=\"https://gpanders.com/blog/whats-new-in-neovim-0.10/#synchronized-output\">Synchronized Output</a>\n</h3>\n<p>Many modern terminal emulators support <a href=\"https://gist.github.com/christianparpart/d8a62cc1ab659194337d73e399004036\">synchronized output</a> which allows\nterminal applications (like Nvim) to “batch” all of their UI updates in the\nterminal emulator and display them all at once. This can reduce “flickering”\nand “tearing” when a terminal UI (TUI) is being drawn very rapidly. This can\nsometimes happen in Nvim when using plugins that perform rapid UI updates\n(e.g. spinners, LSP status windows, etc.). Nvim 0.10 introduces a new\n<code>'termsync'</code> option (enabled by default) which enables this feature if it is\nsupported by the terminal emulator.</p>\n<h3 id=\"system-clipboard-synchronization\">\n  <a href=\"https://gpanders.com/blog/whats-new-in-neovim-0.10/#system-clipboard-synchronization\">System clipboard synchronization</a>\n</h3>\n<p>Nvim 0.10 can now use the OSC 52 escape sequence to write to (or read from)\nthe system clipboard. OSC 52 is only used automatically when (1) it is able to\ndetermine that the terminal emulator supports it (via XTGETTCAP), (2) it is\nrunning in an SSH session, and (3) when the <code>'clipboard'</code> option is unset.\nNote that some terminal emulators do not support reading from the system\nclipboard with OSC 52, or only allow it after prompting the user for\nconfirmation. It is recommended to use the traditional “paste” key binding\n(e.g. <code>Cmd+V</code> on macOS or <code>Ctrl+Shift+V</code> on Linux) to paste into Nvim from the\nsystem clipboard and use <code>\"+</code> to copy to the clipboard inside Nvim (see <code>:h quoteplus</code>).</p>\n<h3 id=\"hyperlinks\">\n  <a href=\"https://gpanders.com/blog/whats-new-in-neovim-0.10/#hyperlinks\">Hyperlinks</a>\n</h3>\n<p>Nvim 0.10 introduces experimental support for hyperlinks using the OSC 8\nsequence. By default, this is used in Markdown for links of the form\n<code>[example](https://example.com)</code>. If your terminal emulator supports the OSC 8\nescape sequence, then the text <code>example</code> in the Nvim buffer will contain a\nhyperlink that can be clicked and will open <code>https://example.com</code> in your web\nbrowser.</p>\n<p>This means that users can view Markdown files with <code>:set conceallevel=2</code> and\nget an experience much closer to the rendered output:</p>\n<figure><img src=\"https://gpanders.com/img/nvim-readme.png\" alt=\"Screenshot of the Neovim README opened in Nvim\">\n</figure>\n\n<p>In the screenshot above, the underlined words are clickable link text, just as\nyou would find in a web browser.</p>\n<h3 id=\"automatic-truecolor-detection\">\n  <a href=\"https://gpanders.com/blog/whats-new-in-neovim-0.10/#automatic-truecolor-detection\">Automatic truecolor detection</a>\n</h3>\n<p>Nvim 0.10 will now automatically determine if the terminal emulator supports\n24 bit color (“truecolor”) and enable the <code>'termguicolors'</code> option if it does.\nIt does this through a combination of heuristics (<code>$COLORTERM</code>, terminfo) and\nterminal queries (DECRQSS, XTGETTCAP). This detection works even over SSH\nconnections and when inside a terminal multiplexer such as <code>tmux</code>.</p>\n<h2 id=\"lsp-inlay-hints\">\n  <a href=\"https://gpanders.com/blog/whats-new-in-neovim-0.10/#lsp-inlay-hints\">LSP inlay hints</a>\n</h2>\n<p>Nvim 0.10 now supports <a href=\"https://github.com/neovim/neovim/pull/23984\">LSP inlay hints</a> thanks to <a href=\"https://github.com/p00f\">Chinmay\nDalal</a>. A picture here will do more than my words can:</p>\n<figure><img src=\"https://gpanders.com/img/nvim-inlay-hints.png\" alt=\"Screenshot of Nvim showing inlay hints\">\n</figure>\n\n<p>The dark colored texts which display type annotations for variable declarations\nare inlay hints. This text is not part of the actual source file in the\nbuffer, but is “virtual” text inserted by Nvim and provided by the language\nserver. These hints can be enabled or disabled dynamically using\n<code>vim.lsp.inlay_hint.enable()</code>.</p>\n<p>Many other new LSP features were added in Nvim 0.10 as well. Refer to the\n“LSP” section in <code>:h news</code> for a full list.</p>\n<h2 id=\"tree-sitter-query-editor\">\n  <a href=\"https://gpanders.com/blog/whats-new-in-neovim-0.10/#tree-sitter-query-editor\">Tree-sitter query editor</a>\n</h2>\n<p>Nvim 0.10 adds even more tools for working with Tree-sitter queries. If you\ndidn’t know already, Nvim bundles an “inspector” which allows you to view the\nabstract syntax tree of any source file with the <code>:InspectTree</code> command (so\nlong as a Tree-sitter parser for the file’s language is installed). Example:</p>\n<figure><img src=\"https://gpanders.com/img/nvim-inspect-tree.png\" alt=\"Screenshot of the :InspectTree command in Nvim\">\n</figure>\n\n<p>Thanks to <a href=\"https://github.com/MariaSolOs\">Maria José Solano</a>, Nvim 0.10 adds a powerful\ncapability to the Tree-sitter inspector: <a href=\"https://github.com/neovim/neovim/pull/24703\">a query editor</a>. The query\neditor allows you to write queries and see the matches in a source buffer in\nreal time. Being able to create and modify queries interactively makes writing\nnew queries a breeze. Example:</p>\n<figure><img src=\"https://gpanders.com/img/nvim-query-editor.png\" alt=\"Screenshot of the :EditQuery command in Nvim\">\n</figure>\n\n<p>In the screenshot above, the query editor is open in the top-right window, the\ntree inspector is in the bottom-right window, and the source buffer is in the\nleft window. Notice that the text that is matched by the query in the query\neditor is highlighted in the source buffer and that the text <strong>initializer</strong>\n(the capture group used in the query) is floating on the line next to the\nmatch. As the query is updated in the editor, the corresponding highlights in\nthe source buffer change in real time.</p>\n<p>The query editor can be opened by pressing <code>o</code> in the <code>:InspectTree</code> window,\nwith the <code>:EditQuery</code> command, or by calling <code>vim.treesitter.query.edit()</code>\ndirectly.</p>\n<p>With <code>:InspectTree</code> and <code>:EditQuery</code>, Neovim is one of the best tools (if not\n<em>the</em> best tool) for working with Tree-sitter, even if you don’t actually use\nNeovim.</p>\n<h2 id=\"miscellaneous\">\n  <a href=\"https://gpanders.com/blog/whats-new-in-neovim-0.10/#miscellaneous\">Miscellaneous</a>\n</h2>\n<p>As I mentioned at the top of this post, there are <em>a lot</em> of new features in\nthis release, and I am not going to cover all of them. Here I’ll list a few\nmore that I personally think are worth mentioning:</p>\n<ul>\n<li>\n<p>The <code>:terminal</code> command now accepts modifiers, so you can use e.g. <code>:botright terminal</code> (or <code>:bo te</code>) to open a new terminal window in a split at the\nbottom of your screen. In addition, <code>:terminal</code> buffers that are started\nwith no arguments (and thus open a shell) will close automatically when the\nshell exits without an error.</p>\n</li>\n<li>\n<p><code>gx</code> in Normal mode calls <code>vim.ui.open()</code> on whatever is under the cursor,\nwhich shells out to your operating system’s “open” capability (e.g. <code>open</code>\non macOS or <code>xdg-open</code> on Linux). For instance, pressing <code>gx</code> on a URL will\nopen that URL in your browser.</p>\n</li>\n<li>\n<p>Tree-sitter based syntax highlighting is enabled by default for Lua, Vimdoc\n(<code>:help</code>), and Tree-sitter queries (to revert to traditional regex\nbased syntax highlighting, create a <code>FileType</code> autocommand or <code>ftplugin</code>\nwith <code>vim.treesitter.stop()</code> for the respective filetype).</p>\n</li>\n<li>\n<p><code>Q</code> and <code>@</code> in Visual mode will execute the last recorded/executed macro for\nall visually selected lines.</p>\n</li>\n<li>\n<p>Users using a terminal emulator that supports the Kitty keyboard protocol\ncan create mappings using the “super” and “meta” modifiers with the <code>&lt;D-</code>\nand <code>&lt;T-</code> prefixes, respectively (e.g. <code>&lt;D-S&gt;</code> is <code>Cmd+S</code> on macOS).</p>\n</li>\n</ul>\n<h2 id=\"roadmap\">\n  <a href=\"https://gpanders.com/blog/whats-new-in-neovim-0.10/#roadmap\">Roadmap</a>\n</h2>\n<p>The Neovim project is loosely organized and structured. We follow a “fun\ndriven development” paradigm: for the most part, contributors and maintainers\nwork on things that are personally interesting to them. Because of this, it\ncan be difficult to predict what will happen in future releases. If there is a\nfeature you want to see implemented, the best way to do it is to take a crack\nat it yourself: many of the features mentioned in this very blog post were\ncontributed by users that are not part of the “core” maintenance team!</p>\n<p>There is active chatter about further improving the LSP and Tree-sitter\nexperience (as mentioned above, builtin snippet and completion support are a\nwork-in-progress). One of the biggest challenges with Tree-sitter is parser\ndistribution: currently, parsers are shared object files which must be\ncompiled on every user’s machine or distributed with a system package manager.\nWe are already working on implementing the new <a href=\"https://github.com/neovim/neovim/pull/28415\">Tree-sitter WASM\ncapabilities</a> which will enable distributing Tree-sitter parsers as\nportable WASM blobs. This solves the distribution problem and may enable\nNeovim to ship more Tree-sitter parsers out of the box.</p>\n<p>We would also like to integrate some of the functionality from\n<a href=\"https://github.com/neovim/nvim-lspconfig\">nvim-lspconfig</a> so that, ideally, nvim-lspconfig is just a “bag of configs”\nwithout any smarts or core logic. How best to do this is still hotly debated,\nbut it is something that is being discussed.</p>\n<h2 id=\"getting-involved\">\n  <a href=\"https://gpanders.com/blog/whats-new-in-neovim-0.10/#getting-involved\">Getting Involved</a>\n</h2>\n<p>There is nothing quite as fun as hacking on your own tools. If you are a\nNeovim user, I encourage you to get involved, whether that is through\ncontributing directly to the Neovim project or a plugin, or simply\nparticipating in community spaces such as the <a href=\"https://matrix.to/#/#neovim:matrix.org\">Neovim Matrix room</a>. If you\nhave pain points or frustrations when using Neovim, please let us know. Many\nof us on the core maintenance team have been using Vim/Nvim for so long that\nwe’ve forgotten what it’s like to be a beginner and, speaking for myself at\nleast, this can leave blind spots on how things can be improved.</p>\n<p>Thanks for reading and for using Neovim! Hopefully the next update will come a\nlittle sooner.</p>\n<h1 id=\"one-last-thing\">\n  <a href=\"https://gpanders.com/blog/whats-new-in-neovim-0.10/#one-last-thing\">One Last Thing</a>\n</h1>\n<p>The Neovim project now has a merch <a href=\"https://store.neovim.io/\">store</a>! If you\ndidn’t know that you needed a Neovim branded hoodie or mug, now you do. All\nproceeds raised from the store are used to fund project needs and sponsor\nfull-time development work.</p>",
      "value" : "Neovim 0.10 was the longest release cycle since the heady days of the 0.5 release. There are a ton of new features in this release (as well as some breaking changes), so be sure to check the full release notes. You can view the release notes directly in Nvim with :h news. The news file includes information on new features, deprecations, and breaking changes. I especially urge plugin authors to read this file carefully.\nLike last time, in this post I’ll cover a subset of the new features. As I said, it’s a big release, and I won’t write about everything, but these are some of the highlights. Table of Contents Defaults Builtin commenting Terminal UI enhancements LSP inlay hints Tree-sitter query editor Miscellaneous Roadmap Defaults Colorscheme\nNvim has been in need of a new default colorscheme for a long time. While the default colors have some charm and nostalgia, there are serious accessibility and aesthetic issues, particular when using Nvim is a diff viewer. The screenshot below shows the default colorscheme before Nvim 0.10: Neovim's default colorscheme before 0.10\nNvim 0.10 now ships with a new default colorscheme, which you can see below: Neovim's new default colorscheme\nThe new default colorscheme was heroically contributed by Evgeni Chasnovski, who endured seemingly endless bikeshedding and successfully navigated the treacherous waters of such a subjective change. There were many constraints imposed on the design of the colorscheme, which you can read in the PR (and the many follow up PRs and issues linked therein). It is quite literally impossible to please everyone with a single colorscheme, and there is no expectation that we have achieved that, but the new colorscheme does, hopefully, improve the default experience for many people. LSP and Diagnostics Mappings\nNvim 0.10 adds a new default mapping: K in Normal mode maps to vim.lsp.buf.hover() whenever a buffer attaches to an LSP client, unless 'keywordprg' is already set to a non-default value. Use this to view information about the function or variable under the cursor. This in addition to the existing defaults mentioned in :h lsp-defaults which were added in the previous release.\nIn addition, there are new default mappings for navigating diagnostics: [d and ]d in Normal mode map to vim.diagnostic.goto_prev() and vim.diagnostic.goto_next(), respectively. Use these to navigate between diagnostics in the current buffer. <C-W>d (and <C-W><C-D>) in Normal mode map to vim.diagnostic.open_float(). Use this to view information about any diagnostics under the cursor in a floating window.\nThe diagnostics mappings override builtin mappings. These builtin mappings are not often used, but if you do use them you can delete the new default mappings with vim.keymap.del() or :unmap.\nThe intention behind providing more default mappings is to make it easier to get started with LSP in Neovim. The hope is that most users should be able to get up and running with useful LSP features with little to no configuration and without needing to write a bunch of Lua code. We have plans to add more defaults in future releases, though as you might imagine this is a fraught exercise. It is quite difficult to change default behavior in a tool as extensible and customizable as Nvim without breaking users' workflows.\nTwo features which many users rely on for their LSP experience are snippets support and autocompletion. Both of these features are on the roadmap to be included in Nvim core (see #27339, #25696, and #25670) which will, hopefully, make the experience of using LSP in Neovim even smoother in the future. Builtin Commenting\nLongtime Vim users are likely familiar with the venerable vim-commentary plugin, which creates mappings and operators for commenting and uncommenting text. Thanks to Evgeni Chasnovski, Nvim 0.10 now bundles this functionality by default, using a from-scratch implementation in Lua. Unlike vim-commentary, Nvim’s builtin implementation provides a text object and supports Tree-sitter, which is useful when working in injected languages (example: if you comment text inside a <script> tag in an HTML buffer, it will correctly use the Javascript // comment string rather than HTML’s <!-- --> comment string).\nSee :h commenting for more details. Terminal UI enhancements\nNvim 0.10 adds support for many new terminal based capabilities. Synchronized Output\nMany modern terminal emulators support synchronized output which allows terminal applications (like Nvim) to “batch” all of their UI updates in the terminal emulator and display them all at once. This can reduce “flickering” and “tearing” when a terminal UI (TUI) is being drawn very rapidly. This can sometimes happen in Nvim when using plugins that perform rapid UI updates (e.g. spinners, LSP status windows, etc.). Nvim 0.10 introduces a new 'termsync' option (enabled by default) which enables this feature if it is supported by the terminal emulator. System clipboard synchronization\nNvim 0.10 can now use the OSC 52 escape sequence to write to (or read from) the system clipboard. OSC 52 is only used automatically when (1) it is able to determine that the terminal emulator supports it (via XTGETTCAP), (2) it is running in an SSH session, and (3) when the 'clipboard' option is unset. Note that some terminal emulators do not support reading from the system clipboard with OSC 52, or only allow it after prompting the user for confirmation. It is recommended to use the traditional “paste” key binding (e.g. Cmd+V on macOS or Ctrl+Shift+V on Linux) to paste into Nvim from the system clipboard and use \"+ to copy to the clipboard inside Nvim (see :h quoteplus). Hyperlinks\nNvim 0.10 introduces experimental support for hyperlinks using the OSC 8 sequence. By default, this is used in Markdown for links of the form [example](https://example.com). If your terminal emulator supports the OSC 8 escape sequence, then the text example in the Nvim buffer will contain a hyperlink that can be clicked and will open https://example.com in your web browser.\nThis means that users can view Markdown files with :set conceallevel=2 and get an experience much closer to the rendered output: Screenshot of the Neovim README opened in Nvim\nIn the screenshot above, the underlined words are clickable link text, just as you would find in a web browser. Automatic truecolor detection\nNvim 0.10 will now automatically determine if the terminal emulator supports 24 bit color (“truecolor”) and enable the 'termguicolors' option if it does. It does this through a combination of heuristics ($COLORTERM, terminfo) and terminal queries (DECRQSS, XTGETTCAP). This detection works even over SSH connections and when inside a terminal multiplexer such as tmux. LSP inlay hints\nNvim 0.10 now supports LSP inlay hints thanks to Chinmay Dalal. A picture here will do more than my words can: Screenshot of Nvim showing inlay hints\nThe dark colored texts which display type annotations for variable declarations are inlay hints. This text is not part of the actual source file in the buffer, but is “virtual” text inserted by Nvim and provided by the language server. These hints can be enabled or disabled dynamically using vim.lsp.inlay_hint.enable().\nMany other new LSP features were added in Nvim 0.10 as well. Refer to the “LSP” section in :h news for a full list. Tree-sitter query editor\nNvim 0.10 adds even more tools for working with Tree-sitter queries. If you didn’t know already, Nvim bundles an “inspector” which allows you to view the abstract syntax tree of any source file with the :InspectTree command (so long as a Tree-sitter parser for the file’s language is installed). Example: Screenshot of the :InspectTree command in Nvim\nThanks to Maria José Solano, Nvim 0.10 adds a powerful capability to the Tree-sitter inspector: a query editor. The query editor allows you to write queries and see the matches in a source buffer in real time. Being able to create and modify queries interactively makes writing new queries a breeze. Example: Screenshot of the :EditQuery command in Nvim\nIn the screenshot above, the query editor is open in the top-right window, the tree inspector is in the bottom-right window, and the source buffer is in the left window. Notice that the text that is matched by the query in the query editor is highlighted in the source buffer and that the text initializer (the capture group used in the query) is floating on the line next to the match. As the query is updated in the editor, the corresponding highlights in the source buffer change in real time.\nThe query editor can be opened by pressing o in the :InspectTree window, with the :EditQuery command, or by calling vim.treesitter.query.edit() directly.\nWith :InspectTree and :EditQuery, Neovim is one of the best tools (if not the best tool) for working with Tree-sitter, even if you don’t actually use Neovim. Miscellaneous\nAs I mentioned at the top of this post, there are a lot of new features in this release, and I am not going to cover all of them. Here I’ll list a few more that I personally think are worth mentioning:\nThe :terminal command now accepts modifiers, so you can use e.g. :botright terminal (or :bo te) to open a new terminal window in a split at the bottom of your screen. In addition, :terminal buffers that are started with no arguments (and thus open a shell) will close automatically when the shell exits without an error.\ngx in Normal mode calls vim.ui.open() on whatever is under the cursor, which shells out to your operating system’s “open” capability (e.g. open on macOS or xdg-open on Linux). For instance, pressing gx on a URL will open that URL in your browser.\nTree-sitter based syntax highlighting is enabled by default for Lua, Vimdoc (:help), and Tree-sitter queries (to revert to traditional regex based syntax highlighting, create a FileType autocommand or ftplugin with vim.treesitter.stop() for the respective filetype).\nQ and @ in Visual mode will execute the last recorded/executed macro for all visually selected lines.\nUsers using a terminal emulator that supports the Kitty keyboard protocol can create mappings using the “super” and “meta” modifiers with the <D- and <T- prefixes, respectively (e.g. <D-S> is Cmd+S on macOS). Roadmap\nThe Neovim project is loosely organized and structured. We follow a “fun driven development” paradigm: for the most part, contributors and maintainers work on things that are personally interesting to them. Because of this, it can be difficult to predict what will happen in future releases. If there is a feature you want to see implemented, the best way to do it is to take a crack at it yourself: many of the features mentioned in this very blog post were contributed by users that are not part of the “core” maintenance team!\nThere is active chatter about further improving the LSP and Tree-sitter experience (as mentioned above, builtin snippet and completion support are a work-in-progress). One of the biggest challenges with Tree-sitter is parser distribution: currently, parsers are shared object files which must be compiled on every user’s machine or distributed with a system package manager. We are already working on implementing the new Tree-sitter WASM capabilities which will enable distributing Tree-sitter parsers as portable WASM blobs. This solves the distribution problem and may enable Neovim to ship more Tree-sitter parsers out of the box.\nWe would also like to integrate some of the functionality from nvim-lspconfig so that, ideally, nvim-lspconfig is just a “bag of configs” without any smarts or core logic. How best to do this is still hotly debated, but it is something that is being discussed. Getting Involved\nThere is nothing quite as fun as hacking on your own tools. If you are a Neovim user, I encourage you to get involved, whether that is through contributing directly to the Neovim project or a plugin, or simply participating in community spaces such as the Neovim Matrix room. If you have pain points or frustrations when using Neovim, please let us know. Many of us on the core maintenance team have been using Vim/Nvim for so long that we’ve forgotten what it’s like to be a beginner and, speaking for myself at least, this can leave blind spots on how things can be improved.\nThanks for reading and for using Neovim! Hopefully the next update will come a little sooner. One Last Thing\nThe Neovim project now has a merch store! If you didn’t know that you needed a Neovim branded hoodie or mug, now you do. All proceeds raised from the store are used to fund project needs and sponsor full-time development work.",
      "lang" : "en-us"
    } ]
  },
  "lang" : "en-us"
}
