{
  "type" : [ "h-entry" ],
  "properties" : {
    "name" : [ "Filippo Valsorda :go: (@filippo@abyssdomain.expert)" ],
    "summary" : [ "Attached: 1 image\n\nHey all, I turned 30 this week! 🎈\n\nI feel a bit weird asking for a \"present\" but if my code, writing, or talks reached you over the years, I would love to receive a postcard from wherever you live 📮\n\nOpen source is deeply rewarding, but sometimes I miss a physical reminder of the people on the other side of the wire ✨\n\nAlso, if you mention in the card making a donation to a US 501(c)(3) that aligns with my values, I will match it!\n\nMailing addresses, both US and EU: https://filippo.io/#addresses" ],
    "featured" : [ "https://cdn.masto.host/abyssdomainexpert/media_attachments/files/113/090/223/920/873/152/original/56b10982413b7a3d.png" ],
    "url" : [ "https://abyssdomain.expert/@filippo/113090287011896923" ]
  }
}
