{
  "type" : [ "h-entry" ],
  "properties" : {
    "name" : [ "Simon Tatham (@simontatham@hachyderm.io)" ],
    "summary" : [ "The key words \"MUST\", \"MUST NOT\", \"SHOULD\", \"SHOULD NOT\", \"RECOMMENDED BUT REPULSIVE\", \"WRONG BUT WROMANTIC\", \"FREQUENTLY MISUNDERSTOOD\", \"NOBODY BOTHERS WITH THIS BIT\", \"SHOULDN'T REALLY BUT WE WON'T JUDGE\", \"REQUIRED IN ORDER TO WORK AROUND EVERYONE ELSE'S BUGS\", \"YOU DO YOU\", and \"OBVIOUSLY ABSURD BUT VERY COMMON FOR SOME REASON\" in this document are to be interpreted as described in RFC 2119." ],
    "url" : [ "https://hachyderm.io/@simontatham/113663188608251850" ]
  }
}
