{
  "type" : [ "h-entry" ],
  "properties" : {
    "name" : [ "JP (@byjp@hachyderm.io)" ],
    "summary" : [ "@www.jvt.me@www.jvt.me That’s such a good idea! Very nice" ],
    "url" : [ "https://hachyderm.io/@byjp/112259323458884666" ]
  }
}
