{
  "type" : [ "h-entry" ],
  "properties" : {
    "name" : [ "jade pixel (@renegadejade@hachyderm.io)" ],
    "summary" : [ "Billionaires aren’t “self-made men.”\n\nTrans men are self-made men." ],
    "url" : [ "https://hachyderm.io/@renegadejade/112028983820349670" ]
  }
}
