{
  "type" : [ "h-entry" ],
  "properties" : {
    "name" : [ "How I turned my open-source project into a business" ],
    "summary" : [ "When I started writing and publishing open-source software about 15 years ago, I was pretty radical about it. I only used permissive licenses like MIT or BSD, as all I cared about was reach. Using a copyleft license with strings attached seemed to hinder that reach. Getting another A-category company" ],
    "featured" : [ "https://docs.emailengine.app/content/images/2024/02/EmailEngine_logo_horiz.jpg" ],
    "url" : [ "https://docs.emailengine.app/how-i-turned-my-open-source-project-into/" ],
    "published" : [ "2024-02-27T11:33:25.000Z" ]
  }
}
