{
  "type" : [ "h-entry" ],
  "properties" : {
    "name" : [ "Jesse J. Anderson (@adhdjesse@mastodon.social)" ],
    "summary" : [ "The hidden burden of undiagnosed ADHD is constantly needing to invent excuses in an attempt to explain or justify behavior that you don’t even understand yourself." ],
    "url" : [ "https://mastodon.social/@adhdjesse/111732732104787656" ]
  }
}
