{
  "type" : [ "h-entry" ],
  "properties" : {
    "name" : [ "Tanya (@solderandchaos@mastodon.me.uk)" ],
    "summary" : [ "Watching the Dr Who proms and remembering that at one point I played the Royal Albert Hall. That was a helluva experience. Sometimes I forget I’ve done more in my 40-something years than the average human, yet I still struggle with the … you know, *human* stuff," ],
    "url" : [ "https://mastodon.me.uk/@solderandchaos/113709157383682592" ]
  }
}
