{
  "type" : [ "h-entry" ],
  "properties" : {
    "name" : [ "JP (@byjp@hachyderm.io)" ],
    "summary" : [ "I decided to build a \"clap\" feature into my #IndieWeb blog, so visitors can show appreciation anonymously and easily, if they want!\n\nI wrote a little about it here https://www.byjp.me/posts/easy-appreciation/; it uses https://val.town (I wish they had a Fediverse account, so I could tag them) and progressive enhancement to be useful and easy even for folks without Javascript browsers ☺️" ],
    "url" : [ "https://hachyderm.io/@byjp/112229385641236069" ]
  }
}
