{
  "type" : [ "h-entry" ],
  "properties" : {
    "name" : [ "Decipher Podcast: Dan Lorenc Returns" ],
    "summary" : [ "Dan Lorenc, co-founder and CEO of Chainguard, joins Dennis Fisher to dig into the recent XZ Utils backdoor incident, the implications for the open source ecosystem, and what can be done to avoid similar incidents in the future. Then they discuss the problems facing NIST’s National Vulnerability Database and the CVE ecosystem." ],
    "featured" : [ "https://duo.com/assets/img/seo-images/danlorenc-decipher.jpg" ],
    "url" : [ "https://duo.com/decipher/decipher-podcast-dan-lorenc-returns" ]
  }
}
