{
  "type" : [ "h-entry" ],
  "properties" : {
    "name" : [ "Heather Buchel (@hbuchel@hachyderm.io)" ],
    "summary" : [ "Also, if you're like me, and were raised to scoff at people who needed to hire cleaning services as it is a \"rich lazy\" person thing, I urge you to absolutely let go of that. The last two years I've been incredibly burnt out both from work and from, idk, probably 39 years of undiagnosed autism. If you can pay for an accommodation like this to help give yourself some space to breathe, do it." ],
    "url" : [ "https://hachyderm.io/@hbuchel/113080200056496244" ]
  }
}
