{
  "type" : [ "h-entry" ],
  "properties" : {
    "name" : [ "neatchee (@neatchee@urusai.social)" ],
    "summary" : [ "Attached: 1 image" ],
    "featured" : [ "https://files.urusai.social/media_attachments/files/112/304/296/863/083/286/original/7ca78cd09e73566b.jpeg" ],
    "url" : [ "https://urusai.social/@neatchee/112304307077352689" ]
  }
}
