{
  "type" : [ "h-entry" ],
  "properties" : {
    "name" : [ "Jyoti Mishra (@Jyoti@mas.to)" ],
    "summary" : [ "Attached: 1 image\n\n#FreePalestine \n#StopTheGenocide" ],
    "featured" : [ "https://media.mas.to/media_attachments/files/112/362/617/086/902/423/original/841543503300f61c.jpg" ],
    "url" : [ "https://mas.to/@Jyoti/112362619866185259" ]
  }
}
