{
  "type" : [ "h-entry" ],
  "properties" : {
    "name" : [ "antirez (Salvatore Sanfilippo) on Technical Blogging" ],
    "summary" : [ "Redis' creator on why blogging is fundamental for successful projects, his writing process, and AI in writing" ],
    "featured" : [ "https://substackcdn.com/image/fetch/w_1200,h_600,c_fill,f_jpg,q_auto:good,fl_progressive:steep,g_auto/https%3A%2F%2Fsubstack-post-media.s3.amazonaws.com%2Fpublic%2Fimages%2F2ddc2196-0186-4b3e-ade6-c026476695ef_1456x1048.png" ],
    "author" : [ {
      "type" : [ "h-card" ],
      "properties" : {
        "name" : [ "Cynthia Dunlop" ]
      }
    } ],
    "url" : [ "https://writethatblog.substack.com/p/antirez-on-technical-blogging" ]
  }
}
