{
  "type" : [ "h-entry" ],
  "properties" : {
    "name" : [ "Ep 4: Nish Kumar (Christmas Special) | Off Menu with Ed Gamble and James Acaster on Acast" ],
    "summary" : [ "It's Boxing Day, we're feeling festive, and everyone's best friend Nish Kumar has popped in to order his favourite Christmas meal. Plus we need your help to #BringBackKumarsCobbler Recorded and edited by Ben Williams for Plosive Productions. Artwork by Paul Gilbey (photography) and Amy Browne (illustrations). Nish Kumar is on tour in 2019 starting 25 January. See his website for full details. Ed Gamble is on tour in 2019. See his website for full details. James Acaster is on tour in 2019. See his website for full details. Watch Ed and James's YouTube series 'Just Puddings'. Watch here. Don't forget to tweet @JacksonRye (politely) requesting the Peach Cobbler back on the menu – copy us in @OffMenuOfficial and use the hashtag #BringBackKumarsCobbler. Hosted on Acast. See acast.com/privacy for more information." ],
    "featured" : [ "https://assets.pippa.io/shows/61ba04aa1a8cbee88a3cf0d8/61ba04b820c1ca001361de58.jpg" ],
    "audio" : [ "https://sphinx.acast.com/offmenu/ep4-nishkumar-christmasspecial-r/media.mp3" ],
    "url" : [ "https://play.acast.com/s/offmenu/ep4-nishkumar-christmasspecial-" ]
  }
}
