{
  "type" : [ "h-entry" ],
  "properties" : {
    "name" : [ "Tofu Golem (@tofugolem@mastodon.social)" ],
    "summary" : [ "Attached: 1 image\n\nIf you're familiar with this image, that comment is a real gut punch. If you're not familiar with it, check the alt text." ],
    "featured" : [ "https://files.mastodon.social/media_attachments/files/113/886/997/592/762/190/original/8deedd96e8462faf.jpeg" ],
    "url" : [ "https://mastodon.social/@tofugolem/113887009957608930" ]
  }
}
