{
  "type" : [ "h-entry" ],
  "properties" : {
    "name" : [ "GitHub - rohitdhas/shittier: Shittier is an unconventional code formatting tool" ],
    "summary" : [ "Shittier is an unconventional code formatting tool - rohitdhas/shittier" ],
    "featured" : [ "https://opengraph.githubassets.com/c9bfe5794e506be974a517db3610d15cc28724b120faf8f81530c27781dc2f6a/rohitdhas/shittier" ],
    "url" : [ "https://github.com/rohitdhas/shittier" ]
  }
}
