{
  "type" : [ "h-entry" ],
  "properties" : {
    "name" : [ "Dana Fried (@tess@mastodon.social)" ],
    "summary" : [ "Fuck everyone who uses \"unalive\" with zero sense of irony. Fucking socmed algorithm brain poisoning.\n\nSay \"kill\". Say \"murder\". Say \"suicide\". Say \"rape\". Say \"pedophile\". Say what you mean. If people need to not see or hear those words they'll use a filter.\n\n(Or if you're on a platform where you feel like you're forced to elide a word, make it obvious you know you're being censored and don't use stupid euphemisms like it's a totally normal thing to do.)" ],
    "url" : [ "https://mastodon.social/@tess/112980139344500091" ]
  }
}
