{
  "type" : [ "h-entry" ],
  "properties" : {
    "name" : [ "Screaming in the Cloud | Mastering Tech Transitions with Ceora Ford" ],
    "summary" : [ "Join us for a fascinating talk with Ceora Ford, a Developer Advocate at Okta, as she explores the changing world of tech. Ceora shares her unique journey through different tech roles and talks about the importance of keeping technical skills sharp, even when focusing on advocacy. She also gives..." ],
    "featured" : [ "https://images.transistor.fm/images/episode/1708420/medium_1706561064-artwork.jpg" ],
    "audio" : [ "https://dts.podtrac.com/redirect.mp3/media.transistor.fm/de9599ef/d0cc7074.mp3" ],
    "url" : [ "https://share.transistor.fm/s/de9599ef" ]
  }
}
