{
  "type" : [ "h-entry" ],
  "properties" : {
    "name" : [ "kf (@kf@666.glitchwit.ch)" ],
    "summary" : [ "Attached: 1 image\n\n🥹" ],
    "featured" : [ "https://cdn.masto.host/num666glitchwitch/media_attachments/files/111/915/451/696/377/178/original/fe5a8ee301f20bec.jpeg" ],
    "url" : [ "https://666.glitchwit.ch/@kf/111915451975127129" ]
  }
}
