{
  "type" : [ "h-entry" ],
  "properties" : {
    "name" : [ "lifewithtrees (@lifewithtrees@mstdn.social)" ],
    "summary" : [ "I have been asked before how I could be nonbinary since I have a big beard. \n\nSo here is how, explained in 3 easy steps!\n\n1) Be nonbinary\n\n2) Dislike shaving\n\n3) Prefer how I Iook with a beard. \n\nThank you for coming to my TED talk. \n\n#NonBinary #enby #lgbtq" ],
    "url" : [ "https://mstdn.social/@lifewithtrees/113771096333770594" ]
  }
}
