{
  "type" : [ "h-entry" ],
  "properties" : {
    "name" : [ "Patricia Aas (@Patricia@vivaldi.net)" ],
    "summary" : [ "From now on I will block anyone crying about being cancelled for speech. Trump wants to shoot protestors, ban books, jail journalists, jail librarians, jail school teachers and defund media outlets that won’t play his game. That is what free speech was about, not that your gay neighbor has to put up with your bullshit or people not buying your books anymore." ],
    "url" : [ "https://social.vivaldi.net/@Patricia/113448539477616949" ]
  }
}
