{
  "type" : [ "h-full" ],
  "properties" : {
    "name" : [ "Visit Paragraph" ],
    "url" : [ "https://paragraph.ph/?utm_source=laravelnews&utm_medium=partner&utm_campaign=laravelnews" ]
  },
  "lang" : "en"
}
