{
  "type" : [ "h-entry" ],
  "properties" : {
    "name" : [ "Danilo Campos 🇵🇷 (@danilo@hachyderm.io)" ],
    "summary" : [ "Part of why tech workers at huge orgs like this need a union:\n\nBeing compelled to relocate to a forced birthing state is violent as hell\n\nSo much more to collective power than just getting paid\n\nhttps://www.theverge.com/2024/1/14/24037904/apple-san-diego-siri-ai-team-relocating" ],
    "url" : [ "https://hachyderm.io/@danilo/111755811232812074" ]
  }
}
