{
  "type" : [ "h-entry" ],
  "properties" : {
    "name" : [ "Nick Jones (@nick@sausage.social)" ],
    "summary" : [ "Attached: 1 image\n\nGreat to see Ghostty (ghostty.org) hit 1.0 and finally be public.  I've been on the beta since October 2023 and it's been a privilege to watch it evolve.  And in a stroke of terminal serendipity, Berkeley Mono V2 was released today too - the Semi Condensed version is :chefs-kiss:" ],
    "featured" : [ "https://sausage.social/system/media_attachments/files/113/721/095/413/117/789/original/0a597c868fe49251.png" ],
    "url" : [ "https://sausage.social/@nick/113721095637243122" ]
  }
}
