{
  "type" : [ "h-entry" ],
  "properties" : {
    "name" : [ "Brian Winkeler (@brianwinkeler.bsky.social)" ],
    "summary" : [ "LinkedIn can be way more entertaining than you’d think." ],
    "featured" : [ "https://cdn.bsky.app/img/feed_thumbnail/plain/did:plc:23bb5ltye4g5mx2uwm2423zn/bafkreid34lduzsiv5t3t7ateddcgpitasj7htanmilkwgkvxclq6sgwshe@jpeg" ],
    "url" : [ "https://bsky.app/profile/brianwinkeler.bsky.social/post/3kidinoulbs2w" ],
    "published" : [ "2024-01-06T19:05:52.420Z" ]
  }
}
