{
  "type" : [ "h-entry" ],
  "properties" : {
    "name" : [ "artemist (@artemist@mildlyfunctional.gay)" ],
    "summary" : [ "Content warning: what, lewd" ],
    "url" : [ "https://social.mildlyfunctional.gay/@artemist/111790005289959464" ]
  }
}
