{
  "type" : [ "h-entry" ],
  "properties" : {
    "name" : [ "Wrapping up 2024 - Andy Bell" ],
    "summary" : [ "I’ve just read last year’s wrap up and it made me quite sad. I really was in a rough spot, mentally. What makes me the most sad though is I couldn’t honestly tell you I’m in a much better place. Things are on the up though. I don&#8217;t really have a will to sit here [&hellip;]" ],
    "url" : [ "https://andy-bell.co.uk/wrapping-up-2024/" ]
  }
}
