{
  "type" : [ "h-entry" ],
  "properties" : {
    "name" : [ "The Story Graph - CoRecursive Podcast" ],
    "summary" : [ "Whenever I work on a side project, I can't help but daydream of it taking off in a big way. For today's guests, something like that did happen. When Nadia started building her side project, she didn't know that it would end up spreading virally. She didn't know that it would end up competing with an Amazon product. She didn't... […]" ],
    "featured" : [ "https://corecursive.com/assets/images/074/wide.png" ],
    "audio" : [ "https://chtbl.com/track/7D91G/traffic.libsyn.com/corecursive/074-Story-Graph2.mp3" ],
    "author" : [ {
      "type" : [ "h-card" ],
      "properties" : {
        "name" : [ "Adam Gordon Bell" ]
      }
    } ],
    "url" : [ "https://corecursive.com/the-story-graph-with-nadia-odunayo/" ]
  }
}
