{
  "type" : [ "h-entry" ],
  "properties" : {
    "name" : [ "Rob Ricci :real: (@ricci@discuss.systems)" ],
    "summary" : [ "Hey, with people in the news getting sentenced to prison, facing the possibility of prison time, etc., just a reminder: it is not desirable, nor funny, that violence in prison (including sexual violence), be a part of someone's punishment. Even people you really, really do not like who have done really super bad things. It is to the United State's shame that violence in prison is part of our carceral system, and we should not celebrate it, ever. We should seek to eliminate it." ],
    "url" : [ "https://discuss.systems/@ricci/112174382514043747" ]
  }
}
