{
  "type" : [ "h-entry" ],
  "properties" : {
    "name" : [ "Anders Eknert (@anderseknert@hachyderm.io)" ],
    "summary" : [ "I’ve helped organize two meetups in London. Only a few would show up for the first one. “Because it’s raining, people rather not go outside”, the other organizers told me. So the next one I hosted was in the summer. Only a few would show up for that one. “Because it’s not raining, people rather be outside” the other organizers told me." ],
    "url" : [ "https://hachyderm.io/@anderseknert/111844050445278604" ]
  }
}
