{
  "type" : [ "h-entry" ],
  "properties" : {
    "name" : [ "@nietszeggende.bsky.social" ],
    "summary" : [ "Why order potatoes from AliExpress?" ],
    "url" : [ "https://bsky.app/profile/nietszeggende.bsky.social/post/3livwqrfqns2j" ],
    "published" : [ "2025-02-24T08:32:15.951Z" ]
  }
}
