{
  "type" : [ "h-entry" ],
  "properties" : {
    "name" : [ "da_667 (@da_667@infosec.exchange)" ],
    "summary" : [ "Attached: 1 image" ],
    "featured" : [ "https://media.infosec.exchange/infosec.exchange/media_attachments/files/113/490/802/919/643/153/original/957c7a3a483b4fc4.jpg" ],
    "url" : [ "https://infosec.exchange/@da_667/113490803236521864" ]
  }
}
