{
  "type" : [ "h-card" ],
  "properties" : {
    "name" : [ "April The Pink ⋆☾╶⃝⃤☽⋆" ],
    "photo" : [ {
      "value" : "https://asdf.donotsta.re/media/350e7e3fec9118c3c4cff5fbc3f91ffc6f8f9f3446ef1855ae0a8d831fc9471f.jpg",
      "alt" : ""
    } ],
    "url" : [ "https://donotsta.re/users/april" ]
  },
  "lang" : "en-GB"
}
