{
  "type" : [ "h-entry" ],
  "properties" : {
    "name" : [ "lornajane (@lornajane@indieweb.social)" ],
    "summary" : [ "I took a few days off, left the house (this part was a mistake), caught an illness and now I'm back at work feeling rubbish and just not very clever!! Please nobody ask me any hard questions ..." ],
    "url" : [ "https://indieweb.social/@lornajane/113232037402705403" ]
  }
}
