{
  "type" : [ "h-entry" ],
  "properties" : {
    "name" : [ "Statically compiling Go programs" ],
    "author" : [ {
      "type" : [ "h-card" ],
      "properties" : {
        "name" : [ "Martin Tournoij" ]
      }
    } ],
    "url" : [ "https://www.arp242.net/static-go.html" ]
  }
}
