{
  "type" : [ "h-card" ],
  "properties" : {
    "name" : [ "PJ Evans" ],
    "photo" : [ {
      "value" : "https://files.mastodon.social/accounts/avatars/109/245/191/741/397/935/original/b37f649798bb8caa.jpg",
      "alt" : ""
    } ],
    "url" : [ "https://mastodon.social/@mrpjevans/112570657416482539" ]
  },
  "lang" : "en-GB"
}
