{
  "type" : [ "h-entry" ],
  "properties" : {
    "name" : [ "Kevin J. (@khovin.bsky.social)" ],
    "summary" : [ "So many billionaires so few guillotines" ],
    "url" : [ "https://bsky.app/profile/khovin.bsky.social/post/3lhw3a7575s2b" ],
    "published" : [ "2025-02-11T16:27:17.150Z" ]
  }
}
