{
  "type" : [ "h-entry" ],
  "properties" : {
    "name" : [ "Fallthrough | Tools We Love" ],
    "summary" : [ "We all have tools that make our lives better. Software tools, hardware tools, and everything in between. In this episode, Matt is joined by Kris, Ian, and Dylan to discuss some of their favorite to..." ],
    "featured" : [ "https://img.transistor.fm/J_qDxJTQ0rvZR-cIBHFI9UvidA7r4Yu5ANhH4nGqeGs/rs:fill:800:800:1/q:60/aHR0cHM6Ly9pbWct/dXBsb2FkLXByb2R1/Y3Rpb24udHJhbnNp/c3Rvci5mbS83NjNi/MDJlMmE4NGI2MWJh/MTZhMjE4M2UxNGI5/NDBkYy5wbmc.webp" ],
    "url" : [ "https://share.transistor.fm/s/6bedb9f5" ]
  }
}
