{
  "type" : [ "h-entry" ],
  "properties" : {
    "name" : [ "We ain't afraid of no Ghostty! with Mitchell Hashimoto (Changelog Interviews #622)" ],
    "summary" : [ "Mitchell Hashimoto joins the show to discuss Ghostty, the newest terminal in town. Mitchell co-founded HashiCorp, took it all the way to IPO, exited in 2023—and now he's working on a terminal emulator called Ghostty. Ghostty is set to 1.0 this month, so we sat down to talk through all the details." ],
    "featured" : [ "https://snap.fly.dev/podcast/622/img" ],
    "audio" : [ "https://op3.dev/e/https://cdn.changelog.com/uploads/podcast/622/the-changelog-622.mp3" ],
    "url" : [ "https://changelog.com/podcast/622" ]
  }
}
