{
  "type" : [ "h-entry" ],
  "properties" : {
    "name" : [ "Anthony, of course (@anthony@bitbang.social)" ],
    "summary" : [ "It's \"Anonymous Employee Engagement Survey with Unique to you URL\" time again!" ],
    "featured" : [ "https://files.bitbang.social/accounts/avatars/000/039/635/original/56a88717e90a01de.png" ],
    "url" : [ "https://bitbang.social/@anthony/112449899444368095" ]
  }
}
