{
  "type" : [ "h-entry" ],
  "properties" : {
    "name" : [ "Aral Balkan (@aral@mastodon.ar.al)" ],
    "summary" : [ "Went to a tech meetup in Dublin yesterday and no one I spoke to had heard of the fediverse (or Mastodon, even). I’m talking about software engineers. This blows my mind.\n\n(At least everyone I spoke with has heard of it now, though. And when people do hear about it – as with the #SmallWeb – they do get it. And they’re excited about it.)\n\n#fediverse #mastodon #SmallWeb" ],
    "url" : [ "https://mastodon.ar.al/@aral/111794286314504878" ]
  }
}
