{
  "type" : [ "h-entry" ],
  "properties" : {
    "name" : [ "luna @ emfcamp (@luna@pony.social)" ],
    "summary" : [ "So #emfcamp had a pop-up #MathsJam evening, and of course I brought another lightning talk — enjoy!\n\nhttps://youtube.com/watch?v=GfCRA6zmRFo" ],
    "url" : [ "https://pony.social/@luna/112541323735327177" ]
  }
}
