{
  "type" : [ "h-entry" ],
  "properties" : {
    "name" : [ "Building static binaries with Go on Linux - Eli Bendersky's website" ],
    "featured" : [ "https://eli.thegreenplace.net/images/logosmall.png" ],
    "url" : [ "https://eli.thegreenplace.net/2024/building-static-binaries-with-go-on-linux/" ]
  }
}
