{
  "type" : [ "h-entry" ],
  "properties" : {
    "name" : [ "More BMC goodness featuring Breakmaster Cylinder (Changelog &amp; Friends #39)" ],
    "summary" : [ "Our beat freak in residence returns, this time to discuss the shiny new Dance Party album! We deconstruct its nostalgic mix, break down some of our favorite tracks &amp;amp; even learn that BMC is writing a mysterious book… " ],
    "featured" : [ "https://cdn.changelog.com/static/images/share/twitter-friends-7fa3c9c5a72765c322b47e92da397fbb.png" ],
    "audio" : [ "https://op3.dev/e/https://cdn.changelog.com/uploads/friends/39/changelog--friends-39.mp3" ],
    "url" : [ "https://changelog.com/friends/39" ]
  }
}
