{
  "type" : [ "h-entry" ],
  "properties" : {
    "name" : [ "fluffy 💜 (@fluffy@plush.city)" ],
    "summary" : [ "anyway the comment I was going to make to @www.jvt.me@www.jvt.me is that I still have yet to ever try a McRib and at this point why should I change that?" ],
    "url" : [ "https://plush.city/@fluffy/113171074410627963" ]
  }
}
