{
  "type" : [ "h-entry" ],
  "properties" : {
    "name" : [ "Read the book Abolish Rent (@jphillll.bsky.social)" ],
    "summary" : [ "Today I learned the cybertruck is illegal in europe.\n\n[contains quote post or other embedded content]" ],
    "url" : [ "https://bsky.app/profile/jphillll.bsky.social/post/3lfwxwxsc4c22" ],
    "published" : [ "2025-01-17T14:10:42.851Z" ]
  }
}
