{
  "type" : [ "h-card" ],
  "properties" : {
    "name" : [ "Steph Gray" ],
    "photo" : [ {
      "value" : "https://cdn.bsky.app/img/avatar/plain/did:plc:dqctwex2lsjzmlkh4cr6j3ou/bafkreielps47u5ijob54qf4xh6vrb7efacfru6fr77vnptebnjdyssi3ee@jpeg",
      "alt" : ""
    } ],
    "url" : [ "https://bsky.app/profile/lesteph.com/post/3ldlfuh65422i" ]
  },
  "lang" : "en-GB"
}
