{
  "type" : [ "h-entry" ],
  "properties" : {
    "name" : [ "lornajane (@lornajane@indieweb.social)" ],
    "summary" : [ "I added some validation and link checking to this docs folder about a week ago. It's already pointed out something broken on three different pull requests. #DocOps turns out is a good investment, even though I was sure I knew what I was doing and these tools would help \"other people\" 😆" ],
    "url" : [ "https://indieweb.social/@lornajane/111981601293430485" ]
  }
}
