{
  "type" : [ "h-card" ],
  "properties" : {
    "name" : [ "Timo Tijhof" ],
    "photo" : [ {
      "value" : "https://v1.image.11ty.dev/https%3A%2F%2Fwebmention.io%2Favatar%2Fcdn.masto.host%2Fc070ecc02a223955fa3835dc8508640b0a1a88223c2d963d599356c9f65c0916.jpg/jpeg/72/",
      "alt" : "Timo Tijhof"
    } ],
    "url" : [ "https://fediverse.zachleat.com/@zachleat/112917087819399708#favorited-by-109292532015873530" ]
  },
  "lang" : "en"
}
