{
  "type" : [ "h-entry" ],
  "properties" : {
    "name" : [ "james (@james@strangeobject.space)" ],
    "summary" : [ "At the very least my intention once ive finished fucking about, is to start working on my blog. So I can write about it there instead in the future. And I have no intention of building comment capabilities 😈" ],
    "url" : [ "https://strangeobject.space/@james/112067093789300111" ]
  }
}
