{
  "type" : [ "h-entry" ],
  "properties" : {
    "name" : [ "Bryan Cantrill (@bcantrill.bsky.social)" ],
    "summary" : [ "This video of mine from five years ago is aging depressingly well --- and it leaves me at once bitterly disappointed and steadfastly resolved\nhttps://www.youtube.com/watch?v=px9OjW7GB0Q" ],
    "url" : [ "https://bsky.app/profile/bcantrill.bsky.social/post/3lhh7nkrbys26" ],
    "published" : [ "2025-02-05T18:36:26.948Z" ]
  }
}
