{
  "type" : [ "h-entry" ],
  "properties" : {
    "name" : [ "luna, only carbon now (@luna@pony.social)" ],
    "summary" : [ "god forbid a woman have kinks" ],
    "url" : [ "https://pony.social/@luna/113460717686861999" ]
  }
}
