{
  "type" : [ "h-entry" ],
  "properties" : {
    "name" : [ "Moosical (@Moosical@mastodon.me.uk)" ],
    "summary" : [ "@www.jvt.me@www.jvt.me that's a very interesting salary page. I used to work around Capital one as a senior associate but I predated you by a few years. Good idea to track it like that. 👍" ],
    "url" : [ "https://mastodon.me.uk/@Moosical/113301716939870304" ]
  }
}
