{
  "type" : [ "h-entry" ],
  "properties" : {
    "name" : [ "katve (@katve@tech.lgbt)" ],
    "summary" : [ "girl who's nonbinary for ideological reasons" ],
    "url" : [ "https://tech.lgbt/@katve/112820308298703881" ]
  }
}
