{
  "type" : [ "h-entry" ],
  "properties" : {
    "name" : [ "Chris Hardie (@ChrisHardie@mastodon.social)" ],
    "summary" : [ "People say content is being locked up in proprietary silos but look all I had to do to get an RSS feed of articles on a certain site was install a mitm proxy to intercept their mobile app's requests, fake an SSL certificate to inspect them, reverse engineer their internal APIs, then write a script to discretely query aforementioned APIs and generate an RSS feed file on a schedule. Simple! 🙄 #indieweb #rss" ],
    "url" : [ "https://mastodon.social/@ChrisHardie/111842767174823116" ]
  }
}
