{
  "type" : [ "h-entry" ],
  "properties" : {
    "name" : [ "Andy Piper (@andypiper@macaw.social)" ],
    "summary" : [ "Well, I thought #OggCamp2024 was great. Thanks in particular to the team and crew for making it happen, and thanks to the community for keeping the spirit of #OggCamp alive, and sharing it again this weekend. \n\nMy blog is a good way to keep up with what I’m up to, and has links to other places you can find me online between now and OggCamp.Next. \n\nhttps://andypiper.co.uk" ],
    "url" : [ "https://macaw.social/@andypiper/113301443525831822" ]
  }
}
