{
  "type" : [ "h-entry" ],
  "properties" : {
    "name" : [ "Andy Piper (@andypiper@macaw.social)" ],
    "summary" : [ "The @oggcamp@mastodon.social CFP is open! #oggcamp https://oggcamp.org/news/cfp/" ],
    "url" : [ "https://macaw.social/@andypiper/112614415092577752" ]
  }
}
