{
  "type" : [ "h-card" ],
  "properties" : {
    "name" : [ "Dawn Blackbird" ],
    "photo" : [ {
      "value" : "https://files.mastodon.social/cache/accounts/avatars/109/886/598/923/717/989/original/3967d5ccf501f474.jpeg",
      "alt" : ""
    } ],
    "url" : [ "https://mastodonapp.uk/@DawnBlackbirds/113675432603571035" ]
  },
  "lang" : "en-GB"
}
