{
  "type" : [ "h-entry" ],
  "properties" : {
    "name" : [ "Caerfinon🅰️🆗🍁 (@caerfinon.bsky.social)" ],
    "summary" : [ "There are widespread reports of a server issue currently going on. \n\ndownforeveryoneorjustme.com/ea-servers" ],
    "url" : [ "https://bsky.app/profile/caerfinon.bsky.social/post/3lgtbodtb2w2b" ],
    "published" : [ "2025-01-28T20:19:23.148Z" ]
  }
}
