{
  "type" : [ "h-entry" ],
  "properties" : {
    "name" : [ "#103 Carolyn Stransky’s DevJourney Podcast Interview" ],
    "summary" : [ "#103 Carolyn Stransky learning her way from journalist to developer and back" ],
    "featured" : [ "/Img/logo_small.png" ],
    "author" : [ {
      "type" : [ "h-card" ],
      "properties" : {
        "name" : [ "Tim Bourguignon" ]
      }
    } ],
    "url" : [ "https://devjourney.info/Guests/103-CarolynStransky.html" ]
  }
}
