{
  "type" : [ "h-entry" ],
  "properties" : {
    "name" : [ "The Mechanics of CHAOSS: A Deep Dive into Open Source Community Health Analytics" ],
    "summary" : [ "In this collaboration between the CHAOSS Cast and Mechanical Ink podcasts, hosts Dawn Foster and Schalk Neethling are joined by guests Daniel Izquierdo and Sean Goggins to discuss open source community health metrics. \n\nThe focus is on providing an overview of two projects under the CHAOSS (Community Health Analytics for Open Source Software) umbrella - GrimoireLab and Augur. These open source tools gather data from diverse sources and analyze it to provide insights into open-source community health." ],
    "featured" : [ "https://assets.fireside.fm/file/fireside-images/podcasts/images/f/f5b24404-14da-4b82-8a25-6de95d2b991b/episodes/9/96a0ec9d-694c-49fc-a57a-6ee92aeacceb/cover_medium.jpg?v=1" ],
    "audio" : [ "https://aphid.fireside.fm/d/1437767933/f5b24404-14da-4b82-8a25-6de95d2b991b/96a0ec9d-694c-49fc-a57a-6ee92aeacceb.mp3" ],
    "author" : [ {
      "type" : [ "h-card" ],
      "properties" : {
        "name" : [ "CHAOSS Project" ]
      }
    } ],
    "url" : [ "https://podcast.chaoss.community/79" ]
  }
}
