{
  "type" : [ "h-entry" ],
  "properties" : {
    "name" : [ "Terence Eden (@Edent@mastodon.social)" ],
    "summary" : [ "Now is an excellent time to visit https://github.com/settings/applications \n\nRevoke all those unused and unloved applications which have access to your GitHub account." ],
    "url" : [ "https://mastodon.social/@Edent/112648333780699485" ]
  }
}
