{
  "type" : [ "h-entry" ],
  "properties" : {
    "name" : [ "Issy Long (@issy@strangeobject.space)" ],
    "summary" : [ "@Edent@mastodon.social Ah. Blame @www.jvt.me@www.jvt.me who sent it through and I didn’t check the date!" ],
    "url" : [ "https://strangeobject.space/@issy/112265960076578637" ]
  }
}
