{
  "type" : [ "h-entry" ],
  "properties" : {
    "name" : [ "Building a forever home for open source projects" ],
    "summary" : [ "The Commonhaus Foundation is dedicated to nurturing and sustaining self-governing open source projects through community-driven collaboration and shared s…" ],
    "featured" : [ "https://www.commonhaus.org/images/CF_github_socialmediapreview_image3.png" ],
    "author" : [ {
      "type" : [ "h-card" ],
      "properties" : {
        "name" : [ "Commonhaus Foundation" ]
      }
    } ],
    "url" : [ "https://www.commonhaus.org/index.html" ]
  }
}
