{
  "type" : [ "h-entry" ],
  "properties" : {
    "name" : [ "Matt Brunt (@brunty@brunty.social)" ],
    "summary" : [ "Attached: 1 image" ],
    "featured" : [ "https://files.brunty.social/media_attachments/files/112/581/107/642/701/709/original/1f2f9468af2c4fe3.jpeg" ],
    "url" : [ "https://brunty.social/@brunty/112581107781779412" ]
  }
}
