{
  "type" : [ "h-entry" ],
  "properties" : {
    "name" : [ "Cloud-centric security logging with Steven Wu from Scanner (Ship It! #117)" ],
    "summary" : [ "Justin & Autumn are joined by Steven Wu from Scanner. Scanner built logging infrastructure focused on security teams and occasional querying. We dive deep into how architectural decisions affect your business." ],
    "featured" : [ "https://snap.fly.dev/shipit/117/img" ],
    "audio" : [ "https://op3.dev/e/https://cdn.changelog.com/uploads/shipit/117/ship-it-117.mp3" ],
    "url" : [ "https://changelog.com/shipit/117" ]
  }
}
