{
  "type" : [ "h-entry" ],
  "properties" : {
    "name" : [ "New Year&#39;s Party 🎊 (JS Party #306)" ],
    "summary" : [ "It’s our 5th annual New Year’s party! Jerod &amp;amp; the gang review our predictions from last year, discuss what’s trending in the web world, make a few predictions for 2024 &amp;amp; even set some new resolutions for this year. " ],
    "featured" : [ "https://cdn.changelog.com/static/images/share/twitter-jsparty-da8b18a62e1b0a5cf593f5ec9ef3b021.png" ],
    "audio" : [ "https://op3.dev/e/https://cdn.changelog.com/uploads/jsparty/306/js-party-306.mp3" ],
    "url" : [ "https://changelog.com/jsparty/306" ]
  }
}
