{
  "type" : [ "h-entry" ],
  "properties" : {
    "name" : [ "Discover thousands of collaborative articles on 2500+ skills" ],
    "summary" : [ "Discover 100 collaborative articles on domains such as Marketing, Public Administration, and Healthcare. Our expertly curated collection combines AI-generated content with insights and advice from industry experts, providing you with unique perspectives and up-to-date information on many skills and their applications." ],
    "featured" : [ "https://static.licdn.com/aero-v1/sc/h/en3f1pk3qk4cxtj2j4fff0gtr" ],
    "url" : [ "https://www.linkedin.com/pulse/topics/home/" ]
  }
}
