{
  "type" : [ "h-entry" ],
  "properties" : {
    "name" : [ "Amy Hupe (@Amy_Hupe@social.design.systems)" ],
    "summary" : [ "Today’s joke I couldn’t make on Twitter:\n\nJavaScript is kind of like cocaine.\n\nThe more lines you do, the more confident and simultaneously insufferable you become, and the worse your performance issues will be." ],
    "url" : [ "https://social.design.systems/@Amy_Hupe/112615592655089268" ]
  }
}
