{
  "type" : [ "h-entry" ],
  "properties" : {
    "name" : [ "james (@james@strangeobject.space)" ],
    "summary" : [ "Stress awareness month is officially over.\n\nPlease stop being stressed, it is illegal for the next 11 months.\n\nGet your fucking Cortisol under control or you will start incurring fees." ],
    "url" : [ "https://strangeobject.space/@james/112365771052177692" ]
  }
}
