{
  "type" : [ "h-entry" ],
  "properties" : {
    "name" : [ "Carlana Johnson :v_trans:​ (@carlana@tech.lgbt)" ],
    "summary" : [ "The episode of @gotime@changelog.social I recorded is out! Just in time for the release of #golang 1.22. :ablobcatattention: https://changelog.com/gotime/302" ],
    "url" : [ "https://tech.lgbt/@carlana/111891106308440064" ]
  }
}
