{
  "type" : [ "h-entry" ],
  "properties" : {
    "name" : [ "Juhis (@hamatti@mastodon.world)" ],
    "summary" : [ "Why share technical stuff online? You never know how they may become useful to others!\n\n10 months ago I found a fix to an Eleventy issue I had. I documented it on my website in my /snacks section. https://hamatti.org/snacks/fix-templatecontent-too-early-in-eleventy/\n\nToday, I noticed someone having the same issue on 11ty Discord and went to share it. And then I found out that Christopher had already shared my solution in the issue and it had helped them! \nhttps://github.com/11ty/eleventy/issues/3136#issuecomment-2087875164\n\nContributing to #opensource through docs and blogs is good!" ],
    "url" : [ "https://mastodon.world/@hamatti/112463535922680806" ]
  }
}
