{
  "type" : [ "h-entry" ],
  "properties" : {
    "name" : [ "onion person (@junlper.beer)" ],
    "summary" : [ "this is a dril tweet" ],
    "featured" : [ "https://cdn.bsky.app/img/feed_thumbnail/plain/did:plc:mf5dzzqkp7fnmby6blfeljwj/bafkreigd2fi3jfw5qxbmfgfl3ad7skfsmtt5kjyedwaatekmmkl4wafcbu@jpeg" ],
    "url" : [ "https://bsky.app/profile/junlper.beer/post/3lecpfdqqv22f" ],
    "published" : [ "2024-12-27T19:19:15.446Z" ]
  }
}
