{
  "type" : [ "h-entry" ],
  "properties" : {
    "name" : [ "Rob Whitaker (@RobW@iosdev.space)" ],
    "summary" : [ "My home town, like many, has a Hollywood-inspired ‘walk of fame’ where local celebrities names are included in stars. Yet the dude I went to school with who had the massive willy who went to LA to star in porn films, is not amongst them." ],
    "url" : [ "https://iosdev.space/@RobW/112458692494088418" ]
  }
}
