{
  "type" : [ "h-entry" ],
  "properties" : {
    "name" : [ "Joe Nash (@joenash@hachyderm.io)" ],
    "summary" : [ "Do you have trouble prioritising? Unable to decide what to focus your energies on today, next week, next year? Might I suggest having an inherited degenerative eye condition? Simply arrange your interests into easy categories such as \"things that are easier to do with vision\"/\"things I can do without vision\"" ],
    "url" : [ "https://hachyderm.io/@joenash/112660591040790974" ]
  }
}
