{
  "type" : [ "h-entry" ],
  "properties" : {
    "name" : [ "Using S3 as a container registry" ],
    "summary" : [ "For the last four months I’ve been developing a custom container image builder, collaborating with Outerbounds1. The technical details of the builder itself might be the topic of a future article, but there’s something surprising I wanted to share already: you can use S3 as a container registry! You heard it right. All it takes is to expose an S3 bucket through HTTP and to upload the image’s files to specific paths." ],
    "featured" : [ "https://ochagavia.nl/images/headshot.jpg" ],
    "url" : [ "https://ochagavia.nl/blog/using-s3-as-a-container-registry/" ],
    "published" : [ "2024-07-03T00:00:00+00:00" ]
  }
}
