{
  "type" : [ "h-entry" ],
  "properties" : {
    "name" : [ "Meanwhile in Canada (@MeanwhileinCanada@ohai.social)" ],
    "summary" : [ "Attached: 1 image\n\nMay the 4th be with you." ],
    "featured" : [ "https://files.ohai.social/media_attachments/files/112/382/519/381/261/351/original/3b81de7ad109d4ef.jpg" ],
    "url" : [ "https://ohai.social/@MeanwhileinCanada/112382526162233611" ]
  }
}
