{
  "type" : [ "h-entry" ],
  "properties" : {
    "name" : [ "Carol 🪩 (@carol@social.lol)" ],
    "summary" : [ "i know i disappeared, but i’m in the trenches of the seasonal sads, will be back soon!" ],
    "url" : [ "https://social.lol/@carol/111912524913323630" ]
  }
}
