{
  "type" : [ "h-entry" ],
  "properties" : {
    "name" : [ "Post by NLnet, @nlnet@nlnet.nl" ],
    "summary" : [ "Call for Participation! We're happy to announce the first \"Funding the FOSS Ecosystem\" #devroom at #FOSDEM 2025. The goal of this devroom is for developers to gain insights into funding strategies and to engage more #FOSS users like companies & governments in FOSS funding. Submission..." ],
    "featured" : [ "https://social.nlnet.nl/fileserver/01PQYTCQGNVX1BV35GWGD863GC/attachment/original/01HSSJEDF6SSJ9DBXGA1YDHTWY.jpg" ],
    "url" : [ "https://social.nlnet.nl/@nlnet/statuses/01JBVWH94ZTYF1WWXHMD5AE8N2" ]
  }
}
