{
  "type" : [ "h-entry" ],
  "properties" : {
    "name" : [ "evacide (@evacide@hachyderm.io)" ],
    "summary" : [ "I would say that the US is moving into \"the law doesn't matter, only the President's whim matters\" territory faster than I expected, but this is about on schedule." ],
    "url" : [ "https://hachyderm.io/@evacide/113856576497440859" ]
  }
}
