{
  "type" : [ "h-entry" ],
  "properties" : {
    "name" : [ "Batch Bunch #0003 · Luma" ],
    "summary" : [ "We're excited to welcome you back to Batch Bunch on Monday, 10th March (7:00pm - 9:00pm) at The Dice Cup (68-70 Mansfield Rd, Nottingham NG1 3GY).\nBring along…" ],
    "featured" : [ "https://social-images.lu.ma/cdn-cgi/image/format=auto,fit=cover,dpr=1,anim=false,background=white,quality=75,width=800,height=419/api/event-one?calendar_avatar=https%3A%2F%2Fimages.lumacdn.com%2Fcalendars%2Fz8%2F638786e3-2d25-4e0f-9e95-6ed5ea9ca053&calendar_name=Batch%20Bunch&color0=%23000000&color1=%23fffd02&color2=%230f0f0e&color3=%23fefefe&host_avatar=https%3A%2F%2Fimages.lumacdn.com%2Favatars%2F3f%2F27b7e24d-dd1d-4870-a853-6f7ac3fc2756&host_name=Rizwana%20Akmal%20Khan&img=https%3A%2F%2Fimages.lumacdn.com%2Fevent-covers%2F80%2F40b210b1-2842-452e-88eb-91c11484adb8&name=Batch%20Bunch%20%230003" ],
    "url" : [ "https://lu.ma/fvtahk7t" ]
  }
}
