{
  "type" : [ "h-entry" ],
  "properties" : {
    "name" : [ "searchcode.com’s SQLite database is probably 6 terabytes bigger than yours | Ben E. C. Boyter" ],
    "url" : [ "https://boyter.org/posts/searchcode-bigger-sqlite-than-you/" ]
  }
}
