{
  "type" : [ "h-entry" ],
  "properties" : {
    "name" : [ "Cup o' Go | 📐 ⓦide rąnge οf tøpics wíth Yarɗen Laifėnfeld as gµest hoʂt" ],
    "summary" : [ "This show is supported by you! Consider joining as a Patreon member to support the show.Thanks Yarden for coming on the show!ProposalsDeclined: ASCII output in Go tools, PowerShell investigation underwayLikely Accept: `-json` flag for go buildThe new Range syntaxGo Wiki: Rangefunc ExperimentRange..." ],
    "featured" : [ "https://images.transistor.fm/file/transistor/images/show/37862/medium_1674486898-artwork.jpg" ],
    "audio" : [ "https://media.transistor.fm/32394496/88a8e0da.mp3" ],
    "url" : [ "https://share.transistor.fm/s/32394496" ]
  }
}
