{
  "type" : [ "h-entry" ],
  "properties" : {
    "name" : [ "Paul (@plwt@mstdn.social)" ],
    "summary" : [ "@Edent@mastodon.social  If there is a session you really want to see, possibly go to the session before it so you can get a seat.\n\nBe careful with backpacks in the corridors, turn with care. \n\nOn the Friday night, Delirium is very much the place to be.  For those that drink alcohol, Delirium Tremens is a really nice 8% ale.\n\n(Happy to be corrected) I think it is the number 75 bus that gets you from the city centre to the university." ],
    "url" : [ "https://mstdn.social/@plwt/113458018900279383" ]
  }
}
