{
  "type" : [ "h-entry" ],
  "properties" : {
    "name" : [ "GitHub - XSAM/otelsql: OpenTelemetry instrumentation for database/sql" ],
    "summary" : [ "OpenTelemetry instrumentation for database/sql. Contribute to XSAM/otelsql development by creating an account on GitHub." ],
    "featured" : [ "https://opengraph.githubassets.com/8a2931e8de4a8f67ee9f07a0bfec35c31a4863786848d1d555161ee192a45e0b/XSAM/otelsql" ],
    "url" : [ "https://github.com/XSAM/otelsql" ]
  }
}
