{
  "type" : [ "h-entry" ],
  "properties" : {
    "name" : [ "The Tech Stack of a One-Man SaaS" ],
    "summary" : [ "In this post I'll describe the tools and services I use to run my SaaS business. From programming languages to open source libraries to Kubernetes tools for easy deployments." ],
    "featured" : [ "https://anthonynsimon.com/img/content/tech-stack-og.png" ],
    "url" : [ "https://anthonynsimon.com/blog/tech-stack/" ],
    "published" : [ "2020-11-22" ]
  }
}
