{
  "type" : [ "h-entry" ],
  "properties" : {
    "name" : [ "Decentered S1E3: Ryan Barrett Has a Bridge to Sell Us" ],
    "summary" : [ "Ryan Barrett talks about protocols for the social web, and how to make them talk to each other." ],
    "featured" : [ "https://wedistribute.org/wp-content/uploads/2024/01/decentered-ep3-og.png" ],
    "audio" : [ "https://wedistribute.org/podcast-player/4591/bridgyfed-ryan-barrett.mp3" ],
    "url" : [ "https://wedistribute.org/podcast/bridgyfed-ryan-barrett/" ],
    "published" : [ "2024-02-02T19:23:27+00:00" ]
  }
}
