{
  "type" : [ "h-entry" ],
  "properties" : {
    "name" : [ "Bodil (@bodil@treehouse.systems)" ],
    "summary" : [ "Happy International Workers' Day to the entire Proletariat and to tech workers who just got laid off again but still don't think they have any pressing reason to unionise especially." ],
    "url" : [ "https://social.treehouse.systems/@bodil/112366507452935282" ]
  }
}
