{
  "type" : [ "h-entry" ],
  "properties" : {
    "name" : [ "Lex Lofthouse (@loftio.co.uk)" ],
    "summary" : [ "Tomorrow I'll be standing up in front of a room of software developers talking about how to make pretty designs 😅\nLooking forward to it #NDCLondon !" ],
    "url" : [ "https://bsky.app/profile/loftio.co.uk/post/3lgvlmred3s2a" ],
    "published" : [ "2025-01-29T18:22:45.755Z" ]
  }
}
