{
  "type" : [ "h-entry" ],
  "properties" : {
    "name" : [ "aimee rivers (@aimeerivers@queer.party)" ],
    "summary" : [ "i’m not sure which source control system needs to hear this but ..\n\nnobody has ever wanted to commit a .DS_Store file." ],
    "url" : [ "https://queer.party/@aimeerivers/112314677778397566" ]
  }
}
