{
  "type" : [ "h-entry" ],
  "properties" : {
    "name" : [ "Matthew Garrett (@mjg59@nondeterministic.computer)" ],
    "summary" : [ "Over a decade ago I wrote a thing about Gamergate that included a footnote along the lines of \"You are free to disagree with me in comments, but if you attempt to argue that Gamergate is not a misogynistic hate movement I will replace your comment with 'Fart fart fart fart'\". And I did. Encourage your enemies to spend hours writing 3000 word essays on why you're wrong and spend 5 seconds replacing it with \"Fart fart fart fart\". It's time they can't use against anyone else." ],
    "url" : [ "https://nondeterministic.computer/@mjg59/113582126119357678" ]
  }
}
