{
  "type" : [ "h-entry" ],
  "properties" : {
    "name" : [ "ThatSexToyGuy (@hungry_joe@mas.to)" ],
    "summary" : [ "me: i'll have the house wine please\n\nwaiter: sorry we've only got techno wine\n\n*techno wine marches in coked off its face*\n\ntechno wine: WHISTLE CREW MAKE SOME NOOOOIIIIISE" ],
    "url" : [ "https://mas.to/@hungry_joe/112122460415659262" ]
  }
}
