{
  "type" : [ "h-entry" ],
  "properties" : {
    "name" : [ "Truth Or Consequences ✅ (@Savvyhomestead@mastodon.social)" ],
    "summary" : [ "Attached: 1 image" ],
    "featured" : [ "https://files.mastodon.social/media_attachments/files/113/637/599/014/552/380/original/5cfe2626876ff7ac.jpg" ],
    "url" : [ "https://mastodon.social/@Savvyhomestead/113637600085778789" ]
  }
}
