{
  "type" : [ "h-entry" ],
  "properties" : {
    "name" : [ "The Business of Open Source | Buyer-Based Open Core with Zach Wasserman " ],
    "summary" : [ "This week on The Business of Open Source, I spoke with Zach Wasserman, co-founder and CTO of Fleet. This was a fabulous episode for many reasons, but then again I never do crappy episodes, right? The first thing I wanted to call your attention to is that Zach talked about how he’s building an..." ],
    "featured" : [ "https://images.transistor.fm/images/show/10529/medium_1656512000-artwork.jpg" ],
    "audio" : [ "https://dts.podtrac.com/redirect.mp3/media.transistor.fm/f6c64ecd/a011d28a.mp3" ],
    "url" : [ "https://share.transistor.fm/s/f6c64ecd" ]
  }
}
