{
  "type" : [ "h-entry" ],
  "properties" : {
    "name" : [ "" ],
    "url" : [ "https://snarfed.org/2024-11-18_54098" ],
    "published" : [ "2024-11-18T11:39:00-08:00", "2024-11-18T12:33:18-08:00", "2024-11-18T12:42:40-08:00", "2024-11-18T12:44:46-08:00", "2024-11-18T12:54:50-08:00", "2024-11-18T12:58:34-08:00", "2024-11-18T13:36:50-08:00", "2024-11-19T00:05:39-08:00" ],
    "content" : [ {
      "html" : "<p>Most of the time, I don’t feel like a technical wizard, or a product visionary, or an inspiring leader, or an empathetic community builder, or anything like that.</p>\n<p>Most of the time, I feel like a plumber. Just trying to keep the pipes hooked up, plugging leaks, keeping the raw sewage away from the drinking water.</p>\n<p>I’m ok with that.</p>",
      "value" : "Most of the time, I don’t feel like a technical wizard, or a product visionary, or an inspiring leader, or an empathetic community builder, or anything like that.\nMost of the time, I feel like a plumber. Just trying to keep the pipes hooked up, plugging leaks, keeping the raw sewage away from the drinking water.\nI’m ok with that.",
      "lang" : "en-US"
    } ],
    "author" : [ {
      "type" : [ "h-card" ],
      "properties" : {
        "name" : [ "ryandc" ],
        "photo" : [ {
          "value" : "https://secure.gravatar.com/avatar/9318eaddcc76db3f621bc792a4644aa5?s=96&d=blank&r=g",
          "alt" : ""
        } ],
        "url" : [ "https://snarfed.org/2024-11-18_54098" ]
      },
      "lang" : "en-US",
      "value" : "ryandc"
    }, {
      "type" : [ "h-card" ],
      "properties" : {
        "name" : [ "Mark Stoneman" ],
        "url" : [ "https://zirk.us/@markstoneman" ]
      },
      "lang" : "en-US",
      "value" : "Mark Stoneman"
    }, {
      "type" : [ "h-card" ],
      "properties" : {
        "name" : [ "2xfo" ],
        "url" : [ "https://infosec.exchange/@RnDanger" ]
      },
      "lang" : "en-US",
      "value" : "2xfo"
    }, {
      "type" : [ "h-card" ],
      "properties" : {
        "name" : [ "Roni Laukkarinen" ],
        "url" : [ "https://mementomori.social/@rolle" ]
      },
      "lang" : "en-US",
      "value" : "Roni Laukkarinen"
    }, {
      "type" : [ "h-card" ],
      "properties" : {
        "name" : [ "Gay “Spooky” Deceiver" ],
        "url" : [ "https://mstdn.social/@GayDeceiver" ]
      },
      "lang" : "en-US",
      "value" : "Gay “Spooky” Deceiver"
    }, {
      "type" : [ "h-card" ],
      "properties" : {
        "name" : [ "Jérôme" ],
        "url" : [ "https://jasette.facil.services/@jerome" ]
      },
      "lang" : "en-US",
      "value" : "Jérôme"
    }, {
      "type" : [ "h-card" ],
      "properties" : {
        "name" : [ "Toni Lijic" ],
        "url" : [ "https://mastodon.design/@tl" ]
      },
      "lang" : "en-US",
      "value" : "Toni Lijic"
    }, {
      "type" : [ "h-card" ],
      "properties" : {
        "name" : [ "Cyril Brulebois" ],
        "url" : [ "https://mamot.fr/@CyrilBrulebois" ]
      },
      "lang" : "en-US",
      "value" : "Cyril Brulebois"
    } ],
    "like" : [ {
      "type" : [ "h-cite" ],
      "properties" : {
        "author" : [ {
          "type" : [ "h-card" ],
          "properties" : {
            "name" : [ "Chao-c'" ],
            "url" : [ "https://f.cz/@xChaos" ]
          },
          "lang" : "en-US",
          "value" : "Chao-c'"
        } ]
      },
      "id" : "comment-2894043",
      "lang" : "en-US",
      "value" : "👍 Chao-c'"
    }, {
      "type" : [ "h-cite" ],
      "properties" : {
        "author" : [ {
          "type" : [ "h-card" ],
          "properties" : {
            "name" : [ "LillyLyle/Count Melancholia" ],
            "url" : [ "https://mastodon.social/@LillyHerself" ]
          },
          "lang" : "en-US",
          "value" : "LillyLyle/Count Melancholia"
        } ]
      },
      "id" : "comment-2893969",
      "lang" : "en-US",
      "value" : "👍 LillyLyle/Count Melancholia"
    }, {
      "type" : [ "h-cite" ],
      "properties" : {
        "author" : [ {
          "type" : [ "h-card" ],
          "properties" : {
            "name" : [ "Katzentratschen" ],
            "url" : [ "https://mastodon.social/@katzentratschen" ]
          },
          "lang" : "en-US",
          "value" : "Katzentratschen"
        } ]
      },
      "id" : "comment-2893892",
      "lang" : "en-US",
      "value" : "👍 Katzentratschen"
    }, {
      "type" : [ "h-cite" ],
      "properties" : {
        "author" : [ {
          "type" : [ "h-card" ],
          "properties" : {
            "name" : [ "Pete Prodoehl 🍕" ],
            "url" : [ "https://mastodon.social/@rasterweb" ]
          },
          "lang" : "en-US",
          "value" : "Pete Prodoehl 🍕"
        } ]
      },
      "id" : "comment-2893799",
      "lang" : "en-US",
      "value" : "👍 Pete Prodoehl 🍕"
    }, {
      "type" : [ "h-cite" ],
      "properties" : {
        "author" : [ {
          "type" : [ "h-card" ],
          "properties" : {
            "name" : [ "Tom Casavant" ],
            "url" : [ "https://tomkahe.com/@tom" ]
          },
          "lang" : "en-US",
          "value" : "Tom Casavant"
        } ]
      },
      "id" : "comment-2893766",
      "lang" : "en-US",
      "value" : "👍 Tom Casavant"
    }, {
      "type" : [ "h-cite" ],
      "properties" : {
        "author" : [ {
          "type" : [ "h-card" ],
          "properties" : {
            "name" : [ "NeoDB Open Source Software" ],
            "url" : [ "https://mastodon.online/@neodb" ]
          },
          "lang" : "en-US",
          "value" : "NeoDB Open Source Software"
        } ]
      },
      "id" : "comment-2893741",
      "lang" : "en-US",
      "value" : "👍 NeoDB Open Source Software"
    }, {
      "type" : [ "h-cite" ],
      "properties" : {
        "author" : [ {
          "type" : [ "h-card" ],
          "properties" : {
            "name" : [ "Cyril Brulebois" ],
            "url" : [ "https://mamot.fr/@CyrilBrulebois" ]
          },
          "lang" : "en-US",
          "value" : "Cyril Brulebois"
        } ]
      },
      "id" : "comment-2893621",
      "lang" : "en-US",
      "value" : "👍 Cyril Brulebois"
    }, {
      "type" : [ "h-cite" ],
      "properties" : {
        "author" : [ {
          "type" : [ "h-card" ],
          "properties" : {
            "name" : [ "Ken Oh" ],
            "url" : [ "https://mstdn.social/@kenoh" ]
          },
          "lang" : "en-US",
          "value" : "Ken Oh"
        } ]
      },
      "id" : "comment-2893628",
      "lang" : "en-US",
      "value" : "👍 Ken Oh"
    }, {
      "type" : [ "h-cite" ],
      "properties" : {
        "author" : [ {
          "type" : [ "h-card" ],
          "properties" : {
            "name" : [ "jkirk" ],
            "url" : [ "https://graz.social/@jkirk" ]
          },
          "lang" : "en-US",
          "value" : "jkirk"
        } ]
      },
      "id" : "comment-2893638",
      "lang" : "en-US",
      "value" : "👍 jkirk"
    }, {
      "type" : [ "h-cite" ],
      "properties" : {
        "author" : [ {
          "type" : [ "h-card" ],
          "properties" : {
            "name" : [ "Claire Barnes" ],
            "url" : [ "https://h-net.social/@ClaireFromClare" ]
          },
          "lang" : "en-US",
          "value" : "Claire Barnes"
        } ]
      },
      "id" : "comment-2893626",
      "lang" : "en-US",
      "value" : "👍 Claire Barnes"
    }, {
      "type" : [ "h-cite" ],
      "properties" : {
        "author" : [ {
          "type" : [ "h-card" ],
          "properties" : {
            "name" : [ "Matthias Pfefferle" ],
            "url" : [ "https://mastodon.social/@pfefferle" ]
          },
          "lang" : "en-US",
          "value" : "Matthias Pfefferle"
        } ]
      },
      "id" : "comment-2893631",
      "lang" : "en-US",
      "value" : "👍 Matthias Pfefferle"
    }, {
      "type" : [ "h-cite" ],
      "properties" : {
        "author" : [ {
          "type" : [ "h-card" ],
          "properties" : {
            "name" : [ "🌿 (buffy)² 🌿 :they_them:" ],
            "url" : [ "https://genericsocialmediapage.com/@errbufferoverfl" ]
          },
          "lang" : "en-US",
          "value" : "🌿 (buffy)² 🌿 :they_them:"
        } ]
      },
      "id" : "comment-2893620",
      "lang" : "en-US",
      "value" : "👍 🌿 (buffy)² 🌿 :they_them:"
    }, {
      "type" : [ "h-cite" ],
      "properties" : {
        "author" : [ {
          "type" : [ "h-card" ],
          "properties" : {
            "name" : [ "Yohan Yukiya Sese ♾️ 사요한 🦣" ],
            "url" : [ "https://c.im/@youronlyone" ]
          },
          "lang" : "en-US",
          "value" : "Yohan Yukiya Sese ♾️ 사요한 🦣"
        } ]
      },
      "id" : "comment-2893619",
      "lang" : "en-US",
      "value" : "👍 Yohan Yukiya Sese ♾️ 사요한 🦣"
    }, {
      "type" : [ "h-cite" ],
      "properties" : {
        "author" : [ {
          "type" : [ "h-card" ],
          "properties" : {
            "name" : [ "Attar Silas" ],
            "url" : [ "https://piaille.fr/@AttarSilas" ]
          },
          "lang" : "en-US",
          "value" : "Attar Silas"
        } ]
      },
      "id" : "comment-2893618",
      "lang" : "en-US",
      "value" : "👍 Attar Silas"
    }, {
      "type" : [ "h-cite" ],
      "properties" : {
        "author" : [ {
          "type" : [ "h-card" ],
          "properties" : {
            "name" : [ "@reiver ⊼ (Charles) :batman:" ],
            "url" : [ "https://mastodon.social/@reiver" ]
          },
          "lang" : "en-US",
          "value" : "@reiver ⊼ (Charles) :batman:"
        } ]
      },
      "id" : "comment-2893617",
      "lang" : "en-US",
      "value" : "👍 @reiver ⊼ (Charles) :batman:"
    }, {
      "type" : [ "h-cite" ],
      "properties" : {
        "author" : [ {
          "type" : [ "h-card" ],
          "properties" : {
            "name" : [ "Kadsepfösch" ],
            "url" : [ "https://troet.cafe/@Glatorius" ]
          },
          "lang" : "en-US",
          "value" : "Kadsepfösch"
        } ]
      },
      "id" : "comment-2893616",
      "lang" : "en-US",
      "value" : "👍 Kadsepfösch"
    }, {
      "type" : [ "h-cite" ],
      "properties" : {
        "author" : [ {
          "type" : [ "h-card" ],
          "properties" : {
            "name" : [ "IZA" ],
            "url" : [ "https://fedibird.com/@HswkkIZA" ]
          },
          "lang" : "en-US",
          "value" : "IZA"
        } ]
      },
      "id" : "comment-2893614",
      "lang" : "en-US",
      "value" : "👍 IZA"
    }, {
      "type" : [ "h-cite" ],
      "properties" : {
        "author" : [ {
          "type" : [ "h-card" ],
          "properties" : {
            "name" : [ "IZA" ],
            "url" : [ "https://fedibird.com/@HswkkIZA" ]
          },
          "lang" : "en-US",
          "value" : "IZA"
        } ]
      },
      "id" : "comment-2893613",
      "lang" : "en-US",
      "value" : "👍 IZA"
    }, {
      "type" : [ "h-cite" ],
      "properties" : {
        "author" : [ {
          "type" : [ "h-card" ],
          "properties" : {
            "name" : [ "Dave Peck" ],
            "url" : [ "https://mastodon.davepeck.org/@davepeck" ]
          },
          "lang" : "en-US",
          "value" : "Dave Peck"
        } ]
      },
      "id" : "comment-2893609",
      "lang" : "en-US",
      "value" : "👍 Dave Peck"
    }, {
      "type" : [ "h-cite" ],
      "properties" : {
        "author" : [ {
          "type" : [ "h-card" ],
          "properties" : {
            "name" : [ "Colin Devroe" ],
            "url" : [ "https://mastodon.social/@cdevroe" ]
          },
          "lang" : "en-US",
          "value" : "Colin Devroe"
        } ]
      },
      "id" : "comment-2893608",
      "lang" : "en-US",
      "value" : "👍 Colin Devroe"
    }, {
      "type" : [ "h-cite" ],
      "properties" : {
        "author" : [ {
          "type" : [ "h-card" ],
          "properties" : {
            "name" : [ "Dennis Nunes" ],
            "url" : [ "https://social.vivaldi.net/@nunesdennis" ]
          },
          "lang" : "en-US",
          "value" : "Dennis Nunes"
        } ]
      },
      "id" : "comment-2893607",
      "lang" : "en-US",
      "value" : "👍 Dennis Nunes"
    }, {
      "type" : [ "h-cite" ],
      "properties" : {
        "author" : [ {
          "type" : [ "h-card" ],
          "properties" : {
            "name" : [ "Pelle Wessman" ],
            "url" : [ "https://mastodon.social/@voxpelli" ]
          },
          "lang" : "en-US",
          "value" : "Pelle Wessman"
        } ]
      },
      "id" : "comment-2893605",
      "lang" : "en-US",
      "value" : "👍 Pelle Wessman"
    }, {
      "type" : [ "h-cite" ],
      "properties" : {
        "author" : [ {
          "type" : [ "h-card" ],
          "properties" : {
            "name" : [ "Pete Spoopy Creppy Hudgins" ],
            "url" : [ "https://beige.party/@phudgins" ]
          },
          "lang" : "en-US",
          "value" : "Pete Spoopy Creppy Hudgins"
        } ]
      },
      "id" : "comment-2893604",
      "lang" : "en-US",
      "value" : "👍 Pete Spoopy Creppy Hudgins"
    }, {
      "type" : [ "h-cite" ],
      "properties" : {
        "author" : [ {
          "type" : [ "h-card" ],
          "properties" : {
            "name" : [ "Stein Arne Brekke" ],
            "url" : [ "https://eupolicy.social/@brekke" ]
          },
          "lang" : "en-US",
          "value" : "Stein Arne Brekke"
        } ]
      },
      "id" : "comment-2893603",
      "lang" : "en-US",
      "value" : "👍 Stein Arne Brekke"
    }, {
      "type" : [ "h-cite" ],
      "properties" : {
        "author" : [ {
          "type" : [ "h-card" ],
          "properties" : {
            "name" : [ "Bluedepth" ],
            "url" : [ "https://mastodon.social/@Bluedepth" ]
          },
          "lang" : "en-US",
          "value" : "Bluedepth"
        } ]
      },
      "id" : "comment-2893602",
      "lang" : "en-US",
      "value" : "👍 Bluedepth"
    }, {
      "type" : [ "h-cite" ],
      "properties" : {
        "author" : [ {
          "type" : [ "h-card" ],
          "properties" : {
            "name" : [ "Toni Lijic" ],
            "url" : [ "https://mastodon.design/@tl" ]
          },
          "lang" : "en-US",
          "value" : "Toni Lijic"
        } ]
      },
      "id" : "comment-2893600",
      "lang" : "en-US",
      "value" : "👍 Toni Lijic"
    }, {
      "type" : [ "h-cite" ],
      "properties" : {
        "author" : [ {
          "type" : [ "h-card" ],
          "properties" : {
            "name" : [ "Jon" ],
            "url" : [ "https://blahaj.zone/@jdp23" ]
          },
          "lang" : "en-US",
          "value" : "Jon"
        } ]
      },
      "id" : "comment-2893597",
      "lang" : "en-US",
      "value" : "👍 Jon"
    }, {
      "type" : [ "h-cite" ],
      "properties" : {
        "author" : [ {
          "type" : [ "h-card" ],
          "properties" : {
            "name" : [ "Martin Vermeer FCD" ],
            "url" : [ "https://fediscience.org/@martinvermeer" ]
          },
          "lang" : "en-US",
          "value" : "Martin Vermeer FCD"
        } ]
      },
      "id" : "comment-2893596",
      "lang" : "en-US",
      "value" : "👍 Martin Vermeer FCD"
    }, {
      "type" : [ "h-cite" ],
      "properties" : {
        "author" : [ {
          "type" : [ "h-card" ],
          "properties" : {
            "name" : [ "Michael Santaly" ],
            "url" : [ "https://mstdn.social/@wonkothesane" ]
          },
          "lang" : "en-US",
          "value" : "Michael Santaly"
        } ]
      },
      "id" : "comment-2893594",
      "lang" : "en-US",
      "value" : "👍 Michael Santaly"
    }, {
      "type" : [ "h-cite" ],
      "properties" : {
        "author" : [ {
          "type" : [ "h-card" ],
          "properties" : {
            "name" : [ "Chris" ],
            "url" : [ "https://metalhead.club/@trendskater" ]
          },
          "lang" : "en-US",
          "value" : "Chris"
        } ]
      },
      "id" : "comment-2893591",
      "lang" : "en-US",
      "value" : "👍 Chris"
    }, {
      "type" : [ "h-cite" ],
      "properties" : {
        "author" : [ {
          "type" : [ "h-card" ],
          "properties" : {
            "name" : [ "Hugh Simpson" ],
            "url" : [ "https://hostux.social/@silasmariner" ]
          },
          "lang" : "en-US",
          "value" : "Hugh Simpson"
        } ]
      },
      "id" : "comment-2893589",
      "lang" : "en-US",
      "value" : "👍 Hugh Simpson"
    }, {
      "type" : [ "h-cite" ],
      "properties" : {
        "author" : [ {
          "type" : [ "h-card" ],
          "properties" : {
            "name" : [ "Cromley" ],
            "url" : [ "https://mindly.social/@VoiceofDuum" ]
          },
          "lang" : "en-US",
          "value" : "Cromley"
        } ]
      },
      "id" : "comment-2893588",
      "lang" : "en-US",
      "value" : "👍 Cromley"
    }, {
      "type" : [ "h-cite" ],
      "properties" : {
        "author" : [ {
          "type" : [ "h-card" ],
          "properties" : {
            "name" : [ "Joe Cooper 💾" ],
            "url" : [ "https://mas.to/@swelljoe" ]
          },
          "lang" : "en-US",
          "value" : "Joe Cooper 💾"
        } ]
      },
      "id" : "comment-2893584",
      "lang" : "en-US",
      "value" : "👍 Joe Cooper 💾"
    }, {
      "type" : [ "h-cite" ],
      "properties" : {
        "author" : [ {
          "type" : [ "h-card" ],
          "properties" : {
            "name" : [ "Māris Jonovs" ],
            "url" : [ "https://toot.lv/@marisjonovs" ]
          },
          "lang" : "en-US",
          "value" : "Māris Jonovs"
        } ]
      },
      "id" : "comment-2893583",
      "lang" : "en-US",
      "value" : "👍 Māris Jonovs"
    }, {
      "type" : [ "h-cite" ],
      "properties" : {
        "author" : [ {
          "type" : [ "h-card" ],
          "properties" : {
            "name" : [ "NAAN" ],
            "url" : [ "https://sakurajima.moe/@naan" ]
          },
          "lang" : "en-US",
          "value" : "NAAN"
        } ]
      },
      "id" : "comment-2893582",
      "lang" : "en-US",
      "value" : "👍 NAAN"
    }, {
      "type" : [ "h-cite" ],
      "properties" : {
        "author" : [ {
          "type" : [ "h-card" ],
          "properties" : {
            "name" : [ "Yamakyu" ],
            "url" : [ "https://shelter.moe/@Yamakyu" ]
          },
          "lang" : "en-US",
          "value" : "Yamakyu"
        } ]
      },
      "id" : "comment-2893581",
      "lang" : "en-US",
      "value" : "👍 Yamakyu"
    }, {
      "type" : [ "h-cite" ],
      "properties" : {
        "author" : [ {
          "type" : [ "h-card" ],
          "properties" : {
            "name" : [ "Riku Voipio" ],
            "url" : [ "https://society.oftrolls.com/@suihkulokki" ]
          },
          "lang" : "en-US",
          "value" : "Riku Voipio"
        } ]
      },
      "id" : "comment-2893580",
      "lang" : "en-US",
      "value" : "👍 Riku Voipio"
    }, {
      "type" : [ "h-cite" ],
      "properties" : {
        "author" : [ {
          "type" : [ "h-card" ],
          "properties" : {
            "name" : [ "Kris" ],
            "url" : [ "https://mastodon.social/@krssctt" ]
          },
          "lang" : "en-US",
          "value" : "Kris"
        } ]
      },
      "id" : "comment-2893579",
      "lang" : "en-US",
      "value" : "👍 Kris"
    }, {
      "type" : [ "h-cite" ],
      "properties" : {
        "author" : [ {
          "type" : [ "h-card" ],
          "properties" : {
            "name" : [ "Fernby Films" ],
            "url" : [ "https://mastodon.sdf.org/@fernby" ]
          },
          "lang" : "en-US",
          "value" : "Fernby Films"
        } ]
      },
      "id" : "comment-2893578",
      "lang" : "en-US",
      "value" : "👍 Fernby Films"
    }, {
      "type" : [ "h-cite" ],
      "properties" : {
        "author" : [ {
          "type" : [ "h-card" ],
          "properties" : {
            "name" : [ "Nic Wistreich" ],
            "url" : [ "https://social.coop/@nicol" ]
          },
          "lang" : "en-US",
          "value" : "Nic Wistreich"
        } ]
      },
      "id" : "comment-2893577",
      "lang" : "en-US",
      "value" : "👍 Nic Wistreich"
    }, {
      "type" : [ "h-cite" ],
      "properties" : {
        "author" : [ {
          "type" : [ "h-card" ],
          "properties" : {
            "name" : [ "Roni Laukkarinen" ],
            "url" : [ "https://mementomori.social/@rolle" ]
          },
          "lang" : "en-US",
          "value" : "Roni Laukkarinen"
        } ]
      },
      "id" : "comment-2893574",
      "lang" : "en-US",
      "value" : "👍 Roni Laukkarinen"
    }, {
      "type" : [ "h-cite" ],
      "properties" : {
        "author" : [ {
          "type" : [ "h-card" ],
          "properties" : {
            "name" : [ "Rep. Eric Gallager (no \"h\"!)" ],
            "url" : [ "https://social.treehouse.systems/@egallager" ]
          },
          "lang" : "en-US",
          "value" : "Rep. Eric Gallager (no \"h\"!)"
        } ]
      },
      "id" : "comment-2893571",
      "lang" : "en-US",
      "value" : "👍 Rep. Eric Gallager (no \"h\"!)"
    }, {
      "type" : [ "h-cite" ],
      "properties" : {
        "author" : [ {
          "type" : [ "h-card" ],
          "properties" : {
            "name" : [ "Simon Frei" ],
            "url" : [ "https://social.linux.pizza/@imsodin" ]
          },
          "lang" : "en-US",
          "value" : "Simon Frei"
        } ]
      },
      "id" : "comment-2893569",
      "lang" : "en-US",
      "value" : "👍 Simon Frei"
    }, {
      "type" : [ "h-cite" ],
      "properties" : {
        "author" : [ {
          "type" : [ "h-card" ],
          "properties" : {
            "name" : [ "b-loved dreamer" ],
            "url" : [ "https://mastodon.online/@mrzool" ]
          },
          "lang" : "en-US",
          "value" : "b-loved dreamer"
        } ]
      },
      "id" : "comment-2893567",
      "lang" : "en-US",
      "value" : "👍 b-loved dreamer"
    }, {
      "type" : [ "h-cite" ],
      "properties" : {
        "author" : [ {
          "type" : [ "h-card" ],
          "properties" : {
            "name" : [ "Em-squared" ],
            "url" : [ "https://mastodon.social/@emsquared" ]
          },
          "lang" : "en-US",
          "value" : "Em-squared"
        } ]
      },
      "id" : "comment-2893565",
      "lang" : "en-US",
      "value" : "👍 Em-squared"
    }, {
      "type" : [ "h-cite" ],
      "properties" : {
        "author" : [ {
          "type" : [ "h-card" ],
          "properties" : {
            "name" : [ "shadowwwind" ],
            "url" : [ "https://fosstodon.org/@shadowwwind" ]
          },
          "lang" : "en-US",
          "value" : "shadowwwind"
        } ]
      },
      "id" : "comment-2893564",
      "lang" : "en-US",
      "value" : "👍 shadowwwind"
    }, {
      "type" : [ "h-cite" ],
      "properties" : {
        "author" : [ {
          "type" : [ "h-card" ],
          "properties" : {
            "name" : [ "nen" ],
            "url" : [ "https://mementomori.social/@nen" ]
          },
          "lang" : "en-US",
          "value" : "nen"
        } ]
      },
      "id" : "comment-2893563",
      "lang" : "en-US",
      "value" : "👍 nen"
    }, {
      "type" : [ "h-cite" ],
      "properties" : {
        "author" : [ {
          "type" : [ "h-card" ],
          "properties" : {
            "name" : [ "Ojārs Kapteinis" ],
            "url" : [ "https://kapteinis.lv/@ojars" ]
          },
          "lang" : "en-US",
          "value" : "Ojārs Kapteinis"
        } ]
      },
      "id" : "comment-2893562",
      "lang" : "en-US",
      "value" : "👍 Ojārs Kapteinis"
    }, {
      "type" : [ "h-cite" ],
      "properties" : {
        "author" : [ {
          "type" : [ "h-card" ],
          "properties" : {
            "name" : [ "Dr James Ravenscroft" ],
            "url" : [ "https://fosstodon.org/@jamesravey" ]
          },
          "lang" : "en-US",
          "value" : "Dr James Ravenscroft"
        } ]
      },
      "id" : "comment-2893561",
      "lang" : "en-US",
      "value" : "👍 Dr James Ravenscroft"
    }, {
      "type" : [ "h-cite" ],
      "properties" : {
        "author" : [ {
          "type" : [ "h-card" ],
          "properties" : {
            "name" : [ "Cumulonimbus" ],
            "url" : [ "https://infosec.exchange/@cumulonimbus" ]
          },
          "lang" : "en-US",
          "value" : "Cumulonimbus"
        } ]
      },
      "id" : "comment-2893560",
      "lang" : "en-US",
      "value" : "👍 Cumulonimbus"
    }, {
      "type" : [ "h-cite" ],
      "properties" : {
        "author" : [ {
          "type" : [ "h-card" ],
          "properties" : {
            "name" : [ "Clara Listensprechen 4 Harris" ],
            "url" : [ "https://friendica.myportal.social/profile/claralistensprechen3rd" ]
          },
          "lang" : "en-US",
          "value" : "Clara Listensprechen 4 Harris"
        } ]
      },
      "id" : "comment-2893592",
      "lang" : "en-US",
      "value" : "👍 Clara Listensprechen 4 Harris"
    } ],
    "repost" : [ {
      "type" : [ "h-cite" ],
      "properties" : {
        "author" : [ {
          "type" : [ "h-card" ],
          "properties" : {
            "name" : [ "LillyLyle/Count Melancholia" ],
            "url" : [ "https://mastodon.social/@LillyHerself" ]
          },
          "lang" : "en-US",
          "value" : "LillyLyle/Count Melancholia"
        } ]
      },
      "id" : "comment-2893970",
      "lang" : "en-US",
      "value" : "♻️ LillyLyle/Count Melancholia"
    }, {
      "type" : [ "h-cite" ],
      "properties" : {
        "author" : [ {
          "type" : [ "h-card" ],
          "properties" : {
            "name" : [ "ch2500" ],
            "url" : [ "https://chaos.social/@ch2500" ]
          },
          "lang" : "en-US",
          "value" : "ch2500"
        } ]
      },
      "id" : "comment-2893625",
      "lang" : "en-US",
      "value" : "♻️ ch2500"
    }, {
      "type" : [ "h-cite" ],
      "properties" : {
        "author" : [ {
          "type" : [ "h-card" ],
          "properties" : {
            "name" : [ "Didier Raboud" ],
            "url" : [ "https://framapiaf.org/@OdyX" ]
          },
          "lang" : "en-US",
          "value" : "Didier Raboud"
        } ]
      },
      "id" : "comment-2893624",
      "lang" : "en-US",
      "value" : "♻️ Didier Raboud"
    }, {
      "type" : [ "h-cite" ],
      "properties" : {
        "author" : [ {
          "type" : [ "h-card" ],
          "properties" : {
            "name" : [ "Cyril Brulebois" ],
            "url" : [ "https://mamot.fr/@CyrilBrulebois" ]
          },
          "lang" : "en-US",
          "value" : "Cyril Brulebois"
        } ]
      },
      "id" : "comment-2893622",
      "lang" : "en-US",
      "value" : "♻️ Cyril Brulebois"
    }, {
      "type" : [ "h-cite" ],
      "properties" : {
        "author" : [ {
          "type" : [ "h-card" ],
          "properties" : {
            "name" : [ "Riku Voipio" ],
            "url" : [ "https://society.oftrolls.com/@suihkulokki" ]
          },
          "lang" : "en-US",
          "value" : "Riku Voipio"
        } ]
      },
      "id" : "comment-2893615",
      "lang" : "en-US",
      "value" : "♻️ Riku Voipio"
    }, {
      "type" : [ "h-cite" ],
      "properties" : {
        "author" : [ {
          "type" : [ "h-card" ],
          "properties" : {
            "name" : [ "Nelfaneor" ],
            "url" : [ "https://mastodon.zaclys.com/@Nelfan" ]
          },
          "lang" : "en-US",
          "value" : "Nelfaneor"
        } ]
      },
      "id" : "comment-2893606",
      "lang" : "en-US",
      "value" : "♻️ Nelfaneor"
    }, {
      "type" : [ "h-cite" ],
      "properties" : {
        "author" : [ {
          "type" : [ "h-card" ],
          "properties" : {
            "name" : [ "Friedhardware" ],
            "url" : [ "https://hachyderm.io/@friedhardware" ]
          },
          "lang" : "en-US",
          "value" : "Friedhardware"
        } ]
      },
      "id" : "comment-2893599",
      "lang" : "en-US",
      "value" : "♻️ Friedhardware"
    }, {
      "type" : [ "h-cite" ],
      "properties" : {
        "author" : [ {
          "type" : [ "h-card" ],
          "properties" : {
            "name" : [ "Kyle Hasselbacher" ],
            "url" : [ "https://mastodon.social/@kyleha" ]
          },
          "lang" : "en-US",
          "value" : "Kyle Hasselbacher"
        } ]
      },
      "id" : "comment-2893598",
      "lang" : "en-US",
      "value" : "♻️ Kyle Hasselbacher"
    }, {
      "type" : [ "h-cite" ],
      "properties" : {
        "author" : [ {
          "type" : [ "h-card" ],
          "properties" : {
            "name" : [ "Martin Vermeer FCD" ],
            "url" : [ "https://fediscience.org/@martinvermeer" ]
          },
          "lang" : "en-US",
          "value" : "Martin Vermeer FCD"
        } ]
      },
      "id" : "comment-2893595",
      "lang" : "en-US",
      "value" : "♻️ Martin Vermeer FCD"
    }, {
      "type" : [ "h-cite" ],
      "properties" : {
        "author" : [ {
          "type" : [ "h-card" ],
          "properties" : {
            "name" : [ "El Santo Negro :gitea:" ],
            "url" : [ "https://masto.ai/@elsantonegro" ]
          },
          "lang" : "en-US",
          "value" : "El Santo Negro :gitea:"
        } ]
      },
      "id" : "comment-2893593",
      "lang" : "en-US",
      "value" : "♻️ El Santo Negro :gitea:"
    }, {
      "type" : [ "h-cite" ],
      "properties" : {
        "author" : [ {
          "type" : [ "h-card" ],
          "properties" : {
            "name" : [ "Hugh Simpson" ],
            "url" : [ "https://hostux.social/@silasmariner" ]
          },
          "lang" : "en-US",
          "value" : "Hugh Simpson"
        } ]
      },
      "id" : "comment-2893590",
      "lang" : "en-US",
      "value" : "♻️ Hugh Simpson"
    }, {
      "type" : [ "h-cite" ],
      "properties" : {
        "author" : [ {
          "type" : [ "h-card" ],
          "properties" : {
            "name" : [ "Gay “Spooky” Deceiver" ],
            "url" : [ "https://mstdn.social/@GayDeceiver" ]
          },
          "lang" : "en-US",
          "value" : "Gay “Spooky” Deceiver"
        } ]
      },
      "id" : "comment-2893585",
      "lang" : "en-US",
      "value" : "♻️ Gay “Spooky” Deceiver"
    }, {
      "type" : [ "h-cite" ],
      "properties" : {
        "author" : [ {
          "type" : [ "h-card" ],
          "properties" : {
            "name" : [ "Roni Laukkarinen" ],
            "url" : [ "https://mementomori.social/@rolle" ]
          },
          "lang" : "en-US",
          "value" : "Roni Laukkarinen"
        } ]
      },
      "id" : "comment-2893575",
      "lang" : "en-US",
      "value" : "♻️ Roni Laukkarinen"
    }, {
      "type" : [ "h-cite" ],
      "properties" : {
        "author" : [ {
          "type" : [ "h-card" ],
          "properties" : {
            "name" : [ "2xfo" ],
            "url" : [ "https://infosec.exchange/@RnDanger" ]
          },
          "lang" : "en-US",
          "value" : "2xfo"
        } ]
      },
      "id" : "comment-2893572",
      "lang" : "en-US",
      "value" : "♻️ 2xfo"
    }, {
      "type" : [ "h-cite" ],
      "properties" : {
        "author" : [ {
          "type" : [ "h-card" ],
          "properties" : {
            "name" : [ "Rep. Eric Gallager (no \"h\"!)" ],
            "url" : [ "https://social.treehouse.systems/@egallager" ]
          },
          "lang" : "en-US",
          "value" : "Rep. Eric Gallager (no \"h\"!)"
        } ]
      },
      "id" : "comment-2893570",
      "lang" : "en-US",
      "value" : "♻️ Rep. Eric Gallager (no \"h\"!)"
    }, {
      "type" : [ "h-cite" ],
      "properties" : {
        "author" : [ {
          "type" : [ "h-card" ],
          "properties" : {
            "name" : [ "b-loved dreamer" ],
            "url" : [ "https://mastodon.online/@mrzool" ]
          },
          "lang" : "en-US",
          "value" : "b-loved dreamer"
        } ]
      },
      "id" : "comment-2893566",
      "lang" : "en-US",
      "value" : "♻️ b-loved dreamer"
    } ]
  },
  "lang" : "en-US",
  "children" : [ {
    "type" : [ "h-card" ],
    "properties" : {
      "name" : [ "Ryan Barrett" ],
      "locality" : [ "San Francisco" ],
      "region" : [ "California" ],
      "url" : [ "https://snarfed.org/about", "https://snarfed.org/about" ],
      "uid" : [ "https://snarfed.org/about", "https://snarfed.org/about" ],
      "photo" : [ {
        "value" : "https://snarfed.org/ryan_profile_medium.jpg",
        "alt" : "Ryan"
      } ],
      "email" : [ "mailto:public@ryanb.org" ],
      "key" : [ "https://snarfed.org/pubkey.txt" ],
      "featured" : [ "https://snarfed.org/w/wp-content/uploads/2013/06/copy-cropped-iraq_bar.jpg" ]
    },
    "lang" : "en-US"
  } ]
}
