{
  "type" : [ "h-entry" ],
  "properties" : {
    "name" : [ "Taylor Barnett-Torabi (@taylor_atx@hachyderm.io)" ],
    "summary" : [ "Content warning: dhh and transphobia" ],
    "url" : [ "https://hachyderm.io/@taylor_atx/112213026558936676" ]
  }
}
