{
  "type" : [ "h-entry" ],
  "properties" : {
    "name" : [ "SQLite Studio is a SQLite Database Explorer - Laravel News" ],
    "summary" : [ "SQLite Studio is a single-file binary, single-command SQLite database explorer." ],
    "featured" : [ "https://picperf.io/https://laravelnews.s3.amazonaws.com/featured-images/sqlite-studio-featured.png" ],
    "url" : [ "https://laravel-news.com/sqlite-studio" ]
  }
}
