{
  "type" : [ "h-entry" ],
  "properties" : {
    "name" : [ "Apple Annie :prami_santa: (@anniegreens@social.lol)" ],
    "summary" : [ "💻 Amazing number of people in my timeline just on their computer tonight working on their blogs. That’s 💯 my jam! Happy New Year!" ],
    "url" : [ "https://social.lol/@anniegreens/111677993690094477" ]
  }
}
