{
  "type" : [ "h-entry" ],
  "properties" : {
    "name" : [ "Simon Willison (@simon@simonwillison.net)" ],
    "summary" : [ "This is the 22nd talk I've published in the annotated format - here's my full collection https://simonwillison.net/tags/annotated-talks/\n\nI wrote about the tools I use to put these together here: https://simonwillison.net/2023/Aug/6/annotated-presentations/" ],
    "url" : [ "https://fedi.simonwillison.net/@simon/112786489485348735" ]
  }
}
