{
  "type" : [ "h-entry" ],
  "properties" : {
    "name" : [ "We've received a letter about you" ],
    "category" : [ "retropost", "work" ],
    "url" : [ "https://shkspr.mobi/blog/2024/07/weve-received-a-letter-about-you/" ],
    "published" : [ "2024-07-03" ],
    "updated" : [ "2024-07-03" ],
    "author" : [ {
      "type" : [ "h-card" ],
      "properties" : {
        "name" : [ "@edent" ],
        "photo" : [ {
          "value" : "https://shkspr.mobi/apple-touch-icon.png",
          "alt" : ""
        } ]
      },
      "lang" : "en-GB",
      "value" : "@edent"
    } ]
  },
  "lang" : "en-GB"
}
