{
  "type" : [ "h-entry" ],
  "properties" : {
    "name" : [ "Good news and musings around a rapidly changing self" ],
    "summary" : [ "Placement aside, I both laugh and shake (a bit) about how often I think about the future. That of this newsletter, of my role at my current job, of the..." ],
    "featured" : [ "https://assets.buttondown.email/images/eba6a358-6d4a-4127-9e67-e21dc84bdf84.png?w=960&fit=max" ],
    "url" : [ "https://buttondown.email/jackyalcine/archive/good-news-and-musings-around-a-rapidly-changing/" ]
  }
}
