{
  "type" : [ "h-entry" ],
  "properties" : {
    "name" : [ "Dependency Management Data (@DependencyManagementData@botsin.space)" ],
    "summary" : [ "Dependency Management Data vv0.101.0 is out 🚀\n\n\n\nCheck out the release notes at https://gitlab.com/tanna.dev/dependency-management-data/-/releases/v0.101.0" ],
    "url" : [ "https://botsin.space/@DependencyManagementData/112786596143373914" ]
  }
}
