{
  "type" : [ "h-entry" ],
  "properties" : {
    "name" : [ "Carol 🪩 (@carol@social.lol)" ],
    "summary" : [ "@www.jvt.me@www.jvt.me how did you find tenet?" ],
    "url" : [ "https://social.lol/@carol/112256766264166763" ]
  }
}
