{
  "type" : [ "h-entry" ],
  "properties" : {
    "name" : [ "Jeff Atwood (@codinghorror@infosec.exchange)" ],
    "summary" : [ "In a perfect world, we wouldn’t need utopias" ],
    "url" : [ "https://infosec.exchange/@codinghorror/112859605445846878" ]
  }
}
