{
  "type" : [ "h-entry" ],
  "properties" : {
    "name" : [ "Developers Developers Developers @ London · Luma" ],
    "summary" : [ "Developers Developers Developers is a new event for startup founders, builders, and investors focused on creating tools and products for developers. If you’re…" ],
    "featured" : [ "https://social-images.lu.ma/cdn-cgi/image/format=auto,fit=cover,dpr=1,anim=false,background=white,quality=75,width=800,height=419/api/event-one?calendar_avatar=https%3A%2F%2Fcdn.lu.ma%2Favatars-default%2Fcommunity_avatar_3.png&calendar_name&color0=%23336a9b&color1=%23869cdf&color2=%238b6655&color3=%23e6f1f7&host_avatar=https%3A%2F%2Fimages.lumacdn.com%2Favatars%2Fqh%2F5c828fc5-7e11-44b5-88d3-a1356f05ef49.jpg&host_name=Kenneth%20Auchenberg&img=https%3A%2F%2Fimages.lumacdn.com%2Fevent-covers%2Fmb%2F1e7ec904-9fb9-484f-9ffe-36f0717d8f58.gif&name=Developers%20Developers%20Developers%20%40%20London" ],
    "url" : [ "https://lu.ma/fydqvtm0" ]
  }
}
