{
  "type" : [ "h-entry" ],
  "properties" : {
    "name" : [ "Sit N. Spinster (@sitnspinster.bsky.social)" ],
    "featured" : [ "https://cdn.bsky.app/img/feed_thumbnail/plain/did:plc:ww2tk3m7szundof5cykhgt6l/bafkreiemafpdqtzufeywon3cmwgt3jysz6gwwowbnhohbxwdrzizkfck34@jpeg" ],
    "url" : [ "https://bsky.app/profile/sitnspinster.bsky.social/post/3ljbeyf2cd226" ],
    "published" : [ "2025-02-28T21:46:23.662Z" ]
  }
}
