{
  "type" : [ "h-entry" ],
  "properties" : {
    "name" : [ "Cole Peters (@colepeters@mastodon.online)" ],
    "summary" : [ "Attached: 1 image\n\n.@brianleroux@indieweb.social posted this on Discord a little while back and I'm still deceased over it \n\n#shogun #typography" ],
    "featured" : [ "https://files.mastodon.online/media_attachments/files/112/394/935/530/002/405/original/f4083d2f9b4dc0c1.png" ],
    "url" : [ "https://mastodon.online/@colepeters/112394935800430714" ]
  }
}
