{
  "type" : [ "h-entry" ],
  "properties" : {
    "name" : [ "Amazon&#39;s silent sacking" ],
    "summary" : [ "Justin Garrison joins us to talk about Amazon’s silent sacking, from his perspective. He should know. He works there. Well, as of yesterday he quit. We discuss how the cloud and Kubernetes have transformed the way software is developed and deployed, the impact silent layoffs have on employees and their careers, speakin..." ],
    "featured" : [ "https://cdn.changelog.com/uploads/icons/topics/YNg/icon_large.png?v=63751584584" ],
    "url" : [ "https://changelog.com/news/amazons-silent-sacking-X2o2" ]
  }
}
