{
  "type" : [ "h-entry" ],
  "properties" : {
    "name" : [ "Matt Brunt (@brunty@brunty.social)" ],
    "summary" : [ "Being in a shitty place with my mental health is really showing me that I have amazing people in my life that love me and stick by me and make the time for me.\n\nFeeling grateful and I love my friends and family <3" ],
    "url" : [ "https://brunty.social/@brunty/112073734267326983" ]
  }
}
