{
  "type" : [ "h-entry" ],
  "properties" : {
    "name" : [ "Building an API is half the battle (Ep. 558) - Stack Overflow" ],
    "featured" : [ "https://cdn.stackoverflow.co/images/jo7n4k8s/production/472725c034235a56301dc8caf0ed41b3d298c57a-1200x630.png?w=1200&fm=png&auto=format" ],
    "url" : [ "https://stackoverflow.blog/2023/04/07/building-an-api-is-half-the-battle-ep-552/" ]
  }
}
