{
  "type" : [ "h-entry" ],
  "properties" : {
    "name" : [ "Josh Simmons (@josh@josh.tel)" ],
    "summary" : [ "Happy #BiVisibilityDay! I always take the opportunity to remind folks I'm bi because, if I don't, people make assumptions.\n\nYou can be in a hetero relationship and be bi. You can be same-sex relationship and be bi.\n\nThe distinction matters because bi folks face unique challenges. And, while research seems to indicate most people are bi (!!!), many people are afraid to come out because of the stigma.\n\nI'm here to tell you it's never too late to come out. Even if you're in a stable relationship, being closeted causes you harm.\n\nDo yourself a favor and join us in the sun ❤️💜💙 We'll be here to support you.\n\n#BiPride #Queer #LGBTQ #NotGayButGayIsOK" ],
    "url" : [ "https://josh.tel/@josh/113186035847720752" ]
  }
}
