{
  "type" : [ "h-card" ],
  "properties" : {
    "name" : [ "Marcus Rohrmoser 🌻" ],
    "photo" : [ {
      "value" : "https://digitalcourage.social/system/accounts/avatars/108/050/262/287/113/206/original/c152bff1a001819f.jpg",
      "alt" : ""
    } ],
    "url" : [ "https://digitalcourage.social/@mro" ]
  },
  "lang" : "en-GB"
}
