{
  "type" : [ "h-entry" ],
  "properties" : {
    "name" : [ "Andrew (festive) (@ajroach42@retro.social)" ],
    "summary" : [ "What? Forcing people to return to office was never about productivity and was always about power? \n\nhttps://fortune.com/2024/01/13/managers-scapegoating-workers-return-to-office/" ],
    "url" : [ "https://retro.social/@ajroach42/111777590802089571" ]
  }
}
