{
  "type" : [ "h-entry" ],
  "properties" : {
    "name" : [ "Test Double (@testdouble@mastodon.social)" ],
    "summary" : [ "Attached: 4 images\n\nSpotify Wrapped: Debugging, scope creep, and ‘it depends’ edition." ],
    "featured" : [ "https://files.mastodon.social/media_attachments/files/113/601/114/158/997/736/original/30a43382c58e06ec.png" ],
    "url" : [ "https://mastodon.social/@testdouble/113601114428640773" ]
  }
}
