{
  "type" : [ "h-entry" ],
  "properties" : {
    "name" : [ "Josh Simmons (@josh@josh.tel)" ],
    "summary" : [ "Last summer I started to get clued in to how colonialism manifests in domain names, so I began to let a number of \"my\" domain names lapse.\n\nOne hadn't expired yet... but its time has come. This morning:\n\n> Afghanistan ccTLD Network Information Center ( af NIC )\n\n> inclusive.af has been suspended in the registry and will no longer be included in zone file generation.  This means that any services connected with this domain, such as websites or email addresses will cease working shortly." ],
    "url" : [ "https://josh.tel/@josh/111920059997997657" ]
  }
}
