{
  "type" : [ "h-entry" ],
  "properties" : {
    "name" : [ "Infosec & OpenTelemetry with Austin Parker (Ship It! #128)" ],
    "summary" : [ "Maybe Jira for your kids' chores is a good idea... Probably not." ],
    "featured" : [ "https://snap.fly.dev/shipit/128/img" ],
    "audio" : [ "https://op3.dev/e/https://cdn.changelog.com/uploads/shipit/128/ship-it-128.mp3" ],
    "url" : [ "https://changelog.com/shipit/128" ]
  }
}
