{
  "type" : [ "h-entry" ],
  "properties" : {
    "name" : [ "Ed :spaghettiCode: (@spaghetticode@androiddev.social)" ],
    "summary" : [ "Wishing those celebrating today a very Merry Christmas 🎄🎁 \n\nNow I can start looking forward to a very exciting 2025 👀 Watch this space..." ],
    "url" : [ "https://androiddev.social/@spaghetticode/113712685995924507" ]
  }
}
