{
  "type" : [ "h-entry" ],
  "properties" : {
    "name" : [ "Jennifer Riggins (@jkriggins@hachyderm.io)" ],
    "summary" : [ "Whoops I forgot about this medium again…" ],
    "url" : [ "https://hachyderm.io/@jkriggins/112045240294155164" ]
  }
}
