{
  "type" : [ "h-entry" ],
  "properties" : {
    "name" : [ " Fleet, Open Source, and Osquery with Zach Wasserman - Ardan Labs Podcast" ],
    "summary" : [ "Join us in this episode as we delve into the world of open-source device management with Zach Wasserman. Zach is the cofounder and Tech Evangelist of Fleet, where he works to unlock the full potential of osquery for both enterprise and open-source..." ],
    "featured" : [ "https://www.buzzsprout.com/rails/active_storage/representations/redirect/eyJfcmFpbHMiOnsibWVzc2FnZSI6IkJBaHBCQ3Nqa0FFPSIsImV4cCI6bnVsbCwicHVyIjoiYmxvYl9pZCJ9fQ==--cba3092cb146ac81b441b3141d0fd9a0da97f518/eyJfcmFpbHMiOnsibWVzc2FnZSI6IkJBaDdDVG9MWm05eWJXRjBPZ2hxY0djNkUzSmxjMmw2WlY5MGIxOW1hV3hzV3docEFmcHBBZnA3QmpvSlkzSnZjRG9MWTJWdWRISmxPZ3B6WVhabGNuc0dPZ3h4ZFdGc2FYUjVhVUU2RUdOdmJHOTFjbk53WVdObFNTSUpjM0puWWdZNkJrVlUiLCJleHAiOm51bGwsInB1ciI6InZhcmlhdGlvbiJ9fQ==--bfdad5b04912fa8a9db85eb3989e46c5908e2723/al-podcast-avatar.jpg" ],
    "audio" : [ "https://www.buzzsprout.com/1466944/15427033-fleet-open-source-and-osquery-with-zach-wasserman.mp3?referrer=https%3A%2F%2Fardanlabs.buzzsprout.com%2F1466944%2F15427033" ],
    "url" : [ "https://www.buzzsprout.com/1466944/15427033" ]
  }
}
