{
  "type" : [ "h-entry" ],
  "properties" : {
    "name" : [ "Hosting Hachyderm with Preston Doster (Ship It! #130)" ],
    "summary" : [ "Preston Doster joins the show to tell us what it takes to run a Mastodon server with 55,000 accounts and 11,000 monthly active users." ],
    "featured" : [ "https://snap.fly.dev/shipit/130/img" ],
    "audio" : [ "https://op3.dev/e/https://cdn.changelog.com/uploads/shipit/130/ship-it-130.mp3" ],
    "url" : [ "https://changelog.com/shipit/130" ]
  }
}
