{
  "type" : [ "h-entry" ],
  "properties" : {
    "name" : [ "Luna (@luna@pony.social)" ],
    "summary" : [ "“so we can use createElement and appendChild to give the DOM a new <sub>…”" ],
    "url" : [ "https://pony.social/@luna/112000446841851266" ]
  }
}
