{
  "type" : [ "h-entry" ],
  "properties" : {
    "name" : [ "daniel:// stenberg:// (@bagder@mastodon.social)" ],
    "summary" : [ "Out of the 561,454 projects OpenSSF has listed in their criticality_score project, for which they generate a \"criticality score\" for each single one, a certain hobby project is currently clocking in as number 100. (yeah, I mean #curl)\n\nhttps://github.com/ossf/criticality_score" ],
    "url" : [ "https://mastodon.social/@bagder/113600850414377265" ]
  }
}
