{
  "type" : [ "h-card" ],
  "properties" : {
    "name" : [ "Eva Lauren Kelly" ],
    "photo" : [ {
      "value" : "https://secure.gravatar.com/avatar/9200e246563a3a3b461b24914650e540?s=64&d=mm&r=x",
      "alt" : ""
    } ],
    "url" : [ "https://glauca.space/@eval" ]
  },
  "lang" : "en-GB"
}
