{
  "type" : [ "h-entry" ],
  "properties" : {
    "name" : [ "David G. Simmons (@davidgs@tty0.social)" ],
    "summary" : [ "Trying to set up my own Short Link service but ... finding one that actually works is a nightmare. \n- YOURLS: Got it set up, doesn't redirect.\n- Kutt: can't get it to run at all.\n- reduced.to: Runs, looks great, fails to create accounts\n\nAny other suggestions?" ],
    "url" : [ "https://tty0.social/@davidgs/111681938774357540" ]
  }
}
