{
  "type" : [ "h-entry" ],
  "properties" : {
    "name" : [ "Why some DVLA digital services don't work at night" ],
    "summary" : [ "Every few months or so, somebody asks on social media why a particular DVLA digital service is turned off over night. Rather than answering it every time, I’ve decided to write this post, so I can point people at it in future. It’s a great case study to show why making government services digitally native can be quite complicated." ],
    "featured" : [ "https://dafyddvaughan.uk/blog/2025/why-some-dvla-digital-services-dont-work-at-night/service-unavailable.jpg" ],
    "url" : [ "https://dafyddvaughan.uk/blog/2025/why-some-dvla-digital-services-dont-work-at-night/" ],
    "published" : [ "2025-01-12T19:35:00+00:00" ]
  }
}
