{
  "type" : [ "h-entry" ],
  "properties" : {
    "name" : [ "Dan Hon (@danhon@dan.mastohon.com)" ],
    "summary" : [ "Attached: 1 image\n\nthe whole purpose of the post-menopausal woman is to prevent the rise of generative AI" ],
    "featured" : [ "https://cdn.masto.host/danmastohoncom/media_attachments/files/112/968/427/784/164/194/original/77ef7df622e128ef.jpeg" ],
    "url" : [ "https://dan.mastohon.com/@danhon/112968428186404991" ]
  }
}
