{
  "type" : [ "h-entry" ],
  "properties" : {
    "name" : [ "Scott Williams 🐧 (@vwbusguy@mastodon.online)" ],
    "summary" : [ "Source Available != Open Source\n\nThat's not an opinion.  If it's SSPL, BUSL, etc., it's categorically not \"open source\" according to the Open Source Definition." ],
    "url" : [ "https://mastodon.online/@vwbusguy/112141716116440865" ]
  }
}
