{
  "type" : [ "h-entry" ],
  "properties" : {
    "name" : [ "tante (@tante@tldr.nettime.org)" ],
    "summary" : [ "No CEO _has to_ congratulate a new president. But Nadella knows where the profits are. https://tane.codes/@tanepiper/113437313727553429" ],
    "url" : [ "https://tldr.nettime.org/@tante/113437332755588757" ]
  }
}
