{
  "type" : [ "h-entry" ],
  "properties" : {
    "name" : [ "Cindy Weinstein (@cindyweinstein@mastodon.world)" ],
    "summary" : [ "Attached: 1 image\n\n#AI" ],
    "featured" : [ "https://s3.eu-central-2.wasabisys.com/mastodonworld/media_attachments/files/112/468/607/654/173/278/original/cc3febf57abfae21.png" ],
    "url" : [ "https://mastodon.world/@cindyweinstein/112468609914746468" ]
  }
}
