{
  "type" : [ "h-entry" ],
  "properties" : {
    "name" : [ "Alexandra Magin 🏳️‍🌈 (@recursive@hachyderm.io)" ],
    "summary" : [ "For me, transition wasn't simply fixing the pain, it was finding a way to become a person who can celebrate the joy and gratitude of being alive" ],
    "url" : [ "https://hachyderm.io/@recursive/112981112287349720" ]
  }
}
