{
  "type" : [ "h-entry" ],
  "properties" : {
    "name" : [ "a hermit for hire :snufkin:🐿 (@ahermitforhire@pagan.plus)" ],
    "summary" : [ "rage, rage against the dying of the weekend" ],
    "featured" : [ "https://sb-pagan-plus.b-cdn.net/accounts/avatars/108/263/626/129/564/763/original/60411ba5ea1c0f20.jpeg" ],
    "url" : [ "https://pagan.plus/@ahermitforhire/112550786323194711" ]
  }
}
