{
  "type" : [ "h-entry" ],
  "properties" : {
    "name" : [ "Anders Eknert (@anderseknert@hachyderm.io)" ],
    "summary" : [ "Seems to be massive disconnect between the #AI hype pushed in the #KubeCon key notes vs. what the audience actually cares about. I don’t think I ever heard this many people complaining about them in the past." ],
    "url" : [ "https://hachyderm.io/@anderseknert/112128401229129873" ]
  }
}
