{
  "type" : [ "h-entry" ],
  "properties" : {
    "name" : [ "Daria J. (@0xdariaj@tenforward.social)" ],
    "summary" : [ "@www.jvt.me@www.jvt.me I’ve sent an email to your colleague from Elastic HR on Wednesday evening CET. No answer from them since." ],
    "url" : [ "https://tenforward.social/@0xdariaj/111867048825699834" ]
  }
}
