{
  "type" : [ "h-card" ],
  "properties" : {
    "name" : [ "Dr David Mills" ],
    "photo" : [ {
      "value" : "https://files.mastodon.social/accounts/avatars/000/026/906/original/56758ae55ca31198.png",
      "alt" : ""
    } ],
    "url" : [ "https://mastodon.social/@Dtl" ]
  },
  "lang" : "en-GB"
}
