{
  "type" : [ "h-entry" ],
  "properties" : {
    "name" : [ "Conny Duck (@ConnyDuck@chaos.social)" ],
    "summary" : [ "Fresh new OSS Hell just dropped https://github.com/spring-projects/spring-boot/pull/39754/" ],
    "url" : [ "https://chaos.social/@ConnyDuck/112002532505136994" ]
  }
}
