{
  "type" : [ "h-entry" ],
  "properties" : {
    "name" : [ "Jed Schmidt (@jed@mastodon.social)" ],
    "summary" : [ "@simon@simonwillison.net ironic that redis the color of deletion." ],
    "url" : [ "https://mastodon.social/@jed/112131387744960989" ]
  }
}
