{
  "type" : [ "h-entry" ],
  "properties" : {
    "name" : [ "UkeBLCatboy (@UkeBLCatboy@mastodon.social)" ],
    "summary" : [ "@jakehamilton@hachyderm.io Wait no, it must be the <genderFLUID> agenda!" ],
    "url" : [ "https://mastodon.social/@UkeBLCatboy/111976430284630498" ]
  }
}
