{
  "type" : [ "h-entry" ],
  "properties" : {
    "name" : [ "Fork Around And Find Out | Making the World a More Secure Place with Yasmin Abdi" ],
    "summary" : [ "Data and security breaches are a dime a dozen nowadays, and despite their frequency, they’re still just as dangerous. That’s where Yasmin Abdi, the CEO of noHack, comes in. Despite her relatively short career, she’s already worked for some of the giants of the tech industry like Google and..." ],
    "featured" : [ "https://img.transistor.fm/dc5iiEaEoTHSnz0BfsYYnfrLo_Bm0cP90nQ0hAZ0Y3c/rs:fill:800:800:1/q:60/aHR0cHM6Ly9pbWct/dXBsb2FkLXByb2R1/Y3Rpb24udHJhbnNp/c3Rvci5mbS9hMTMz/N2NlMmM4YzU2NTU4/Yjc1MzQyMjk3M2Mx/MmQ3OC5wbmc.webp" ],
    "audio" : [ "https://media.transistor.fm/dc81db9f/e5cde84b.mp3" ],
    "url" : [ "https://share.transistor.fm/s/dc81db9f" ]
  }
}
