{
  "type" : [ "h-entry" ],
  "properties" : {
    "name" : [ "What's new with GrimoireLab, the open-source community analytics platform" ],
    "summary" : [ "In this episode, host Georg Link is joined by guests Courtney Robertson and Santiago (Santi) Dueñas to discuss the latest updates and future directions of GrimoireLab, an open-source tool designed to analyze community health metrics. They dive into how GrimoireLab originated, its current usage, and how organizations like WordPress and Bitergia are utilizing it for community contribution tracking. They explore the challenges of scaling the tool and the needs for further automation and data source integration. Courtney shares insights on how WordPress uses GrimoireLab to track contributors, improve sustainability, and automate reporting, while Santi explains the technical evolution of GrimoireLab, including moving to OpenSearch and improving database performance. Hit download now to hear more! " ],
    "featured" : [ "https://media24.fireside.fm/file/fireside-images-2024/podcasts/images/f/f5b24404-14da-4b82-8a25-6de95d2b991b/episodes/2/20325f0e-8e0b-4187-b224-efcb5e28f437/cover_medium.jpg?v=1" ],
    "audio" : [ "https://aphid.fireside.fm/d/1437767933/f5b24404-14da-4b82-8a25-6de95d2b991b/20325f0e-8e0b-4187-b224-efcb5e28f437.mp3" ],
    "author" : [ {
      "type" : [ "h-card" ],
      "properties" : {
        "name" : [ "CHAOSS Project" ]
      }
    } ],
    "url" : [ "https://podcast.chaoss.community/96" ]
  }
}
