{
  "type" : [ "h-card" ],
  "properties" : {
    "name" : [ "Esko Reinikainen" ],
    "photo" : [ {
      "value" : "https://cdn.bsky.app/img/avatar/plain/did:plc:enjvcyspmbqont5yyvelmctd/bafkreihetbpgmfp3eaauxz6zvvurcuvbwi6p326rg7jam2rc2txkyil3vi@jpeg",
      "alt" : ""
    } ],
    "url" : [ "https://bsky.app/profile/reinikainen.bsky.social/post/3ldlrluwmsk2f" ]
  },
  "lang" : "en-GB"
}
