{
  "type" : [ "h-entry" ],
  "properties" : {
    "name" : [ "Dgar (@dgar@aus.social)" ],
    "summary" : [ "Attached: 1 image" ],
    "featured" : [ "https://mediacdn.aus.social/media_attachments/files/112/120/728/172/037/889/original/e9b2e8727d06d218.jpeg" ],
    "url" : [ "https://aus.social/@dgar/112120734894651225" ]
  }
}
