{
  "type" : [ "h-entry" ],
  "properties" : {
    "name" : [ "cathos (@cathos@merveilles.town)" ],
    "summary" : [ "Maintenance is more important than innovation. \n\nThis xz debacle is a symptom of a system that prioritizes lots of things above maintenance. \n\nTake this as a reminder to rest, to mend things & pay attention to what needs mending in yourself. Do the radical thing of working slowly and making all things more whole." ],
    "featured" : [ "https://assets.merveilles.town/accounts/avatars/109/372/536/755/765/977/original/668761cee59a37bb.jpg" ],
    "url" : [ "https://merveilles.town/@cathos/112185324648636707" ]
  }
}
