{
  "type" : [ "h-entry" ],
  "properties" : {
    "name" : [ "Lockdownyourlife (@Lockdownyourlife@infosec.exchange)" ],
    "summary" : [ "Attached: 1 image\n\nIt's June 1st, stay strapped y'all.\n\n#pridemonth #pride #lgbtqia #safety #security" ],
    "featured" : [ "https://media.infosec.exchange/infosec.exchange/media_attachments/files/112/544/215/375/329/454/original/d5e1989db535f159.jpg" ],
    "url" : [ "https://infosec.exchange/@Lockdownyourlife/112544218117916360" ]
  }
}
