{
  "type" : [ "h-entry" ],
  "properties" : {
    "name" : [ "Matt Brunt (@brunty@brunty.social)" ],
    "summary" : [ "I heard a great joke today\n\nWhat's the difference between a hedgehog and a Range Rover?\n\nWell with a hedgehog the pricks are on the outside." ],
    "url" : [ "https://brunty.social/@brunty/111731028243268775" ]
  }
}
