{
  "type" : [ "h-entry" ],
  "properties" : {
    "name" : [ "" ],
    "url" : [ "https://snarfed.org/2024-08-27_53626" ],
    "syndication" : [ "https://bsky.app/profile/snarfed.org/post/3l2qtlkjbd227", "https://bsky.app/profile/snarfed.org/post/3l2qtlkjbd227" ],
    "published" : [ "2024-08-27T21:03:51-07:00", "2024-08-28T01:24:13-07:00" ],
    "content" : [ {
      "html" : "<div class=\"wp-block-jetpack-markdown\">\n<p>The <a href=\"https://fieldnotesbrand.com/\">Field Notes</a> motto:</p>\n<blockquote>\n<p>I’m not writing it down to remember it later, I’m writing it down to remember it now.</p>\n</blockquote>\n</div>",
      "value" : "The Field Notes motto:\nI’m not writing it down to remember it later, I’m writing it down to remember it now.",
      "lang" : "en-US"
    } ],
    "author" : [ {
      "type" : [ "h-card" ],
      "properties" : {
        "name" : [ "Ryan Barrett" ],
        "photo" : [ {
          "value" : "https://secure.gravatar.com/avatar/947b5f3f323da0ef785b6f02d9c265d6?s=96&d=blank&r=g",
          "alt" : ""
        } ],
        "url" : [ "https://snarfed.org/" ]
      },
      "lang" : "en-US",
      "value" : "Ryan Barrett"
    }, {
      "type" : [ "h-card" ],
      "properties" : {
        "name" : [ "Remus" ],
        "url" : [ "https://chaos.social/@ikonoklast" ]
      },
      "lang" : "en-US",
      "value" : "Remus"
    } ],
    "like" : [ {
      "type" : [ "h-cite" ],
      "properties" : {
        "author" : [ {
          "type" : [ "h-card" ],
          "properties" : {
            "name" : [ "Spencer Bittle" ],
            "url" : [ "https://bsky.app/profile/ssbittle.work" ]
          },
          "lang" : "en-US",
          "value" : "Spencer Bittle"
        } ]
      },
      "id" : "comment-2887500",
      "lang" : "en-US",
      "value" : "👍 Spencer Bittle"
    }, {
      "type" : [ "h-cite" ],
      "properties" : {
        "author" : [ {
          "type" : [ "h-card" ],
          "properties" : {
            "name" : [ "devin ivy 🐋" ],
            "url" : [ "https://bsky.app/profile/divy.zone" ]
          },
          "lang" : "en-US",
          "value" : "devin ivy 🐋"
        } ]
      },
      "id" : "comment-2887436",
      "lang" : "en-US",
      "value" : "👍 devin ivy 🐋"
    }, {
      "type" : [ "h-cite" ],
      "properties" : {
        "author" : [ {
          "type" : [ "h-card" ],
          "properties" : {
            "name" : [ "maegul" ],
            "url" : [ "https://bsky.app/profile/maegul.net" ]
          },
          "lang" : "en-US",
          "value" : "maegul"
        } ]
      },
      "id" : "comment-2887410",
      "lang" : "en-US",
      "value" : "👍 maegul"
    }, {
      "type" : [ "h-cite" ],
      "properties" : {
        "author" : [ {
          "type" : [ "h-card" ],
          "properties" : {
            "name" : [ "Olly Headey" ],
            "url" : [ "https://bsky.app/profile/olly.world" ]
          },
          "lang" : "en-US",
          "value" : "Olly Headey"
        } ]
      },
      "id" : "comment-2887409",
      "lang" : "en-US",
      "value" : "👍 Olly Headey"
    }, {
      "type" : [ "h-cite" ],
      "properties" : {
        "author" : [ {
          "type" : [ "h-card" ],
          "properties" : {
            "name" : [ "Sia Karamalegos" ],
            "url" : [ "https://bsky.app/profile/sia.codes" ]
          },
          "lang" : "en-US",
          "value" : "Sia Karamalegos"
        } ]
      },
      "id" : "comment-2887407",
      "lang" : "en-US",
      "value" : "👍 Sia Karamalegos"
    }, {
      "type" : [ "h-cite" ],
      "properties" : {
        "author" : [ {
          "type" : [ "h-card" ],
          "properties" : {
            "name" : [ "David Schlaepfer" ],
            "url" : [ "https://bsky.app/profile/davids.sfba.social.ap.brid.gy" ]
          },
          "lang" : "en-US",
          "value" : "David Schlaepfer"
        } ]
      },
      "id" : "comment-2887402",
      "lang" : "en-US",
      "value" : "👍 David Schlaepfer"
    }, {
      "type" : [ "h-cite" ],
      "properties" : {
        "author" : [ {
          "type" : [ "h-card" ],
          "properties" : {
            "name" : [ "Adnan" ],
            "url" : [ "https://bsky.app/profile/adnan.social" ]
          },
          "lang" : "en-US",
          "value" : "Adnan"
        } ]
      },
      "id" : "comment-2887401",
      "lang" : "en-US",
      "value" : "👍 Adnan"
    }, {
      "type" : [ "h-cite" ],
      "properties" : {
        "author" : [ {
          "type" : [ "h-card" ],
          "properties" : {
            "name" : [ "Thibault Le Ouay Ducasse" ],
            "url" : [ "https://bsky.app/profile/thibaultleouay.dev" ]
          },
          "lang" : "en-US",
          "value" : "Thibault Le Ouay Ducasse"
        } ]
      },
      "id" : "comment-2887398",
      "lang" : "en-US",
      "value" : "👍 Thibault Le Ouay Ducasse"
    }, {
      "type" : [ "h-cite" ],
      "properties" : {
        "author" : [ {
          "type" : [ "h-card" ],
          "properties" : {
            "name" : [ "Remus" ],
            "url" : [ "https://chaos.social/@ikonoklast" ]
          },
          "lang" : "en-US",
          "value" : "Remus"
        } ]
      },
      "id" : "comment-2887397",
      "lang" : "en-US",
      "value" : "👍 Remus"
    }, {
      "type" : [ "h-cite" ],
      "properties" : {
        "author" : [ {
          "type" : [ "h-card" ],
          "properties" : {
            "name" : [ "DontMakeMoi" ],
            "url" : [ "https://bsky.app/profile/dontmakemoi.bsky.social" ]
          },
          "lang" : "en-US",
          "value" : "DontMakeMoi"
        } ]
      },
      "id" : "comment-2887390",
      "lang" : "en-US",
      "value" : "👍 DontMakeMoi"
    }, {
      "type" : [ "h-cite" ],
      "properties" : {
        "author" : [ {
          "type" : [ "h-card" ],
          "properties" : {
            "name" : [ "Dominik" ],
            "url" : [ "https://mastodon.design/@dominik" ]
          },
          "lang" : "en-US",
          "value" : "Dominik"
        } ]
      },
      "id" : "comment-2887389",
      "lang" : "en-US",
      "value" : "👍 Dominik"
    }, {
      "type" : [ "h-cite" ],
      "properties" : {
        "author" : [ {
          "type" : [ "h-card" ],
          "properties" : {
            "name" : [ "David B. Himself" ],
            "url" : [ "https://bsky.app/profile/davidbhimself.online" ]
          },
          "lang" : "en-US",
          "value" : "David B. Himself"
        } ]
      },
      "id" : "comment-2887388",
      "lang" : "en-US",
      "value" : "👍 David B. Himself"
    }, {
      "type" : [ "h-cite" ],
      "properties" : {
        "author" : [ {
          "type" : [ "h-card" ],
          "properties" : {
            "name" : [ "maegul" ],
            "url" : [ "https://hachyderm.io/@maegul" ]
          },
          "lang" : "en-US",
          "value" : "maegul"
        } ]
      },
      "id" : "comment-2887385",
      "lang" : "en-US",
      "value" : "👍 maegul"
    }, {
      "type" : [ "h-cite" ],
      "properties" : {
        "author" : [ {
          "type" : [ "h-card" ],
          "properties" : {
            "name" : [ "Hilary Baumann 💻 🥃☕️" ],
            "url" : [ "https://bsky.app/profile/hilarybaumann.com" ]
          },
          "lang" : "en-US",
          "value" : "Hilary Baumann 💻 🥃☕️"
        } ]
      },
      "id" : "comment-2887383",
      "lang" : "en-US",
      "value" : "👍 Hilary Baumann 💻 🥃☕️"
    }, {
      "type" : [ "h-cite" ],
      "properties" : {
        "author" : [ {
          "type" : [ "h-card" ],
          "properties" : {
            "name" : [ "Fat, Bald Dabus" ],
            "url" : [ "https://bsky.app/profile/bleats.by86400.today" ]
          },
          "lang" : "en-US",
          "value" : "Fat, Bald Dabus"
        } ]
      },
      "id" : "comment-2887384",
      "lang" : "en-US",
      "value" : "👍 Fat, Bald Dabus"
    } ],
    "repost" : [ {
      "type" : [ "h-cite" ],
      "properties" : {
        "author" : [ {
          "type" : [ "h-card" ],
          "properties" : {
            "name" : [ "maegul" ],
            "url" : [ "https://hachyderm.io/@maegul" ]
          },
          "lang" : "en-US",
          "value" : "maegul"
        } ]
      },
      "id" : "comment-2887386",
      "lang" : "en-US",
      "value" : "♻️ maegul"
    } ]
  },
  "lang" : "en-US",
  "children" : [ {
    "type" : [ "h-card" ],
    "properties" : {
      "name" : [ "Ryan Barrett" ],
      "locality" : [ "San Francisco" ],
      "region" : [ "California" ],
      "url" : [ "https://snarfed.org/about", "https://snarfed.org/about" ],
      "uid" : [ "https://snarfed.org/about", "https://snarfed.org/about" ],
      "photo" : [ {
        "value" : "https://snarfed.org/ryan_profile_medium.jpg",
        "alt" : "Ryan"
      } ],
      "email" : [ "mailto:public@ryanb.org" ],
      "key" : [ "https://snarfed.org/pubkey.txt" ],
      "featured" : [ "https://snarfed.org/w/wp-content/uploads/2013/06/copy-cropped-iraq_bar.jpg" ]
    },
    "lang" : "en-US"
  } ]
}
