{
  "type" : [ "h-entry" ],
  "properties" : {
    "name" : [ "Jim Naureckas (@Naureckas@mastodon.world)" ],
    "summary" : [ "If your enemy is literally hiding behind children, you don't say, \"My enemy made me kill children.\" You say, \"I couldn't kill my enemy, because there were children in the way.\"\n\nUnless, of course, you don't think the children are really human in the way that your children are human." ],
    "url" : [ "https://mastodon.world/@Naureckas/112297995495402417" ]
  }
}
