{
  "type" : [ "h-entry" ],
  "properties" : {
    "name" : [ "ThatSexToyGuy (@hungry_joe@mas.to)" ],
    "summary" : [ "it's only erotic if it's from the Eroti region of Italy, otherwise it's just fizzy porn" ],
    "url" : [ "https://mas.to/@hungry_joe/113638370433623118" ]
  }
}
