{
  "type" : [ "h-entry" ],
  "properties" : {
    "name" : [ "james (@james@strangeobject.space)" ],
    "summary" : [ "Content warning: uspol, if you wanna defend any politician in my mentions then how the hell did you even see this post" ],
    "url" : [ "https://strangeobject.space/@james/112121525980222283" ]
  }
}
