{
  "type" : [ "h-entry" ],
  "properties" : {
    "name" : [ "Cup o' Go | 🧑‍🚀 For our 1st anniversary, we debate about (white)space in Muxers for a looooong time" ],
    "summary" : [ "Happy 1st anniversary to Cup o' Go! 🥳Proposalsgo build -json acceptedallow append(nil, arg) declined (playground link), because of existing alternativego vet: warn about recover in non-deferred function declined, because of lack of dataallow multiple spaces between method and path in mux: new..." ],
    "featured" : [ "https://images.transistor.fm/images/show/37862/medium_1674486898-artwork.jpg" ],
    "audio" : [ "https://media.transistor.fm/f01d8ece/c2a097ad.mp3" ],
    "url" : [ "https://share.transistor.fm/s/f01d8ece" ]
  }
}
