{
  "type" : [ "h-card" ],
  "properties" : {
    "name" : [ "Ian betteridge" ],
    "photo" : [ {
      "value" : "https://secure.gravatar.com/avatar/000801987fb3dd4d9b92db484c455ba0?s=64&r=x",
      "alt" : ""
    } ],
    "url" : [ "https://ianbetteridge.com" ]
  },
  "lang" : "en-GB"
}
