{
  "type" : [ "h-entry" ],
  "properties" : {
    "name" : [ "Paul Barker (@pbarker@social.afront.org)" ],
    "summary" : [ "@www.jvt.me@www.jvt.me Thank you for the notes on the discussion session I led on the Open Source AI Definition! I need to write up a summary of my thoughts on the subject and the discussion, so I will make reference to that." ],
    "url" : [ "https://social.afront.org/@pbarker/113304846688471402" ]
  }
}
