{
  "type" : [ "h-entry" ],
  "properties" : {
    "name" : [ "Thomas Frans 🇺🇦 (@thomy2000@fosstodon.org)" ],
    "summary" : [ "Copilot decreases code quality leading to more reverts/refactoring.\n\nWho could have seen this coming? :blobcatthinkingglare: \n\nhttps://visualstudiomagazine.com/articles/2024/01/25/copilot-research.aspx\n\n#Copilot #GitHub #programming #development" ],
    "url" : [ "https://fosstodon.org/@thomy2000/111833414363619301" ]
  }
}
