{
  "type" : [ "h-entry" ],
  "properties" : {
    "name" : [ "Andy Piper (@andypiper@macaw.social)" ],
    "summary" : [ "Here is a Fediwall set up to track #SOOCon24 #StateOfOpen https://andypiper.url.lol/soocon24" ],
    "url" : [ "https://macaw.social/@andypiper/111884180425456353" ]
  }
}
