{
  "type" : [ "h-entry" ],
  "properties" : {
    "name" : [ "The magic of a trace with Felix Geisendörfer &amp; Michael Knyszek (Go Time #310)" ],
    "summary" : [ "Felix Geisendörfer &amp;amp; Michael Knyszek join Natalie to discuss Go execution traces: why they’re awesome, common use cases, how they’ve gotten better of late &amp;amp; more. " ],
    "featured" : [ "https://cdn.changelog.com/static/images/share/twitter-gotime-a47cdd7bb3e3357398eda827d9cc3615.png" ],
    "audio" : [ "https://op3.dev/e/https://cdn.changelog.com/uploads/gotime/310/go-time-310.mp3" ],
    "url" : [ "https://changelog.com/gotime/310" ]
  }
}
