{
  "type" : [ "h-entry" ],
  "properties" : {
    "name" : [ "Jeff Atwood (@codinghorror@infosec.exchange)" ],
    "summary" : [ "When someone *really* loves you, they delete all that ridiculous querystring nonsense from the end of the hyperlink before sending it to you. 💘" ],
    "url" : [ "https://infosec.exchange/@codinghorror/111877138332186948" ]
  }
}
