{
  "type" : [ "h-entry" ],
  "properties" : {
    "name" : [ "We Saved 50,000 Engineering Hours in 2024!" ],
    "summary" : [ "2024 was my first year leading the Developer Experience teams at Capital One UK and what an incredible experience it’s been to work with such a great team and the individuals that make it. We kicked off 2024 focused on making a difference to the developer experience and set in motion the journey to " ],
    "featured" : [ "https://media.licdn.com/dms/image/v2/D4E12AQHVRNhNymzlEw/article-cover_image-shrink_720_1280/article-cover_image-shrink_720_1280/0/1738594912013?e=2147483647&v=beta&t=rw742hDCXnH_fZ2M5L1iAiNT2ZvAKM00bxIf-UoLARE" ],
    "url" : [ "https://www.linkedin.com/pulse/we-saved-50000-engineering-hours-2024-john-knowles-im5ue" ]
  }
}
