{
  "type" : [ "h-entry" ],
  "properties" : {
    "name" : [ "kf (@kf@666.glitchwit.ch)" ],
    "summary" : [ "puppy when he's in his crate, but I'm in the bathroom: 🚨🚨🚨🚨🚨😤🚨🚨🚨🚨🚨\n\npuppy when he's in his crate, but I'm in the same room: ☺️😴" ],
    "url" : [ "https://666.glitchwit.ch/@kf/111973405128714514" ]
  }
}
