{
  "type" : [ "h-entry" ],
  "properties" : {
    "name" : [ "luna (@luna@pony.social)" ],
    "summary" : [ "be careful not to mix up a mommy kink with a mummy kink; it’s all fun and games until she’s pulling your brain out through your nose" ],
    "url" : [ "https://pony.social/@luna/113197663318665133" ]
  }
}
