{
  "type" : [ "h-entry" ],
  "properties" : {
    "name" : [ "DJ Sundog - from the toot-lab (@djsundog@toot-lab.reclaim.technology)" ],
    "summary" : [ "new rule: if your company puts a LLM bot on the front lines of your customer support effort, your company should be legally bound to adhere to whatever the LLM bot states on your behalf.\n\noh, you put a lying machine at the front door and it's telling people your product does things it doesn't actually do? and now you're stuck making your product do these things? maybe you'll think twice about deploying lying machines..." ],
    "url" : [ "https://toot-lab.reclaim.technology/@djsundog/111692928645494118" ]
  }
}
