{
  "type" : [ "h-entry" ],
  "properties" : {
    "name" : [ "Open Source Security: Patching EOL Open Source with Aaron Frost" ],
    "summary" : [ "In this episode, Open Source Security chats with Aaron Frost, CEO of Hero Devs about the world of maintaining end-of-life open source software. Aaron explains how EOL versions of open source work and how backporting security fixes can help maintaining compliance. In the discussion we cover the \"just upgrade\" mentality, how backporting works, why it's hard, and why it matters. We also cover some oddities the world of CVE brings to the discussion. The blog post for this episode can be found at  " ],
    "featured" : [ "http://assets.libsyn.com/content/184624355?height=250&width=250&overlay=true" ],
    "audio" : [ "https://traffic.libsyn.com/secure/opensourcesecuritypodcast/2025-02-patching_EOL_OSS_aaron_frost.mp3" ],
    "url" : [ "https://opensourcesecuritypodcast.libsyn.com/patching-eol-open-source-with-aaron-frost" ]
  }
}
