{
  "type" : [ "h-entry" ],
  "properties" : {
    "name" : [ "Patricia Aas (@Patricia@vivaldi.net)" ],
    "summary" : [ "I’ve been surviving with my ancient maven knowledge but it seems I finally need to learn gradle. Help? What is… I don’t know… a “how does gradle work” talk or something?" ],
    "url" : [ "https://social.vivaldi.net/@Patricia/112387404022977352" ]
  }
}
