{
  "type" : [ "h-entry" ],
  "properties" : {
    "name" : [ "Intel’s Katherine Druckman and the Impact of Developer Relations - What's in the SOSS? An OpenSSF Podcast" ],
    "summary" : [ "In this episode, CRob discusses the finer points of developer relations (DevRel) with Katherine Druckman, Open Source Evangelist at Intel and co-chair of the OpenSSF Marketing Advisory Council and DevRel Community. Katherine enjoys sharing her pas..." ],
    "featured" : [ "https://www.buzzsprout.com/rails/active_storage/representations/redirect/eyJfcmFpbHMiOnsibWVzc2FnZSI6IkJBaHBCTVBBc1FZPSIsImV4cCI6bnVsbCwicHVyIjoiYmxvYl9pZCJ9fQ==--0d3dd0b3c05f74d14beb61df34ac9fd21e810649/eyJfcmFpbHMiOnsibWVzc2FnZSI6IkJBaDdDVG9MWm05eWJXRjBPZ2hxY0djNkUzSmxjMmw2WlY5MGIxOW1hV3hzV3docEFmcHBBZnA3QmpvSlkzSnZjRG9MWTJWdWRISmxPZ3B6WVhabGNuc0dPZ3h4ZFdGc2FYUjVhVUU2RUdOdmJHOTFjbk53WVdObFNTSUpjM0puWWdZNkJrVlUiLCJleHAiOm51bGwsInB1ciI6InZhcmlhdGlvbiJ9fQ==--bfdad5b04912fa8a9db85eb3989e46c5908e2723/soss_podcast_icon_3000px.jpg" ],
    "audio" : [ "https://www.buzzsprout.com/2323138/episodes/15348721-intel-s-katherine-druckman-and-the-impact-of-developer-relations.mp3?client_source=buzzsprout_website&referrer=https%3A%2F%2Fwww.buzzsprout.com%2F2323138%2Fepisodes%2F15348721-intel-s-katherine-druckman-and-the-impact-of-developer-relations" ],
    "url" : [ "https://www.buzzsprout.com/2323138/episodes/15348721-intel-s-katherine-druckman-and-the-impact-of-developer-relations" ]
  }
}
