{
  "type" : [ "h-entry" ],
  "properties" : {
    "name" : [ "Matthias Pfefferle (@pfefferle@mastodon.social)" ],
    "summary" : [ "Tomorrow is my first ever #IndieWebCamp.... I'm so excited and a bit ashamed that it took me so long 🫣" ],
    "url" : [ "https://mastodon.social/@pfefferle/112418757771162134" ]
  }
}
