{
  "type" : [ "h-entry" ],
  "properties" : {
    "name" : [ "Dave M7TLB 🐞 at #OggCamp (@thelovebug@mastodon.me.uk)" ],
    "summary" : [ "Attached: 1 image\n\nAt \"Into the multiverse: a parallel universe where neurotypicals are the weird ones\" with Parul Singh, in Cotton Theatre.\n\n#OggCamp2024 #OggCamp24 #OggCamp" ],
    "featured" : [ "https://mastodon.me.uk/system/media_attachments/files/113/294/826/310/403/619/original/9ae7c3acce277742.jpg" ],
    "url" : [ "https://mastodon.me.uk/@thelovebug/113294831460864708" ]
  }
}
