{
  "type" : [ "h-entry" ],
  "properties" : {
    "name" : [ "james (@james@strangeobject.space)" ],
    "summary" : [ "Content warning: mh/trauma -" ],
    "url" : [ "https://strangeobject.space/@james/112395505681949101" ]
  }
}
