{
  "type" : [ "h-cite" ],
  "properties" : {
    "name" : [ "Chris Hayes" ],
    "content" : [ "@zachleat Another thing with Vercel is their services out-of-the-box are often not price optimized. For example, \"Speed Insights\" is great, but by default they assume you want 100% of user visits. You can; however, manually reduce that. Their network monitoring tool is w… Truncated" ],
    "photo" : [ {
      "value" : "https://v1.image.11ty.dev/https%3A%2F%2Fwebmention.io%2Favatar%2Fcdn.masto.host%2F55211c5d74ccfab5e013d06b9a1d18b52c24cd557cf8f0b36c9efe4562092929.png/jpeg/72/",
      "alt" : "Chris Hayes"
    } ],
    "url" : [ {
      "type" : [ "h-card" ],
      "properties" : {
        "published" : [ "2024-08-06T21:15:49+00:00" ],
        "name" : [ "06 Aug 2024" ],
        "url" : [ "https://fosstodon.org/@chris_hayes/112917148412210457" ]
      },
      "lang" : "en",
      "value" : "https://fosstodon.org/@chris_hayes/112917148412210457"
    } ]
  },
  "id" : "webmention-1841867",
  "lang" : "en"
}
