{
  "type" : [ "h-entry" ],
  "properties" : {
    "name" : [ "Anders Eknert (@anderseknert@hachyderm.io)" ],
    "summary" : [ "@golang_discussions@mastodon.social @www.jvt.me@www.jvt.me" ],
    "url" : [ "https://hachyderm.io/@anderseknert/113180021366953050" ]
  }
}
