{
  "type" : [ "h-entry" ],
  "properties" : {
    "name" : [ "Schalk Neethling (@schalkneethling@hachyderm.io)" ],
    "summary" : [ "@www.jvt.me@www.jvt.me Dude! I need a short like that. But first I need to fix my website :)" ],
    "url" : [ "https://hachyderm.io/@schalkneethling/112033955615222662" ]
  }
}
