{
  "type" : [ "h-entry" ],
  "properties" : {
    "name" : [ "Containers on a diet with Kyle Quest (Ship It! #95)" ],
    "summary" : [ "Kyle Quest joins the show to tell Autumn &amp;amp; Justin all about the evolution of DockerSlim &amp;amp; minimal container images. Why are small container images important? What are different strategies to make containers smaller? Let’s find out! " ],
    "featured" : [ "https://cdn.changelog.com/static/images/share/twitter-shipit-feb3710d53361bb8a02164926b99f023.png" ],
    "audio" : [ "https://op3.dev/e/https://cdn.changelog.com/uploads/shipit/95/ship-it-95.mp3" ],
    "url" : [ "https://changelog.com/shipit/95" ]
  }
}
