{
  "type" : [ "h-entry" ],
  "properties" : {
    "name" : [ ":pdx_elk: (@rose@503junk.house)" ],
    "summary" : [ "Attached: 1 image\n\nholy shit. they actually called it \"reply guy\". seeing the Torment Nexus and copying it for profit is one thing, but seeing a reply guy and being like \"I can monetize that\" is a whole new type of evil." ],
    "featured" : [ "https://503junk.house/system/media_attachments/files/112/349/382/466/661/813/original/3c6a4970c48ca6ea.png" ],
    "url" : [ "https://503junk.house/@rose/112349387538932488" ]
  }
}
