{
  "type" : [ "h-entry" ],
  "properties" : {
    "name" : [ "Jonathan W. Gray (@elmcitytree.bsky.social)" ],
    "summary" : [ "To instrumentalize what my sister is saying below: every time someone says DEI say “you mean civil rights?” Every time someone says they are against woke reply “oh so you’re a segregationist!” Words have meaning! Don’t allow that nonsense to stand.\n\n[contains quote post or other embedded content]" ],
    "url" : [ "https://bsky.app/profile/elmcitytree.bsky.social/post/3lgigjfo2q22q" ],
    "published" : [ "2025-01-24T12:46:48.954Z" ]
  }
}
