{
  "type" : [ "h-entry" ],
  "properties" : {
    "name" : [ "Oxide and Friends | Open Source LLMs with Simon Willison" ],
    "summary" : [ "Simon Willison joined Bryan and Adam to discuss a recent article maligning open source large language models. Simon has so much practical experience with LLMs, and brings so much clarity to what they can and can’t do. How do these systems work? How do they break? What are open and proprietary..." ],
    "featured" : [ "https://img.transistor.fm/FxXjNxnYtPasVHZcVqw5YtG1injaYgoADgWMUCeJiGc/rs:fill:800:800:1/q:60/aHR0cHM6Ly9pbWct/dXBsb2FkLXByb2R1/Y3Rpb24udHJhbnNp/c3Rvci5mbS9lcGlz/b2RlLzE2OTI1MTAv/MTcwNTQ1MDI4MC1h/cnR3b3JrLmpwZw.webp" ],
    "audio" : [ "https://media.transistor.fm/049b33b1/3190d625.mp3" ],
    "url" : [ "https://share.transistor.fm/s/049b33b1" ]
  }
}
