{
  "type" : [ "h-entry" ],
  "properties" : {
    "name" : [ "valoisa kvarkkitehti (@valoisa@eliitin-some.fi)" ],
    "summary" : [ "Attached: 1 image" ],
    "featured" : [ "https://cdn.masto.host/eliitinsomefi/media_attachments/files/112/377/451/924/629/534/original/90e487749f33a080.jpeg" ],
    "url" : [ "https://eliitin-some.fi/@valoisa/112377455540587305" ]
  }
}
