{
  "type" : [ "h-entry" ],
  "properties" : {
    "name" : [ "GitHub - zaghaghi/openapi-tui: Terminal UI to list, browse and run APIs defined with openapi spec." ],
    "summary" : [ "Terminal UI to list, browse and run APIs defined with openapi spec. - zaghaghi/openapi-tui" ],
    "featured" : [ "https://opengraph.githubassets.com/5d17769af3f2f6b3234a9ec0f3af4845acf974669c60e0cf2d628fc85fe1f155/zaghaghi/openapi-tui" ],
    "url" : [ "https://github.com/zaghaghi/openapi-tui" ]
  }
}
