{
  "type" : [ "h-entry" ],
  "properties" : {
    "name" : [ "Kelsey Hightower (@kelseyhightower.com)" ],
    "summary" : [ "Most of what we call \"tech\" is about getting the right information into a database and trying to prevent the wrong person from reading or updating it." ],
    "url" : [ "https://bsky.app/profile/kelseyhightower.com/post/3ljixqla6l223" ],
    "published" : [ "2025-03-03T22:10:38.351Z" ]
  }
}
