{
  "type" : [ "h-entry" ],
  "properties" : {
    "name" : [ "Jeremy (#DevRel & #DevEx) (@jerdog@hachyderm.io)" ],
    "summary" : [ "OH: The real body count is how many people's therapists know about you" ],
    "url" : [ "https://hachyderm.io/@jerdog/113374573454103830" ]
  }
}
