{
  "type" : [ "h-entry" ],
  "properties" : {
    "name" : [ "Terence Eden (@Edent@mastodon.social)" ],
    "summary" : [ "Good news for rationality!\n\nhttps://humanists.uk/2024/07/11/highest-number-of-mps-ever-take-secular-affirmation/\n\n#ukpolitics #GE2024" ],
    "url" : [ "https://mastodon.social/@Edent/112772341369670053" ]
  }
}
