{
  "type" : [ "h-entry" ],
  "properties" : {
    "name" : [ "Cat Hicks (@grimalkina@mastodon.social)" ],
    "summary" : [ "I don't know if I ever will stand up and talk about this practice in public, because it's a somewhat terrifying idea to imagine all the potential backlash or judgment idk, but if I did and everyone agreed, there is a GREAT talk I've imagined: \"The Salary Ring.\" \n\nI'd describe these couple of years in my life when several of us joined together to support each other learning to negotiate, doing group market research, workshopping what we'd say in toxic situations together." ],
    "url" : [ "https://mastodon.social/@grimalkina/113081108010125031" ]
  }
}
