{
  "type" : [ "h-entry" ],
  "properties" : {
    "name" : [ "Shubheksha (@ScribblingOn@octodon.social)" ],
    "summary" : [ "Hiding behind humour and sarcasm to run away from everything is wayyyy too easy for emotional masochists." ],
    "url" : [ "https://octodon.social/@ScribblingOn/112031683506140617" ]
  }
}
