{
  "type" : [ "h-entry" ],
  "properties" : {
    "name" : [ "Open Source Security Podcast: Episode 435 - polyfill.io - open source is too big to fix" ],
    "summary" : [ " and  talk about the latest polyfill.io mess. Apparently someone took over a very popular project and started to serve malware. First XZ, now this. What does it mean for open source? We don't have any answers, and it's hard to even talk about this problem because it's so big. The thing is though, even if we can't fix open source, it's here to stay. Show Notes     " ],
    "featured" : [ "http://assets.libsyn.com/content/173885757?height=250&width=250&overlay=true" ],
    "audio" : [ "https://traffic.libsyn.com/secure/opensourcesecuritypodcast/Episode_435_polyfill_io_open_source_is_too_big_to_fix.mp3" ],
    "url" : [ "https://opensourcesecuritypodcast.libsyn.com/episode-435-polyfillio-open-source-is-too-big-to-fix" ]
  }
}
