{
  "type" : [ "h-entry" ],
  "properties" : {
    "name" : [ "Daria J. (@0xdariaj@tenforward.social)" ],
    "summary" : [ "@www.jvt.me@www.jvt.me hi, do you have any salary ranges? I couldn’t find any in the careers section on the company website." ],
    "url" : [ "https://tenforward.social/@0xdariaj/111847109823242348" ]
  }
}
