{
  "type" : [ "h-entry" ],
  "properties" : {
    "name" : [ "Ariadne Conill 🐰:therian: (@ariadne@treehouse.systems)" ],
    "summary" : [ "Attached: 1 image\n\nhang on, gotta go take a shit in my shitting cube" ],
    "featured" : [ "https://cache.treehouse.systems/media_attachments/files/110/211/795/189/427/756/original/6bfe52826bf3100b.jpeg" ],
    "url" : [ "https://social.treehouse.systems/@ariadne/110211798299113924" ]
  }
}
