{
  "type" : [ "h-entry" ],
  "properties" : {
    "name" : [ "\n\n\n\n\nWhat does it mean to be a tech worker? — Jacky Alciné" ],
    "featured" : [ "https://webring.xxiivv.com/icon.black.svg" ],
    "url" : [ "https://jacky.wtf/2024/4/kDBb?" ]
  }
}
