{
  "type" : [ "h-entry" ],
  "properties" : {
    "name" : [ "Heather Meeker on her latest book, \"From Project to Profit: How to Succeed in Commercial Open Source\"" ],
    "summary" : [ "Heather Meeker talks about her latest book on how to make open-source projects profitable. She covers open source importance, economics, OSI's goal, and why Audacity is a great open-source project." ],
    "featured" : [ "https://assets.fireside.fm/file/fireside-images/podcasts/images/2/27729c65-f4a6-4496-8c86-820e7f13b285/episodes/d/d143c347-2cdd-41f1-9743-b32ffaa0f2b3/cover_medium.jpg?v=1" ],
    "audio" : [ "https://aphid.fireside.fm/d/1437767933/27729c65-f4a6-4496-8c86-820e7f13b285/d143c347-2cdd-41f1-9743-b32ffaa0f2b3.mp3" ],
    "author" : [ {
      "type" : [ "h-card" ],
      "properties" : {
        "name" : [ "SustainOSS" ]
      }
    } ],
    "url" : [ "https://podcast.sustainoss.org/217" ]
  }
}
