{
  "type" : [ "h-entry" ],
  "properties" : {
    "name" : [ "Muetdhiver (@muetdhiver@piaille.fr)" ],
    "summary" : [ "@hungry_joe@mas.to If you sit on a throne in the middle of it, does it make you an edgelord ?" ],
    "url" : [ "https://piaille.fr/@muetdhiver/111844150530361544" ]
  }
}
