{
  "type" : [ "h-entry" ],
  "properties" : {
    "name" : [ "Aral Balkan (@aral@mastodon.ar.al)" ],
    "summary" : [ "If you see the AGPL licenses on my free and open source work and you think “damn you, I can’t use this to enrich myself or my corporation without sharing back what I’ve built on top of what you’ve freely shared and thus contribute to cultivating a healthy commons where others might enjoy the same benefits from my work that I want to obtain from yours” (a) you really have long-winded thoughts and (b) well, you already see the flaw in your reasoning.\n\n#foss #licenses #freedom #copyleft #gpl" ],
    "url" : [ "https://mastodon.ar.al/@aral/112070976247169017" ]
  }
}
