{
  "type" : [ "h-entry" ],
  "properties" : {
    "name" : [ "LA Legault ✌🏻MCRT (@LALegault@newsie.social)" ],
    "summary" : [ "Attached: 1 image\n\nEvery politician should read the Onion every day so their absurdity can be reflected back." ],
    "featured" : [ "https://assets.newsie.social/media_attachments/files/112/379/215/999/666/772/original/e1c61359c04af874.jpeg" ],
    "url" : [ "https://newsie.social/@LALegault/112379216342132328" ]
  }
}
