{
  "type" : [ "h-entry" ],
  "properties" : {
    "name" : [ "Mike McQuaid (@mikemcquaid@mastodon.social)" ],
    "summary" : [ "Just discovered https://github.com/gayanvoice/top-github-users/blob/main/markdown/public_contributions/united_kingdom.md\n\nAccording to that I'm #1 in public GitHub contributions in Scotland, #10 in the UK and, if I were in the USA, would be #9. \n\nNeat." ],
    "url" : [ "https://mastodon.social/@mikemcquaid/111725690955635027" ]
  }
}
