{
  "type" : [ "h-entry" ],
  "properties" : {
    "name" : [ "Ronan Limon Duparcmeur (@r3trofitted@ruby.social)" ],
    "summary" : [ "@heydon@front-end.social awesome. And if the goal is to provide a “constant reminder”, I want to create a religion that’d promote temple anal plugs. \n\nNot sure that they would provide a lot of physical protection, though…" ],
    "url" : [ "https://ruby.social/@r3trofitted/112297333277560973" ]
  }
}
