{
  "type" : [ "h-entry" ],
  "properties" : {
    "name" : [ "It&#39;s not always DNS with Paul Vixie (contributor to DNS protocol design) (Changelog Interviews #581)" ],
    "summary" : [ "This week we’re talking about DNS with Paul Vixie — Paul is well known for his contributions to DNS and agrees with Adam on having a “love/hate relationship with DNS.” We discuss the limitations of current DNS technologies and the need for revisions to support future internet scale, the challenges in doing that. Paul s..." ],
    "featured" : [ "https://cdn.changelog.com/static/images/share/twitter-podcast-0fed02e920a2ff887b9c8ccac88925e1.png" ],
    "audio" : [ "https://op3.dev/e/https://cdn.changelog.com/uploads/podcast/581/the-changelog-581.mp3" ],
    "url" : [ "https://changelog.com/podcast/581" ]
  }
}
