{
  "type" : [ "h-entry" ],
  "properties" : {
    "name" : [ "Ep 240: Killer Mike | Off Menu with Ed Gamble and James Acaster" ],
    "summary" : [ "Listen to Ep 240: Killer Mike from Off Menu with Ed Gamble and James Acaster. Grammy Award-winning rapper (and half of Run The Jewels) Killer Mike joins us in the Dream Restaurant. And he’s impressed with Ed’s fishing skills. Killer Mike’s Grammy-winning album ‘Michael’ is out now. Listen here. Killer Mike is on tour this year. For dates and tickets go to killermike.com. Follow Killer Mike on Instagram and Twitter @killermike Recorded and edited by Ben Williams for Plosive.Artwork by Paul Gilbey (photography and design).Follow Off Menu on Twitter and Instagram: @offmenuofficial.And go to our website www.offmenupodcast.co.uk for a list of restaurants recommended on the show.Watch Ed and James's YouTube series 'Just Puddings'. Watch here." ],
    "featured" : [ "https://res.cloudinary.com/pippa/image/fetch/c_pad,w_600,h_315/https://assets.pippa.io/shows/61ba04aa1a8cbee88a3cf0d8/1712221818037-f3a27007de00fa5d2f31b186194c13fa.jpeg" ],
    "audio" : [ "https://open.acast.com/public/streams/b19ac1f5-6adf-4c8b-aa1a-2af2160f99e4/episodes/660e7eaac89815001652a9fa.mp3" ],
    "url" : [ "https://shows.acast.com/offmenu/episodes/ep-240-killer-mike" ]
  }
}
