{
  "type" : [ "h-entry" ],
  "properties" : {
    "name" : [ "The Business of Open Source | Ensuring the Difference in Value between Project and Product is Big Enough with André Eriksson " ],
    "summary" : [ "This week on The Business of Open Source, I spoke with André Eriksson, founder and CEO at Encore. We talked about how open source develops trust, something I also discussed in the episode I recorded with Reshma Khilnani. For Encore, it’s subtly different, though. In the case of Medplum, open..." ],
    "featured" : [ "https://img.transistor.fm/Lb7Bpu3aBT5bp3W_HYHhf1rD6x1UPhXhFzHEBTRywb0/rs:fill:800:800:1/q:60/aHR0cHM6Ly9pbWct/dXBsb2FkLXByb2R1/Y3Rpb24udHJhbnNp/c3Rvci5mbS9zaG93/LzEwNTI5LzE2NTY1/MTIwMDAtYXJ0d29y/ay5qcGc.webp" ],
    "audio" : [ "https://dts.podtrac.com/redirect.mp3/media.transistor.fm/29d61d82/6b029eaf.mp3" ],
    "url" : [ "https://share.transistor.fm/s/29d61d82" ]
  }
}
