{
  "type" : [ "h-entry" ],
  "properties" : {
    "name" : [ "Stanley Black-Decker (@pleaseclap@urbanists.social)" ],
    "summary" : [ "AI isn't replacing jobs: employers are firing people." ],
    "url" : [ "https://urbanists.social/@pleaseclap/111739354498815938" ]
  }
}
