{
  "type" : [ "h-card" ],
  "properties" : {
    "name" : [ "James Plunkett" ],
    "photo" : [ {
      "value" : "https://cdn.bsky.app/img/avatar/plain/did:plc:xtmhahgk5b67nkwoves7npup/bafkreiedliorjwhssb27sqauqukrffea5drq3pvqm2xwhs2npqrdnoyobi@jpeg",
      "alt" : ""
    } ],
    "url" : [ "https://bsky.app/profile/jamestplunkett.bsky.social/post/3ldmgbq7qiz2e" ]
  },
  "lang" : "en-GB"
}
