{
  "type" : [ "h-entry" ],
  "properties" : {
    "name" : [ "Kusari’s Michael Lieberman Talks GUAC, SLSA and Securing the Open Source Supply Chain - What's in the SOSS? An OpenSSF Podcast" ],
    "summary" : [ "CRob is joined by Michael Lieberman, CTO and co-founder of Kusari, about the importance of supply chain security in the open source ecosystem. They discuss Michael's journey in open source, his contributions to projects like SLSA and GUAC and the ..." ],
    "featured" : [ "https://www.buzzsprout.com/rails/active_storage/representations/redirect/eyJfcmFpbHMiOnsibWVzc2FnZSI6IkJBaHBCRzBtS1FnPSIsImV4cCI6bnVsbCwicHVyIjoiYmxvYl9pZCJ9fQ==--94acdc37591cf1149ff3e7140b76225b35132e55/eyJfcmFpbHMiOnsibWVzc2FnZSI6IkJBaDdDVG9MWm05eWJXRjBPZ2hxY0djNkUzSmxjMmw2WlY5MGIxOW1hV3hzV3docEFmcHBBZnA3QmpvSlkzSnZjRG9MWTJWdWRISmxPZ3B6WVhabGNuc0dPZ3h4ZFdGc2FYUjVhVUU2RUdOdmJHOTFjbk53WVdObFNTSUpjM0puWWdZNkJrVlUiLCJleHAiOm51bGwsInB1ciI6InZhcmlhdGlvbiJ9fQ==--bfdad5b04912fa8a9db85eb3989e46c5908e2723/OUTDATED%20soss_podcast_theme_sq_032524a.png" ],
    "audio" : [ "https://www.buzzsprout.com/2323138/episodes/16269272-kusari-s-michael-lieberman-talks-guac-slsa-and-securing-the-open-source-supply-chain.mp3?client_source=buzzsprout_website&referrer=https%3A%2F%2Fwww.buzzsprout.com%2F2323138%2Fepisodes%2F16269272-kusari-s-michael-lieberman-talks-guac-slsa-and-securing-the-open-source-supply-chain" ],
    "url" : [ "https://www.buzzsprout.com/2323138/episodes/16269272-kusari-s-michael-lieberman-talks-guac-slsa-and-securing-the-open-source-supply-chain" ]
  }
}
