{
  "type" : [ "h-entry" ],
  "properties" : {
    "name" : [ "Kevin Beaumont (@GossiTheDog@cyberplace.social)" ],
    "summary" : [ "If you want to know where tech companies are with AI safety, know Microsoft Recall won’t record screenshots of DRM’d movies.. \n\n..but will record screenshots of your financial records and WhatsApp messages, as corporate interests were prioritised over user safety. \n\nAnd it’s enabled by default." ],
    "url" : [ "https://cyberplace.social/@GossiTheDog/112508854440379819" ]
  }
}
