{
  "type" : [ "h-entry" ],
  "properties" : {
    "name" : [ "Anders Eknert (@anderseknert@hachyderm.io)" ],
    "summary" : [ "#Hashicorp sending their lawyers on #OpenTofu feels like the last chapter of what was once a great open source company. Oh well, the claims look baseless, and like pretty much any move Hahicorp made this past year, this will only hurt themselves.\n\nhttps://www.linkedin.com/posts/opentofuorg_opentofu-project-was-recently-made-aware-activity-7182147077496344576-jsDQ" ],
    "url" : [ "https://hachyderm.io/@anderseknert/112224097938396533" ]
  }
}
