{
  "type" : [ "h-entry" ],
  "properties" : {
    "name" : [ "The Business of Open Source | Taking a hard look at what community means and if every OSS company needs one with Deepak Prabhakara" ],
    "summary" : [ "This week on The Business of Open Source, I spoke with BoxyHQ co-founder and CEO Deepak Prabhakara. We talked about a number of things, from BoxyHQ’s relationship with its open source project, called SAML Jackson to how to build a growth flywheel and how that flywheel does and does not depend on..." ],
    "featured" : [ "https://img.transistor.fm/Lb7Bpu3aBT5bp3W_HYHhf1rD6x1UPhXhFzHEBTRywb0/rs:fill:800:800:1/q:60/aHR0cHM6Ly9pbWct/dXBsb2FkLXByb2R1/Y3Rpb24udHJhbnNp/c3Rvci5mbS9zaG93/LzEwNTI5LzE2NTY1/MTIwMDAtYXJ0d29y/ay5qcGc.webp" ],
    "audio" : [ "https://dts.podtrac.com/redirect.mp3/media.transistor.fm/f6168a18/b68e7dc4.mp3" ],
    "url" : [ "https://share.transistor.fm/s/f6168a18" ]
  }
}
