{
  "type" : [ "h-entry" ],
  "properties" : {
    "name" : [ "The Business of Open Source | Finding and losing product-market fit with Allard Buijze " ],
    "summary" : [ "This week on The Business of Open Source, I talked with Allard Buijze, the CTO and founder at AxonIQ. We talked a lot about the importance of open source for getting feedback on your product and validating your idea — or not. One of the things we talked about was how the beginning of AxonIQ was..." ],
    "featured" : [ "https://img.transistor.fm/Lb7Bpu3aBT5bp3W_HYHhf1rD6x1UPhXhFzHEBTRywb0/rs:fill:800:800:1/q:60/aHR0cHM6Ly9pbWct/dXBsb2FkLXByb2R1/Y3Rpb24udHJhbnNp/c3Rvci5mbS9zaG93/LzEwNTI5LzE2NTY1/MTIwMDAtYXJ0d29y/ay5qcGc.webp" ],
    "audio" : [ "https://dts.podtrac.com/redirect.mp3/media.transistor.fm/57d420d7/186d0b89.mp3" ],
    "url" : [ "https://share.transistor.fm/s/57d420d7" ]
  }
}
