{
  "type" : [ "h-entry" ],
  "properties" : {
    "name" : [ "tierney cyren (@bnb.im)" ],
    "summary" : [ "I’m really happy to see companies starting to open source more games that they’ve ~sunset.\n\nbetween this and Valve open sourcing the code for TF2… I’m weirdly hopeful\n\n[contains quote post or other embedded content]" ],
    "url" : [ "https://bsky.app/profile/bnb.im/post/3lj6qtyo7hk2u" ],
    "published" : [ "2025-02-27T20:40:39.254Z" ]
  }
}
