{
  "type" : [ "h-entry" ],
  "properties" : {
    "name" : [ "Chris Armstrong (@Rhodium103@mastodon.social)" ],
    "summary" : [ "The Void is experiencing extremely high call volumes right now. Please hold. Your screaming is very important to us." ],
    "url" : [ "https://mastodon.social/@Rhodium103/111416715450472414" ]
  }
}
