{
  "type" : [ "h-entry" ],
  "properties" : {
    "name" : [ "Anyone can Access Deleted and Private Repository Data on GitHub ◆ Truffle Security Co." ],
    "summary" : [ "You can access data from deleted forks, deleted repositories and even private repositories on GitHub. And it is available forever. This is known by GitHub, and intentionally designed that way. \n\n" ],
    "featured" : [ "https://framerusercontent.com/images/QBddtt3Ue3SLvfEshNFBiR49U8I.png" ],
    "url" : [ "https://trufflesecurity.com/blog/anyone-can-access-deleted-and-private-repo-data-github" ]
  }
}
