{
  "type" : [ "h-entry" ],
  "properties" : {
    "name" : [ "Winning a hackathon, losing my sanity — Jerome Paulos" ],
    "featured" : [ "https://tuftsesociety.files.wordpress.com/2014/01/tufts-university.jpg" ],
    "url" : [ "https://jero.zone/posts/meal-plan-wrapped" ]
  }
}
