{
  "type" : [ "h-entry" ],
  "properties" : {
    "name" : [ "Carl T. Bergstrom (@ct_bergstrom@fediscience.org)" ],
    "summary" : [ "Attached: 1 image\n\nMy daughters and I are feeding cows 10,000 pounds of macadamia nuts each and that's what makes us so relatable and makes it so clear we don't need to be taxed at 95+ percent of our income." ],
    "featured" : [ "https://fediscience.org/system/media_attachments/files/111/729/403/070/167/630/original/ec60295da8e3fd7d.png" ],
    "url" : [ "https://fediscience.org/@ct_bergstrom/111729403840221417" ]
  }
}
