{
  "type" : [ "h-entry" ],
  "properties" : {
    "name" : [ "Xe :verified: (@cadey@pony.social)" ],
    "summary" : [ "I have a picture of @Quinnypig@awscommunity.social giving bedroom eyes and it is too powerful to release to the masses" ],
    "url" : [ "https://pony.social/@cadey/112120042458626911" ]
  }
}
