{
  "type" : [ "h-entry" ],
  "properties" : {
    "name" : [ "#define: legendary with Thomas Eckert, Nick Nisi &amp; Mat Ryer (Changelog &amp; Friends #47)" ],
    "summary" : [ "What happens when you take three #define newbs (Thomas Eckert, Nick Nisi, Mat Ryer) &amp;amp; pit them against the grizzled vet, Adam? Find out on this episode because our award-worthy game of fake definitions is back &amp;amp; this time it’s even more legendary! " ],
    "featured" : [ "https://snap.fly.dev/friends/47/img" ],
    "audio" : [ "https://op3.dev/e/https://cdn.changelog.com/uploads/friends/47/changelog--friends-47.mp3" ],
    "url" : [ "https://changelog.com/friends/47" ]
  }
}
