{
  "type" : [ "h-entry" ],
  "properties" : {
    "name" : [ "Free Public APIs" ],
    "summary" : [ "A collection of Free Public APIs for Students and Developers. Tested every single day." ],
    "url" : [ "https://www.freepublicapis.com/" ]
  }
}
