{
  "type" : [ "h-entry" ],
  "properties" : {
    "name" : [ "jenn schiffer (@jenn@pixel.kitchen)" ],
    "summary" : [ "Attached: 1 image" ],
    "featured" : [ "https://nyc3.digitaloceanspaces.com/pixelkitchen/media_attachments/files/112/394/953/994/006/425/original/43ed0cb5f23b0cab.jpeg" ],
    "url" : [ "https://pixel.kitchen/@jenn/112394958125274531" ]
  }
}
