{
  "type" : [ "h-entry" ],
  "properties" : {
    "name" : [ "Andy Piper (@andypiper@macaw.social)" ],
    "summary" : [ "The UK's largest free culture and free and open source community unconference is back, after a 5 year hiatus. Come along and take part! #OggCamp #OggCamp2024 #Blaugust2024 #100DaysToOffload\n\nhttp://andypiper.co.uk/2024/08/20/return-of-the-oggcamp/" ],
    "url" : [ "https://macaw.social/@andypiper/112994776402908217" ]
  }
}
