{
  "type" : [ "h-entry" ],
  "properties" : {
    "name" : [ "Brian Douglas - Open Sauced, GitHub by devtools.fm" ],
    "summary" : [ "This week we're joined by Brian Douglas, founder of Open Sauced and former Head of DevRel at GitHub. We talk about his time at GitHub, where he worked on GitHub Actions, GitHub Discussions, and GitHub Copilot. We also talk about his new company, Open Sauced, which is a tool for developers and businesses to get insights into their open source projects. Will Open Sauced save social coding? Find out on this week's episode of DevTools FM!\n\n https://opensauced.pizza\n https://twitter.com/bdougieYO\n  https://twitter.com/saucedopen\n  https://app.opensauced.pizza/user/bdougie\n  https://github.com/bdougie\n  https://www.linkedin.com/in/brianldouglas/\n\nEpisode sponsored By Raycast (https://www.raycast.com/)\nBecome a paid subscriber our patreon, spotify, or apple podcasts for the full episode.\n\n  https://www.patreon.com/devtoolsfm\n  https://podcasters.spotify.com/pod/show/devtoolsfm/subscribe\n  https://podcasts.apple.com/us/podcast/devtools-fm/id1566647758\n  https://www.youtube.com/@devtoolsfm/membership\n\nTooltips\nAndrew\n\n  https://www.melt-ui.com/docs/introduction\n  https://fleet.so/context\n\nJustin\n\n  https://www.automa.site/\n  https://svelteflow.dev/\n\nBrian\n\n  https://posthog.com/\n  https://chat.openai.com/g/g-2LFEDLGgS-ferris-the-crab\n\n" ],
    "featured" : [ "https://d3t3ozftmdmh3i.cloudfront.net/staging/podcast_uploaded_nologo400/37046549/08502c705efc28c5.jpeg" ],
    "url" : [ "https://podcasters.spotify.com/pod/show/devtoolsfm/episodes/Brian-Douglas---Open-Sauced--GitHub-e2dbi7q" ]
  }
}
