{
  "type" : [ "h-entry" ],
  "properties" : {
    "name" : [ "Neil Macy (@neilgmacy@mastodon.social)" ],
    "summary" : [ "The greatest lie ever told in work:\n\n“I just have a quick question”" ],
    "url" : [ "https://mastodon.social/@neilgmacy/112122095046244406" ]
  }
}
