{
  "type" : [ "h-entry" ],
  "properties" : {
    "name" : [ "scy (@scy@chaos.social)" ],
    "summary" : [ "\"Create your account to continue reading.\"\n\nyeah how about i just close the tab instead" ],
    "url" : [ "https://chaos.social/@scy/111959692227904675" ]
  }
}
