{
  "type" : [ "h-entry" ],
  "properties" : {
    "name" : [ "Hiro (@HiroRwar@gulp.cafe)" ],
    "summary" : [ "Attached: 1 image\n\n'Eating rice, China' (1901-1904) is probably the most important historical photograph I have ever seen." ],
    "featured" : [ "https://cdn.masto.host/gulpcafe/media_attachments/files/111/853/855/609/862/266/original/7e618c5806605364.jpg" ],
    "url" : [ "https://gulp.cafe/@HiroRwar/111853867859066915" ]
  }
}
