{
  "type" : [ "h-entry" ],
  "properties" : {
    "name" : [ "Christmas Carol 🎄 (@carol.gg)" ],
    "summary" : [ "i’m watching the substance, and i hadn’t seen this much squelching on the subtitles since stranger things" ],
    "url" : [ "https://bsky.app/profile/carol.gg/post/3lcs6xpcqms2b" ],
    "published" : [ "2024-12-08T12:17:30.250Z" ]
  }
}
