{
  "type" : [ "h-entry" ],
  "properties" : {
    "name" : [ "kf (@kf@666.glitchwit.ch)" ],
    "summary" : [ "Attached: 1 image\n\n\"buy a toppl\" is the best advice a dog trainer has yet given me tbqh\n\nthis thing is worth its weight in gold" ],
    "featured" : [ "https://cdn.masto.host/num666glitchwitch/media_attachments/files/112/131/452/848/181/757/original/29d666cc7fb658fc.jpeg" ],
    "url" : [ "https://666.glitchwit.ch/@kf/112131454568085732" ]
  }
}
