{
  "type" : [ "h-entry" ],
  "properties" : {
    "name" : [ "Wild Geerters (@steinkobbe.bsky.social)" ],
    "summary" : [ "All jokes aside it's really fucked up to see so many people on here celebrating murder. No one here is the judge of who deserves to live or die. That's the job of the AI algorithm the insurance company designed to maximise profits on your health and no one else" ],
    "url" : [ "https://bsky.app/profile/steinkobbe.bsky.social/post/3lcjcxkt4ws23" ],
    "published" : [ "2024-12-04T23:35:03.062Z" ]
  }
}
