{
  "type" : [ "h-entry" ],
  "properties" : {
    "name" : [ "James (@james.tarnation.lol)" ],
    "summary" : [ "why are they called porn bots and not intrusive thots" ],
    "url" : [ "https://bsky.app/profile/james.tarnation.lol/post/3lf6gwstzis26" ],
    "published" : [ "2025-01-07T20:02:31.552Z" ]
  }
}
