{
  "type" : [ "h-entry" ],
  "properties" : {
    "name" : [ "A simple OpenID connect tutorial — /var/" ],
    "author" : [ {
      "type" : [ "h-card" ],
      "properties" : {
        "name" : [ "Serafeim Papastefanos" ]
      }
    } ],
    "url" : [ "https://spapas.github.io/2023/11/29/openid-connect-tutorial/" ]
  }
}
