{
  "type" : [ "h-entry" ],
  "properties" : {
    "name" : [ "StaffSRE1138 (@staffsre1138@hachyderm.io)" ],
    "summary" : [ "Every GitHub Actions service comes with free GitHub Consequences." ],
    "url" : [ "https://hachyderm.io/@staffsre1138/111947199198647191" ]
  }
}
