{
  "type" : [ "h-entry" ],
  "properties" : {
    "name" : [ "kf (@kf@666.glitchwit.ch)" ],
    "summary" : [ "Attached: 1 image\n\n👀" ],
    "featured" : [ "https://cdn.masto.host/num666glitchwitch/media_attachments/files/112/492/997/358/437/099/original/3acab25cfc7f5d7d.jpeg" ],
    "url" : [ "https://666.glitchwit.ch/@kf/112492997637625027" ]
  }
}
