{
  "type" : [ "h-entry" ],
  "properties" : {
    "name" : [ "james is ??? (@james@strangeobject.space)" ],
    "summary" : [ "I think the ActivityPub based Fediverse is actually not a decentralised distributed network, but is in fact one single person. \n\nAnd that single person enjoys, very specifically, trying to trigger the fight/flight/faun response in me and taking bets with the other protocols on which one I’ll choose next.\n\n🙈" ],
    "url" : [ "https://strangeobject.space/@james/111958540525997170" ]
  }
}
