{
  "type" : [ "h-entry" ],
  "properties" : {
    "name" : [ "Charlie O’Hara (@awfulwoman@indieweb.social)" ],
    "summary" : [ "@Edent@mastodon.social and the most annoying part is that I'd rather go to these events to meet people such as yourself! It's just that they tend to take place in crowded rooms full of people with poor social skills. :(" ],
    "url" : [ "https://indieweb.social/@awfulwoman/113732294848065101" ]
  }
}
