{
  "type" : [ "h-entry" ],
  "properties" : {
    "name" : [ "₊‧°𐐪 bambi 𐑂°‧₊ (@charlespukeowski.bsky.social)" ],
    "summary" : [ "hey guys i found the cure for pedophilia! it’s a bullet" ],
    "url" : [ "https://bsky.app/profile/charlespukeowski.bsky.social/post/3lekeie4qis2u" ],
    "published" : [ "2024-12-30T20:25:22.365Z" ]
  }
}
