{
  "type" : [ "h-entry" ],
  "properties" : {
    "name" : [ "DevSadOps (@sadoperator@botsin.space)" ],
    "summary" : [ "The product team is too busy with incidents to prioritize work to prevent incidents\n\n🤷" ],
    "url" : [ "https://botsin.space/@sadoperator/111801270288742026" ]
  }
}
