{
  "type" : [ "h-entry" ],
  "properties" : {
    "name" : [ "There’s a TUI for that with Nick Janetakis (Changelog &amp; Friends #53)" ],
    "summary" : [ "Nick Janetakis is back and this time we&#39;re talking about TUIs (text-based user interfaces) — some we&#39;ve tried and some we plan to try. All are collected from Justin Garrison&#39;s Awesome TUIs repo on GitHub. This episode is &quot;AI free.&quot;" ],
    "featured" : [ "https://snap.fly.dev/friends/53/img" ],
    "audio" : [ "https://op3.dev/e/https://cdn.changelog.com/uploads/friends/53/changelog--friends-53.mp3" ],
    "url" : [ "https://changelog.com/friends/53" ]
  }
}
