{
  "type" : [ "h-entry" ],
  "properties" : {
    "name" : [ "kat cosgrove (@kat.lol)" ],
    "summary" : [ "this is the only acceptable way to reach out to me during the holidays\n\n[contains quote post or other embedded content]" ],
    "featured" : [ "https://cdn.bsky.app/img/feed_thumbnail/plain/did:plc:sssh66tbit7kv4ssomldnc4d/bafkreidsoqtg2mbgdyxu64qu2jivvre3hoxpo2hsiuxi3yxhzve5e7xkei@jpeg" ],
    "url" : [ "https://bsky.app/profile/kat.lol/post/3le2jubhfms2w" ],
    "published" : [ "2024-12-24T13:18:54.256Z" ]
  }
}
