{
  "type" : [ "h-entry" ],
  "properties" : {
    "name" : [ "ThatSexToyGuy (@hungry_joe@mas.to)" ],
    "summary" : [ "some days i wake up feeling low and then i remember that i am indirectly responsible for literally hundreds of thousands of orgasms" ],
    "url" : [ "https://mas.to/@hungry_joe/111890937437352223" ]
  }
}
