{
  "type" : [ "h-entry" ],
  "properties" : {
    "name" : [ "Kat Marchán (@zkat.tech)" ],
    "summary" : [ "I was… probably not gonna last much longer at NPM. I was doing really poorly just trying to do what was apparently needed. I wasn’t on a PIP but I was very close to it.\n\nAnd then I was just… given free rein and that’s when cacache/pacote/NPM5 & 6 happened\n\nIt was kind of incredible\n\n[contains quote post or other embedded content]" ],
    "url" : [ "https://bsky.app/profile/zkat.tech/post/3ljdi4agvlk2e" ],
    "published" : [ "2025-03-01T17:47:30.948Z" ]
  }
}
