{
  "type" : [ "h-entry" ],
  "properties" : {
    "name" : [ "GitHub - nanotee/sqls.nvim: Neovim plugin for sqls that leverages the built-in LSP client" ],
    "summary" : [ "Neovim plugin for sqls that leverages the built-in LSP client - nanotee/sqls.nvim" ],
    "featured" : [ "https://opengraph.githubassets.com/0c96f0a1ab7362cafb12713aceda2108510ee9c2edc4315d82c3c97e69a11055/nanotee/sqls.nvim" ],
    "url" : [ "https://github.com/nanotee/sqls.nvim" ]
  }
}
