{
  "type" : [ "h-card" ],
  "properties" : {
    "name" : [ "Steve" ],
    "photo" : [ {
      "value" : "https://files.mastodon.social/cache/accounts/avatars/109/262/396/351/405/817/original/decea013d528590f.png",
      "alt" : ""
    } ],
    "url" : [ "https://mastodon.org.uk/@steevc/113673994816881224" ]
  },
  "lang" : "en-GB"
}
