{
  "type" : [ "h-entry" ],
  "properties" : {
    "name" : [ "Emilia (@lazerwalker@xoxo.zone)" ],
    "summary" : [ "Attached: 1 image\n\nConfused about the WordPress drama? This corporate governance diagram should clear things up!" ],
    "featured" : [ "https://xoxo-media.sfo2.cdn.digitaloceanspaces.com/media_attachments/files/113/297/704/561/498/245/original/e5ee7bac57208ecb.png" ],
    "url" : [ "https://xoxo.zone/@lazerwalker/113297704893474421" ]
  }
}
