{
  "type" : [ "h-entry" ],
  "properties" : {
    "name" : [ "Fesshole 🧻 (@fesshole@mastodon.social)" ],
    "summary" : [ "In every job I've had before, I put in 100% effort, but ended up exhausted after a few months and hating work. Started a new job last year and consciously decided to only put ~50-60% effort from the off. Manager happy, no burnout and I don't hate work. 10/10, would recommend." ],
    "url" : [ "https://mastodon.social/@fesshole/113630163960783778" ]
  }
}
