{
  "type" : [ "h-entry" ],
  "properties" : {
    "name" : [ "Computer Facts (@computer@facts.computer)" ],
    "summary" : [ "oh yeah i love LLM: Liberate Luigi Mangione" ],
    "url" : [ "https://facts.computer/@computer/113625661156079404" ]
  }
}
