{
  "type" : [ "h-entry" ],
  "properties" : {
    "name" : [ "Josie (@gitcute.com)" ],
    "summary" : [ "My team actually likes Gherkin and is pumped that I suggested we use and implement it. 😭😭😭😭😭😭😭😭" ],
    "url" : [ "https://bsky.app/profile/gitcute.com/post/3lgjfkukxik2h" ],
    "published" : [ "2025-01-24T22:02:24.146Z" ]
  }
}
