{
  "type" : [ "h-entry" ],
  "properties" : {
    "name" : [ "Ben Cotton (he/him) (@funnelfiasco@hachyderm.io)" ],
    "summary" : [ "An existential moment for Duck Alignment Academy. I've mostly tried to keep the content evergreen. I have proto-thoughts on the Mastodon announcement, but I'm not sure if DAA is the right venue or if I should put it in the DAA newsletter or on my personal blog (or as a thread on Mastodon for maximum obnoxiousness)" ],
    "url" : [ "https://hachyderm.io/@funnelfiasco/113823251301622078" ]
  }
}
