{
  "type" : [ "h-entry" ],
  "properties" : {
    "name" : [ "Ryan💋 (@ryanhoulihan@mastodon.social)" ],
    "summary" : [ "My parents cut part of my dick off when I was a baby and now I tuck it between my legs voluntarily to wear certain pants and that’s a HUGE issue for them. Very normal" ],
    "url" : [ "https://mastodon.social/@ryanhoulihan/112120368873313669" ]
  }
}
