{
  "type" : [ "h-entry" ],
  "properties" : {
    "name" : [ "Cup o' Go | ⏲️ ⚡️ That feeling when your timer returns the wrong time & new 🌩️ lightning round!" ],
    "summary" : [ "Conferences & CFPs🇮🇱 GopherCon Israel, Sept 9 @ Tel AvivCFP open until Jul 15🇦🇺 GopherCon AU, NoCFP open until Sept 15🇮🇳 GopherCon India, Dec 1 @ Jaipur🇩🇪 Fyne Conf, Sept 20 @ BerlinCFP open until Aug 16🇸🇬 GopherCon Singapore, October TBDCFP open until Aug 19Go 1.23 draft release notes⏲️ Blog:..." ],
    "featured" : [ "https://img.transistor.fm/viBzFgOPpNCvRB5mEq0BClMEWHySkoebRaEIerz0mOw/rs:fill:800:800:1/q:60/aHR0cHM6Ly9pbWct/dXBsb2FkLXByb2R1/Y3Rpb24udHJhbnNp/c3Rvci5mbS9zaG93/LzM3ODYyLzE2NzQ0/ODY4OTgtYXJ0d29y/ay5qcGc.webp" ],
    "audio" : [ "https://media.transistor.fm/9ba76ba5/4a8600a6.mp3" ],
    "url" : [ "https://share.transistor.fm/s/9ba76ba5" ]
  }
}
