{
  "type" : [ "h-entry" ],
  "properties" : {
    "name" : [ "Ep 258: Phil Dunster | Off Menu with Ed Gamble and James Acaster" ],
    "summary" : [ "Listen to Ep 258: Phil Dunster from Off Menu with Ed Gamble and James Acaster. Ted Lasso’s Jamie Tartt (doo-doo-da-doo-da-doo), Phil Dunster, introduces some new vocabulary to the Dream Restaurant this week. And don’t forget, tune in to Comic Relief. Phil Dunster stars in ‘Oklahoma! in Concert’ at London’s Theatre Royal Drury Lane on 19th and 20th August. Get tickets at oklahomaconcert.co.uk Follow Phil on Instagram and Twitter @phildunster Recorded and edited by Ben Williams for Plosive.Artwork by Paul Gilbey (photography and design).Follow Off Menu on Twitter and Instagram: @offmenuofficial.And go to our website www.offmenupodcast.co.uk for a list of restaurants recommended on the show.Watch Ed and James's YouTube series 'Just Puddings'. Watch here." ],
    "featured" : [ "https://res.cloudinary.com/pippa/image/fetch/c_pad,w_600,h_315/https://assets.pippa.io/shows/61ba04aa1a8cbee88a3cf0d8/1721396092438-d1e3ab058072dd938e92edab0ddf5f5b.jpeg" ],
    "audio" : [ "https://open.acast.com/public/streams/b19ac1f5-6adf-4c8b-aa1a-2af2160f99e4/episodes/669a6d18a3714ab13ee2b2df.mp3" ],
    "url" : [ "https://shows.acast.com/offmenu/episodes/ep-258-phil-dunster" ]
  }
}
