{
  "type" : [ "h-entry" ],
  "properties" : {
    "name" : [ "Lifenotes #44: July 2024" ],
    "summary" : [ "Pride, Steelcon, and a break from therapy" ],
    "featured" : [ "https://carol.gg/og-images//lifenotes-44.jpg" ],
    "url" : [ "https://carol.gg/blog/lifenotes-44/" ]
  }
}
