{
  "type" : [ "h-entry" ],
  "properties" : {
    "name" : [ "Cup o' Go | “I don't have money, but I do have a very particular set of ~skills~ connectors” — Ashley Jeffs" ],
    "summary" : [ "Go 1.22.4 & 1.21.11 releasedProposalsNew: safer file open functionsgithub.com/google/safeopen alternativeopenat man pageNew: allow range-over-func to omit iteration variablesBlog: Flaky Tests Overhaul at UberBlog: Redpanda acquires Benthos to expand its end-to-end streaming data platformInterview..." ],
    "featured" : [ "https://img.transistor.fm/viBzFgOPpNCvRB5mEq0BClMEWHySkoebRaEIerz0mOw/rs:fill:800:800:1/q:60/aHR0cHM6Ly9pbWct/dXBsb2FkLXByb2R1/Y3Rpb24udHJhbnNp/c3Rvci5mbS9zaG93/LzM3ODYyLzE2NzQ0/ODY4OTgtYXJ0d29y/ay5qcGc.webp" ],
    "audio" : [ "https://media.transistor.fm/fb4556e4/facb0399.mp3" ],
    "url" : [ "https://share.transistor.fm/s/fb4556e4" ]
  }
}
