{
  "type" : [ "h-entry" ],
  "properties" : {
    "name" : [ "Ruth Cheesley (she/her) (@rcheesley@mastodon.online)" ],
    "summary" : [ "Attached: 1 image\n\nJoin us tomorrow afternoon at State of Open Con for a meetup of the Women of Open Source community!\n\n2pm at the back of the delegate experience area, near the job board.\n\nSee you there!\n\n#WomenOfOpenSource #WOOS #SOOCon #SOOCon24 #StateOfOpenCon" ],
    "featured" : [ "https://files.mastodon.online/media_attachments/files/111/886/930/042/075/774/original/a1dec42b5d783139.jpg" ],
    "url" : [ "https://mastodon.online/@rcheesley/111886941183229988" ]
  }
}
