{
  "type" : [ "h-entry" ],
  "properties" : {
    "name" : [ "Dan's stupid walk account (@stupidmentalhealthwalks@dan.mastohon.com)" ],
    "summary" : [ "Attached: 1 image\n\nwent on a stupid short mental health walk for my stupid mental health in the stupid rain getting stupid wet in the stupid grey outside" ],
    "featured" : [ "https://cdn.masto.host/danmastohoncom/media_attachments/files/111/881/827/572/197/516/original/8669acdcdbec8940.jpeg" ],
    "url" : [ "https://dan.mastohon.com/@stupidmentalhealthwalks/111881828133429539" ]
  }
}
