{
  "type" : [ "h-entry" ],
  "properties" : {
    "name" : [ "OpenUK (@openuk@hachyderm.io)" ],
    "summary" : [ "Attached: 1 image\n\nSave the date for OpenUK Digital Meetup to discuss \"Self-hosting: open source tools for every day\" on January 15 at lunchtime between 12 and 1PM online, hosted by @lornajane@bird.makeup and @www.jvt.me@www.jvt.me. Register for the meetup here: https://www.meetup.com/openuk/events/305457753/ Stay updated on all OpenUK events by subscribing to our newsletter http://eepurl.com/hj3kd5 #opensource #digitalmeetup #openuk #opensourcecommunity" ],
    "featured" : [ "https://media.hachyderm.io/media_attachments/files/113/792/916/069/806/718/original/ea60c17805b00aad.png" ],
    "url" : [ "https://hachyderm.io/@openuk/113792916190621502" ]
  }
}
