{
  "type" : [ "h-entry" ],
  "properties" : {
    "name" : [ "Justin Garrison (@justingarrison.com)" ],
    "summary" : [ "China having my data can’t be used in American courts\n\nEven with nothing to hide I’ve learned that data, motivation, and power can ruin lives" ],
    "url" : [ "https://bsky.app/profile/justingarrison.com/post/3lg4gz3m4ic2z" ],
    "published" : [ "2025-01-19T18:23:38.858Z" ]
  }
}
