{
  "type" : [ "h-entry" ],
  "properties" : {
    "name" : [ "james is actually afk (@james@strangeobject.space)" ],
    "summary" : [ "I’m uncomfortable with my appearance a lot and do not like to draw attention to myself as a sexual object and/or object of desire, so I’ll be brief but\n\nEven in the test garments I wore for three hours for the purposes of fitting, adjustment and colour/feature choosing of this suit: if you were already attracted to me then you’d have awooga eyes if you could have seen me in them" ],
    "url" : [ "https://strangeobject.space/@james/111919873295298036" ]
  }
}
