{
  "type" : [ "h-entry" ],
  "properties" : {
    "name" : [ "Lars-Christian (@lars@mastodon.social)" ],
    "summary" : [ "A decision is made\n\nWhy I've decided to abandon wordpress for a static website.\n\nhttps://lars-christian.com/a-decision-is-made/\n\n#wordpress #webdev #indieweb #smallweb" ],
    "url" : [ "https://mastodon.social/@lars/113295792067298600" ]
  }
}
