{
  "type" : [ "h-entry" ],
  "properties" : {
    "name" : [ "Kefimochi (@kefimochi.bsky.social)" ],
    "summary" : [ "To those who are also looking for engineering roles, what websites are you using?\n\nI know I've been relying on DiversifyTech, LinkedIn & TechLadies. Any other notable ones I should add to my list?" ],
    "url" : [ "https://bsky.app/profile/kefimochi.bsky.social/post/3ljde27u55s2a" ],
    "published" : [ "2025-03-01T16:34:48.258Z" ]
  }
}
