{
  "type" : [ "h-entry" ],
  "properties" : {
    "name" : [ "Church of Jeff (@jeffowski@mastodon.world)" ],
    "summary" : [ "Attached: 1 image" ],
    "featured" : [ "https://s3.eu-central-2.wasabisys.com/mastodonworld/media_attachments/files/111/972/054/769/613/189/original/625239248e31d513.png" ],
    "url" : [ "https://mastodon.world/@jeffowski/111972058122733748" ]
  }
}
