{
  "type" : [ "h-entry" ],
  "properties" : {
    "name" : [ "Adam ♿ (@voltagex@aus.social)" ],
    "summary" : [ "Your automated transcription software should retain swearing. Don't enforce American Puritanism, thanks." ],
    "url" : [ "https://aus.social/@voltagex/112652043168163736" ]
  }
}
