{
  "type" : [ "h-card" ],
  "properties" : {
    "name" : [ "Chris" ],
    "photo" : [ {
      "value" : "https://v1.image.11ty.dev/https%3A%2F%2Fwebmention.io%2Favatar%2Fcdn.masto.host%2F54b10e5e19854635728431367b3e48491e503ecd8e0555fe478b58157498a569.jpg/jpeg/72/",
      "alt" : "Chris"
    } ],
    "url" : [ "https://fediverse.zachleat.com/@zachleat/112917087819399708#favorited-by-109933540955881814" ]
  },
  "lang" : "en"
}
