{
  "type" : [ "h-entry" ],
  "properties" : {
    "name" : [ "DVD (@dvdgc13@octodon.social)" ],
    "summary" : [ "Quantifying your reliance on #OSS by\n@www.jvt.me@www.jvt.me\nThey started to create a dependency tree to determine whether they should take part in #hacktoberfest. But it's not always ☀️🌈 as in some cases all depends on a very fragile library ([xkcd comic#2347](https://xkcd.com/2347/))\nUnderstanding how your business depends on software is important from a few points:\n- how am I affected by migrating away from #OpenSource \n- usage of unwanted libraries\n- understand usage of libraries and their versions\n- discover unmaintained, deprecated or vulnerable software \nBut all that applies to #InnerSource too!!\n\n- how maintained are the dependencies?\n- how are the security practices followed in the supply chain?\n\nHow can we do it? It can be done using #OpenSource with dependency-management-data https://dmd.tanna.dev/ with a CLI and web interface. It uses a #sqlite db, and provides a graphQL api too. And without vendor locking!\n\nDependabot API helped him to get some insights to know where contribute that were helpful to the company he was working. But it was not enough information. endoflife.date helped him to find  what's soon to expire and other similar websites for other info. `dmd` helps in an easier way and it uses #renovate and other tools and services to get all the data for the model.\nThen you can query the db with what you are interested. It comes with some pre-baked queries.\n\nFor #InnerSource you could define advisories and policies for when you don't have open APIs to query for that information. For example, flag when some software is using an old git server instance or set a set of code owners, or how many customer facing is using an outdated dependency.\nTheir [website has some case studies with more examples](https://dmd.tanna.dev/case-studies/).\n\n#SOOCON24" ],
    "url" : [ "https://octodon.social/@dvdgc13/111885042754972688" ]
  }
}
