{
  "type" : [ "h-entry" ],
  "properties" : {
    "name" : [ "Daria J. (@0xdariaj@tenforward.social)" ],
    "summary" : [ "@www.jvt.me@www.jvt.me sure, I’ve got an updated CV too, but I’m not sure for which position I could apply (I suppose it should be one of those listed under EMEA localisation). Can I send you a DM?" ],
    "url" : [ "https://tenforward.social/@0xdariaj/111851395966703029" ]
  }
}
