{
  "type" : [ "h-card" ],
  "properties" : {
    "name" : [ "Simon Josefsson" ],
    "photo" : [ {
      "value" : "https://secure.gravatar.com/avatar/f49a5ecb8dc861de71770e2308d71290?s=64&d=mm&r=x",
      "alt" : ""
    } ],
    "url" : [ "https://blog.josefsson.org" ]
  },
  "lang" : "en-GB"
}
