{
  "type" : [ "h-entry" ],
  "properties" : {
    "name" : [ "Decision Logs" ],
    "summary" : [ "I haven’t been writing much here recently, mostly because (a) I have a new infant at home, and (b) I’ve been spending much of my free time migrating my blog..." ],
    "featured" : [ "https://buttondown.com/static/images/icons/icon-square@400.png" ],
    "url" : [ "https://buttondown.com/j2kun/archive/decision-logs/" ]
  }
}
