{
  "type" : [ "h-entry" ],
  "properties" : {
    "name" : [ "Paul Cantrell (@inthehands@hachyderm.io)" ],
    "summary" : [ "@ElleGray@mstdn.social\nMy mom once went to hear Hannah Arendt speak. During the Q&A, some guy started off with the “more of a comment” opener, and Arendt cut in mid-sentence: “People came here tonight to hear me speak, not you,” and immediately moved to the next question." ],
    "url" : [ "https://hachyderm.io/@inthehands/112537568822635471" ]
  }
}
