{
  "type" : [ "h-entry" ],
  "properties" : {
    "name" : [ "Transparent Salaries | Buffer" ],
    "summary" : [ "See a transparent list of the Buffer team’s salaries, along with Buffer’s salary formula and overall approach to compensation." ],
    "featured" : [ "https://buffer.com/static/ogImages/salaries-page-og.png" ],
    "url" : [ "https://buffer.com/salaries" ]
  }
}
