{
  "type" : [ "h-entry" ],
  "properties" : {
    "name" : [ "Microfeatures I Love in Blogs and Personal Websites" ],
    "summary" : [ "In this post, I talk about pleasant but seemingly minor features in personal sites" ],
    "url" : [ "https://danilafe.com/blog/blog_microfeatures/" ]
  }
}
