{
  "type" : [ "h-entry" ],
  "properties" : {
    "name" : [ "Anders Eknert (@anderseknert@hachyderm.io)" ],
    "summary" : [ "I just published #Regal v0.16.0. This release brings two new linter rules, but most importantly it adds a language server (LSP) mode to Regal, allowing editor integrations to lint your workspace continuously as you work on your #Rego policies. Client implementations soon to follow. Exciting times!\n\nThanks @charlieegan3 for an awesome contribution!\n\nhttps://github.com/StyraInc/regal/releases/tag/v0.16.0\n\n#OPA #Linter #DevOps #DevSecOps #IAM #PolicyAsCode" ],
    "url" : [ "https://hachyderm.io/@anderseknert/111879308699591551" ]
  }
}
