{
  "type" : [ "h-entry" ],
  "properties" : {
    "name" : [ "🍉 LA Legault (@LALegault@newsie.social)" ],
    "summary" : [ "You wouldn’t put a mask on your face to protect yourselves but you will walk around with that ridiculous Apple headset 🤦🏼‍♀️" ],
    "url" : [ "https://newsie.social/@LALegault/111894805299748696" ]
  }
}
