{
  "type" : [ "h-entry" ],
  "properties" : {
    "name" : [ "Episode 66: Open Source Founders Summit 05f524, with Emily Omier, Founder | Open Source Underdogs" ],
    "featured" : [ "https://opensourceunderdogs.com/wp-content/themes/dixie-secondline/images/logo.png", "https://opensourceunderdogs.com/wp-content/uploads/2024/02/podcast-thumb_Emily-Omier-Ver-2.jpg", "https://opensourceunderdogs.com/wp-content/uploads/2019/01/spotify.png", "https://opensourceunderdogs.com/wp-content/uploads/wordpress-popular-posts/2323-featured-720x400.jpg", "https://opensourceunderdogs.com/wp-content/uploads/wordpress-popular-posts/1160-featured-720x400.jpg", "https://opensourceunderdogs.com/wp-content/uploads/wordpress-popular-posts/2310-featured-720x400.jpg", "https://opensourceunderdogs.com/wp-content/uploads/2019/01/spotify.png" ],
    "audio" : [ "https://opensourceunderdogs.com/wp-content/uploads/2024/02/066founders-summit.mp3?_=4" ],
    "url" : [ "https://opensourceunderdogs.com/episode-66-open-source-founders-summit-05f524-with-emily-omier-founder/" ],
    "published" : [ "2024-02-26T18:05:06+00:00" ]
  }
}
