{
  "type" : [ "h-entry" ],
  "properties" : {
    "name" : [ "Terence Eden (@Edent@mastodon.social)" ],
    "summary" : [ "I also have an intimidatingly large room to fill.\nSo if you'd like to see a guy with a beard who *isn't* a billionaire talking about embedding a culture of Open Source, please come along 😄\n\nhttps://fosdem.org/2025/schedule/event/fosdem-2025-4411-lessons-learned-open-sourcing-the-uk-s-covid-tracing-app/\n\n#FOSDEM" ],
    "url" : [ "https://mastodon.social/@Edent/113879619080801023" ]
  }
}
