{
  "type" : [ "h-entry" ],
  "properties" : {
    "name" : [ "Ryan💋 (@ryanhoulihan@mastodon.social)" ],
    "summary" : [ "So the “left” is just fully xenophobic and stealing companies to give to other rich people now. Cool! https://www.wsj.com/politics/policy/biden-backs-effort-to-force-sale-of-tiktok-by-chinese-owners-ba989656" ],
    "url" : [ "https://mastodon.social/@ryanhoulihan/112062923957517909" ]
  }
}
