{
  "type" : [ "h-entry" ],
  "properties" : {
    "name" : [ "TC 💖 (@talia_christine@beige.party)" ],
    "summary" : [ "Attached: 1 image" ],
    "featured" : [ "https://media.beige.party/media_attachments/files/112/139/490/263/899/029/original/84c851ecd3c4f1d3.jpg" ],
    "url" : [ "https://beige.party/@talia_christine/112139519225547554" ]
  }
}
