{
  "type" : [ "h-entry" ],
  "properties" : {
    "name" : [ "ThatSexToyGuy (@hungry_joe@mas.to)" ],
    "summary" : [ "Attached: 1 image\n\neveryone in this cafe: look at him running his own business from his laptop, must be a real high achiever\n\nme:" ],
    "featured" : [ "https://media.mas.to/media_attachments/files/112/299/152/452/430/507/original/42b18849de138395.png" ],
    "url" : [ "https://mas.to/@hungry_joe/112299152731780395" ]
  }
}
