{
  "type" : [ "h-entry" ],
  "properties" : {
    "name" : [ "Justin Garrison (@justingarrison.com)" ],
    "summary" : [ "Trans rights are human rights 🏳️‍⚧️" ],
    "url" : [ "https://bsky.app/profile/justingarrison.com/post/3lg7uunbay22c" ],
    "published" : [ "2025-01-21T03:09:41.167Z" ]
  }
}
