{
  "type" : [ "h-entry" ],
  "properties" : {
    "name" : [ "Anders Eknert (@anderseknert@hachyderm.io)" ],
    "summary" : [ "Attached: 1 image\n\nTwo tired parents after two weeks of traveling with kids. But last night we got a few hours of alone time and a great meal at a local restaurant in the middle of nowhere, and we really should be doing more of that." ],
    "featured" : [ "https://media.hachyderm.io/media_attachments/files/112/820/886/726/917/614/original/d59ddb5b39a8e501.jpeg" ],
    "url" : [ "https://hachyderm.io/@anderseknert/112820886981227334" ]
  }
}
