{
  "type": [
    "h-event"
  ],
  "properties": {
    "url": [
      "https://www.oggcamp.com/"
    ],
    "name": [
      "OggCamp 2024"
    ],
    "start": [
      "2024-10-12T09:00:00+0100"
    ],
    "end": [
      "2024-10-13T18:00:00+0100"
    ],
    "location": [
      {
        "properties": {
          "street-address": [
            "Manchester Conference Centre, Sackville Street"
          ],
          "locality": [
            "Manchester"
          ],
          "country-name": [
            "United Kingdom"
          ]
        },
        "type": [
          "h-adr"
        ]
      }
    ]
  }
}
