{
  "type" : [ "h-entry" ],
  "properties" : {
    "name" : [ "Ana Rodrigues (@anarodrigues@front-end.social)" ],
    "summary" : [ "My untested theory is that both offices and houses now being open plan have put us in constant sensory overload." ],
    "url" : [ "https://front-end.social/@anarodrigues/113369704407387836" ]
  }
}
