{
  "type" : [ "h-entry" ],
  "properties" : {
    "name" : [ "Luna (@luna@pony.social)" ],
    "summary" : [ "I wrote some code. It hurts to look at.\n\nhttps://moonbase.lgbt/blog/minimum-wage-clock/" ],
    "url" : [ "https://pony.social/@luna/111698866563549177" ]
  }
}
