{
  "type" : [ "h-entry" ],
  "properties" : {
    "name" : [ "GitHub - sqls-server/sqls: SQL language server written in Go." ],
    "summary" : [ "SQL language server written in Go. Contribute to sqls-server/sqls development by creating an account on GitHub." ],
    "featured" : [ "https://opengraph.githubassets.com/b0dc26dd8194f5e89fa0d91a5d0c70046eee6455ba1749de9b23755360fa2fb5/sqls-server/sqls" ],
    "url" : [ "https://github.com/sqls-server/sqls" ]
  }
}
