{
  "type" : [ "h-entry" ],
  "properties" : {
    "name" : [ "How to Build Anything Extremely Quickly - Learn How To Learn" ],
    "summary" : [ "Do \"outline speedrunning\": Recursively outline an MVP, speedrun filling it in, and only then go back and perfect. This is a ~10x speed up over the 'loading-bar' style (more on that below) Don't just read this article and move on. Go out and do this for the very next thing you make so y" ],
    "featured" : [ "https://7vaf67.p3cdn1.secureserver.net/wp-content/uploads/2024/06/image-3.png" ],
    "author" : [ {
      "type" : [ "h-card" ],
      "properties" : {
        "name" : [ "dnbt777" ]
      }
    } ],
    "url" : [ "https://learnhowtolearn.org/how-to-build-extremely-quickly/" ],
    "published" : [ "2024-06-11T05:40:58+00:00" ]
  }
}
