{
  "type" : [ "h-entry" ],
  "properties" : {
    "name" : [ "Max Böck (@mxbck@front-end.social)" ],
    "summary" : [ "I've got a lot of web dev content in my feed reader and that's cool but every once in a while someone posts something completely unrelated to tech and I AM HERE FOR IT!\n\nDon't be afraid to write about your hobbies, music, movies, life. I love to read that. 💜" ],
    "url" : [ "https://front-end.social/@mxbck/111908527658839573" ]
  }
}
