{
  "type" : [ "h-entry" ],
  "properties" : {
    "name" : [ "Kaizen! Should we build a CDN? with Gerhard Lazu (Changelog &amp; Friends #26)" ],
    "summary" : [ "It’s our 13th Kaizen episode! We’re back from KubeCon, we’re making goals for the year, we’re migrating to Neon &amp;amp; we’re weighing the pros/cons of building our own custom CDN. " ],
    "featured" : [ "https://cdn.changelog.com/static/images/share/twitter-friends-7fa3c9c5a72765c322b47e92da397fbb.png" ],
    "audio" : [ "https://op3.dev/e/https://cdn.changelog.com/uploads/friends/26/changelog--friends-26.mp3" ],
    "url" : [ "https://changelog.com/friends/26" ]
  }
}
