{
  "type" : [ "h-entry" ],
  "properties" : {
    "name" : [ "Cameron MacLeod (@c_9@mstdn.ca)" ],
    "summary" : [ "If someone tells you the last day of the year is 123123 just unfollow them, you don’t need that unsortable non-ISO8601 negativity in your life." ],
    "url" : [ "https://mstdn.ca/@c_9/111666781485286192" ]
  }
}
