{
  "type" : [ "h-entry" ],
  "properties" : {
    "name" : [ "State of the \"log\" 2024 (Changelog & Friends #74)" ],
    "summary" : [ "Our 7th annual year-end wrap-up is here! We're featuring 12 listener voicemails, dope Breakmaster Cylinder remixes & our favorite episodes of the year. Thanks for listening! 💚" ],
    "featured" : [ "https://snap.fly.dev/friends/74/img" ],
    "audio" : [ "https://op3.dev/e/https://cdn.changelog.com/uploads/friends/74/changelog--friends-74.mp3" ],
    "url" : [ "https://changelog.com/friends/74" ]
  }
}
