{
  "type" : [ "h-entry" ],
  "properties" : {
    "name" : [ "💙 Bwee 💙 - 🏳️‍⚧️:nonbinary:​:bisexual_flag:​ (@Bwee@meow.social)" ],
    "summary" : [ "Attached: 1 video\n\nThis deserves to be on your timeline.\n\nTrust me.\n\n💙💙💙\n\nEdit: Since this is blowing up, may I also suggest you follow me for more cute/wholesome posts? ;3" ],
    "featured" : [ "https://medias.meow.social/media_attachments/files/111/919/253/960/682/896/small/08eba10dc664dcc0.png" ],
    "audio" : [ "https://medias.meow.social/media_attachments/files/111/919/253/960/682/896/original/08eba10dc664dcc0.mp4" ],
    "url" : [ "https://meow.social/@Bwee/111919258471374056" ]
  }
}
