{
  "type" : [ "h-entry" ],
  "properties" : {
    "name" : [ "Introducing our Open Salary System: Reflecting on a Decade of Transparent Salaries at Buffer" ],
    "summary" : [ "Buffer is an intuitive social media management platform trusted by brands, businesses, agencies, and individuals to help drive social media results." ],
    "featured" : [ "https://buffer.com/resources/content/images/2024/01/jeroen-den-otter-N_YtZaG6lhA-unsplash.jpg" ],
    "url" : [ "https://buffer.com/resources/salary-system/" ]
  }
}
