{
  "type" : [ "h-entry" ],
  "properties" : {
    "name" : [ "SwiftOnSecurity (@SwiftOnSecurity@infosec.exchange)" ],
    "summary" : [ "Y’all realize everyone in Helpdesk at your job can just import your browser cookies into their machine remotely and browse your Facebook at their leisure, right?\nLike, you understand what Administrator means? It means unquestioned god from anywhere. It’s not your machine IT’S THEIRS. All you do, all your access, it’s stored to be stolen. Anything hackers can do to ruin your life, IT can do better." ],
    "url" : [ "https://infosec.exchange/@SwiftOnSecurity/112085982419718962" ]
  }
}
