{
  "type" : [ "h-entry" ],
  "properties" : {
    "name" : [ "Charlie O’Hara (@awfulwoman@indieweb.social)" ],
    "summary" : [ "I don’t mean to be a preachy fuck, but the best thing me and Mrs Awfulwoman ever did at Christmas: agree to stop giving each other presents. It absolutely lifts all the stress and makes it a chill time of food, movies, and napping." ],
    "url" : [ "https://indieweb.social/@awfulwoman/113697513674819243" ]
  }
}
