{
  "type" : [ "h-entry" ],
  "properties" : {
    "name" : [ "Tim Banks: VibeRel Advocate (@elchefe.me)" ],
    "summary" : [ "It would be the absolute worst if so many teslas started getting vandalized that insurance companies would no longer insure them, making them really difficult to own, causing their sales numbers to go down and stock prices to drop. That would be truly awful and I'd never want to see that happen." ],
    "url" : [ "https://bsky.app/profile/elchefe.me/post/3liwpqwtmjk2d" ],
    "published" : [ "2025-02-24T15:59:45.657Z" ]
  }
}
