{
  "type" : [ "h-entry" ],
  "properties" : {
    "name" : [ "Cup o' Go | 🤹 Pick any number, but not like that! Bartek Nowotarski talks Go vulnerability research" ],
    "summary" : [ "Consider supporting the show by joining our Patreon!🆕 ReleasesGo 1.22.3 & 1.21.10 coming Tuesday🪇 ConferencesGopherCon Brazil, May 9 & 10GopherDay Taiwan, May 25🤹 Secure RandomnessBlog: Evolving the Go Standard Library with math/rand/v2Blog: Secure Randomness in Go 1.22 by Russ Coxnew proposal:..." ],
    "featured" : [ "https://img.transistor.fm/viBzFgOPpNCvRB5mEq0BClMEWHySkoebRaEIerz0mOw/rs:fill:800:800:1/q:60/aHR0cHM6Ly9pbWct/dXBsb2FkLXByb2R1/Y3Rpb24udHJhbnNp/c3Rvci5mbS9zaG93/LzM3ODYyLzE2NzQ0/ODY4OTgtYXJ0d29y/ay5qcGc.webp" ],
    "audio" : [ "https://media.transistor.fm/c12b2c8a/c3095aa0.mp3" ],
    "url" : [ "https://share.transistor.fm/s/c12b2c8a" ]
  }
}
