{
  "type" : [ "h-entry" ],
  "properties" : {
    "name" : [ "Anarchist Art Ⓐ (@AnarchistArt@mastodon.social)" ],
    "summary" : [ "Attached: 1 image" ],
    "featured" : [ "https://files.mastodon.social/media_attachments/files/112/366/108/195/041/032/original/5cec41fb13b2bea9.jpeg" ],
    "url" : [ "https://mastodon.social/@AnarchistArt/112366108224976367" ]
  }
}
