{
  "type" : [ "h-entry" ],
  "properties" : {
    "name" : [ "danielle 🏳️‍🌈 (@endocrimes@toot.cat)" ],
    "summary" : [ "I'm excited to say that today we're also submitting the #Spin project to the #CNCF #Sandbox (https://github.com/cncf/sandbox/issues/116) alongside @SpinKube@mastodon.social \n\nLets 🔨 some great things together 💖" ],
    "url" : [ "https://toot.cat/@endocrimes/112960866318675325" ]
  }
}
