{
  "type" : [ "h-entry" ],
  "properties" : {
    "name" : [ "Robin Riley (fka Josh) (@josh@josh.tel)" ],
    "summary" : [ "Attached: 1 image\n\nThere's a lot I don't know yet, but no sense in delaying with what I do know – hi, my name is Robin and I'm trans.\n\nI'll be going by Robin Riley, and using they/them pronouns for the foreseeable future. And it's going to take ✨ time ✨ to update my info everywhere, so please bear with me.\n\n:heart_agender: :nonbinary_heart: :heart_trans:" ],
    "featured" : [ "https://josh.tel/system/media_attachments/files/113/723/807/814/210/955/original/9f8b7180ad9275b1.png" ],
    "url" : [ "https://josh.tel/@josh/113723819353288359" ]
  }
}
