{
  "type" : [ "h-entry" ],
  "properties" : {
    "name" : [ "Tim Perry (@pimterry@toot.cafe)" ],
    "summary" : [ "And merged 🚀\n\nStill terrifying. 30-odd lines of code running in every OpenSSL TLS handshake makes this very likely the most widely run code I'll ever write. Hope it works!\n\nhttps://github.com/openssl/openssl/pull/24161" ],
    "url" : [ "https://toot.cafe/@pimterry/112316429090739634" ]
  }
}
