{
  "type" : [ "h-entry" ],
  "properties" : {
    "name" : [ "Replacing Git with Git featuring Scott Chacon (Changelog Interviews #586)" ],
    "summary" : [ "This week we’re talking to Scott Chacon, one of the co-founders of GitHub, to discuss the history and future of Git and Scott’s new project Git Butler, a branch manager tool that’s aiming to improve the developer experience of Git using Git. We also touch on the contentious topic of open source licensing and the challe..." ],
    "featured" : [ "https://cdn.changelog.com/static/images/share/twitter-podcast-0fed02e920a2ff887b9c8ccac88925e1.png" ],
    "audio" : [ "https://op3.dev/e/https://cdn.changelog.com/uploads/podcast/586/the-changelog-586.mp3" ],
    "url" : [ "https://changelog.com/podcast/586" ]
  }
}
