{
  "type" : [ "h-entry" ],
  "properties" : {
    "name" : [ "Tips to enhance productivity and efficiency at work | Into.the.Void." ],
    "summary" : [ "A few months ago I created a list of tips for software (Slack, Gmail, Github, Zoom, Jira, etc) that are commonly used in many companies (Elastic that I work for included) and I believe can improve productivity, efficiency and enhance collaboration, especially in remote/distributed companies. There's nothing ground breaking or new here, but I like" ],
    "featured" : [ "https://www.void.gr/kargig/blog/wp-content/themes/gentle_calm/images/file.gif" ],
    "author" : [ {
      "type" : [ "h-card" ],
      "properties" : {
        "name" : [ "kargig" ]
      }
    } ],
    "url" : [ "https://www.void.gr/kargig/blog/2024/12/22/tips-to-enhance-productivity-and-efficiency-at-work/" ]
  }
}
