{
  "type" : [ "h-entry" ],
  "properties" : {
    "name" : [ "Slight Reliability Episode 88 - OpenTelemetry Revisited with Zach Michel - Slight Reliability" ],
    "summary" : [ "This week Zach Michel from https://middleware.io/ and I discuss the state of OpenTelemetry and what it means to adopt it. We cover:🌩️ Achieving observability in a SaaS world🥫 Context propagation - the magic sauce of OTEL🚪 The telemetry gateway con..." ],
    "featured" : [ "https://www.buzzsprout.com/rails/active_storage/representations/redirect/eyJfcmFpbHMiOnsibWVzc2FnZSI6IkJBaHBCUENudHdjPSIsImV4cCI6bnVsbCwicHVyIjoiYmxvYl9pZCJ9fQ==--73f892ad3e99a93a758507c81b8000208c269f49/eyJfcmFpbHMiOnsibWVzc2FnZSI6IkJBaDdDVG9MWm05eWJXRjBPZ2hxY0djNkUzSmxjMmw2WlY5MGIxOW1hV3hzV3docEFmcHBBZnA3QmpvSlkzSnZjRG9MWTJWdWRISmxPZ3B6WVhabGNuc0dPZ3h4ZFdGc2FYUjVhVUU2RUdOdmJHOTFjbk53WVdObFNTSUpjM0puWWdZNkJrVlUiLCJleHAiOm51bGwsInB1ciI6InZhcmlhdGlvbiJ9fQ==--bfdad5b04912fa8a9db85eb3989e46c5908e2723/Slight%20Reliability%20S02E88%20Buzzsprout.png" ],
    "audio" : [ "https://www.buzzsprout.com/1698445/15632863-slight-reliability-episode-88-opentelemetry-revisited-with-zach-michel.mp3?referrer=https%3A%2F%2Fwww.buzzsprout.com%2F1698445%2F15632863-slight-reliability-episode-88-opentelemetry-revisited-with-zach-michel" ],
    "url" : [ "https://www.buzzsprout.com/1698445/15632863-slight-reliability-episode-88-opentelemetry-revisited-with-zach-michel" ]
  }
}
