{
  "type" : [ "h-entry" ],
  "properties" : {
    "name" : [ "Christine Lemmer-Webber (@cwebber@social.coop)" ],
    "summary" : [ "Attached: 1 image\n\nAnd yes of course it is literally the paper that gives us this incredible FIGURE 1, which you have CERTAINLY seen if you have ever heard ANYONE talk about ANY \"decentralized\" or \"distributed\" system ever\n\nCENTRALIZED DECENTRALIZED DISTRIBUTED\n\nYou know this image. You could never forget this image" ],
    "featured" : [ "https://social-coop-media.ams3.cdn.digitaloceanspaces.com/media_attachments/files/113/648/152/687/761/543/original/a71b6d8e0955a618.png" ],
    "url" : [ "https://social.coop/@cwebber/113648162378176510" ]
  }
}
