{
  "type" : [ "h-entry" ],
  "properties" : {
    "name" : [ "Kastor (@kastor.sh)" ],
    "summary" : [ "I mean he did pump 3 hot loads into another man in broad daylight, kinda asking for fanfic" ],
    "url" : [ "https://bsky.app/profile/kastor.sh/post/3lclcwsbjkc22" ],
    "published" : [ "2024-12-05T18:39:53.860Z" ]
  }
}
