{
  "type" : [ "h-entry" ],
  "properties" : {
    "name" : [ "Scoring your project’s security with Chris Swan (Ship It! #94)" ],
    "summary" : [ "Autumn and Justin are joined by Chris Swan to discuss tech industry trends like AI and sustainability, gamifying the software development process and motivating devs to write more secure code, OpenSSF Scorecards and how they offer a way to measure and improve the security and compliance of GitHub repos, the scoring sys..." ],
    "featured" : [ "https://cdn.changelog.com/static/images/share/twitter-shipit-feb3710d53361bb8a02164926b99f023.png" ],
    "audio" : [ "https://op3.dev/e/https://cdn.changelog.com/uploads/shipit/94/ship-it-94.mp3" ],
    "url" : [ "https://changelog.com/shipit/94" ]
  }
}
