{
  "type" : [ "h-card" ],
  "properties" : {
    "name" : [ "Fynn Becker" ],
    "photo" : [ {
      "value" : "https://v1.image.11ty.dev/https%3A%2F%2Fwebmention.io%2Favatar%2Fcdn.masto.host%2F603647df87876c896689d4ddda396e5a32f290f3f572ce0f3443e030e96b6a68.jpg/jpeg/72/",
      "alt" : "Fynn Becker"
    } ],
    "url" : [ "https://fediverse.zachleat.com/@zachleat/112917087819399708#reblogged-by-109289744030118387" ]
  },
  "lang" : "en"
}
