{
  "type" : [ "h-entry" ],
  "properties" : {
    "name" : [ "Ian Coldwater 📦💥 (@ian@hachyderm.io)" ],
    "summary" : [ "Attached: 1 image\n\nI'D JUST LIKE TO INTERJECT FOR A MOMENT. WHAT YOU'RE REFERRING TO AS LINUX IS IN FACT GNU/LINUX, OR AS I'VE RECENTLY TAKEN TO CALLING IT, GNU + LINUX. LINUX IS NOT AN OPERATING SYSTEM UNTO ITSELF, BUT RATHER ANOTHER FREE COMPONENT OF A FULLY FUNCTIONING GNU SYSTEM" ],
    "featured" : [ "https://media.hachyderm.io/media_attachments/files/111/916/285/866/841/410/original/0feb7b9d6b4fa9aa.png" ],
    "url" : [ "https://hachyderm.io/@ian/111916286580365469" ]
  }
}
