{
  "type" : [ "h-entry" ],
  "properties" : {
    "name" : [ "C J Silverio (@ceejbot@toot.cat)" ],
    "summary" : [ "So: \n\nMu. Ask a different question.\n\nYou have dependencies. You will always have them. Choose them thoughtfully. Invent where it matters most to you, and re-use where it does not, and where you can benefit from somebody else's care & testing.\n\nTalk your employers into sponsoring the important ones if you can, because that will improve their quality. Probably.\n\nThere is no such thing as free-as-in-lunch software.\n\nFIN" ],
    "url" : [ "https://toot.cat/@ceejbot/113097458127513446" ]
  }
}
