{
  "type" : [ "h-entry" ],
  "properties" : {
    "name" : [ "Cup o' Go | 📊 While we wait for Go 1.23, we discuss the latest Stack Overflow survey results" ],
    "summary" : [ "For Patreon, Swag, past episodes, and more, visit 🔗 https://cupogo.dev/!🏛️ Go 1.22.6 & 1.21.13 released  🕵️ CVE-2024-24790 explained (and scored on Synk)🧪 Likely accept: add Context method to testing.T🧑‍💻 StackOverflow 2024 developer survey results" ],
    "featured" : [ "https://img.transistor.fm/viBzFgOPpNCvRB5mEq0BClMEWHySkoebRaEIerz0mOw/rs:fill:800:800:1/q:60/aHR0cHM6Ly9pbWct/dXBsb2FkLXByb2R1/Y3Rpb24udHJhbnNp/c3Rvci5mbS9zaG93/LzM3ODYyLzE2NzQ0/ODY4OTgtYXJ0d29y/ay5qcGc.webp" ],
    "audio" : [ "https://media.transistor.fm/5f1f718b/ea183c44.mp3" ],
    "url" : [ "https://share.transistor.fm/s/5f1f718b" ]
  }
}
