{
  "type" : [ "h-entry" ],
  "properties" : {
    "name" : [ "ThatSexToyGuy (@hungry_joe@mas.to)" ],
    "summary" : [ "Attached: 1 image\n\noh god I should have revised for this test" ],
    "featured" : [ "https://media.mas.to/media_attachments/files/112/739/684/511/953/695/original/30b3cca52d6fb14b.jpg" ],
    "url" : [ "https://mas.to/@hungry_joe/112739684623949837" ]
  }
}
