{
  "type" : [ "h-entry" ],
  "properties" : {
    "name" : [ "Thomas 🔭✨ (@thomasfuchs@hachyderm.io)" ],
    "summary" : [ "“But AI is cheap!” \n\nIt’s not, it has horrendous hardware, server housing and water and power requirements; it’s just that VCs are financing it now so you get in on the hype and later they will charge you rent and it will cost you way more—with inferior results—than, you know, hiring the writers and artists it’s stealing from, but those will be gone by then." ],
    "url" : [ "https://hachyderm.io/@thomasfuchs/112078395590373290" ]
  }
}
