{
  "type" : [ "h-entry" ],
  "properties" : {
    "name" : [ "AnarchoNinaWrites (@AnarchoNinaWrites@jorts.horse)" ],
    "summary" : [ "Brey, I can't explain it any simpler than this:\n\nPlanet is on fire, we know billions of ppl are going to die, we know it's capitalism and the fossil fuels it depends on that's doing this.\n\nAnd what are your leaders doing? What is your state spending money on? Solving this problem? Absolutely not. They're arming themselves to the teeth, militarizing security forces, criminalizing protest, hardening borders, increasing the size of their armies.\n\nYou have to be a dipshit not to see what time it is." ],
    "url" : [ "https://jorts.horse/@AnarchoNinaWrites/113533985614394148" ]
  }
}
