{
  "type" : [ "h-entry" ],
  "properties" : {
    "name" : [ "Alex Rock (@pierstoval@mastodon.social)" ],
    "summary" : [ "I absolutely hate this capitalistic view of Open Source, the saying \"We do whatever we want, it's Open Source anyway\".\n\nThis leads to philosophies like \"Let's rewrite this entire thing our way, and put some marketing on it, this will destroy the previous project and deny the work of all its contributors, but hey, it's Open  Source\".\n\nOr even \"Let's take this entire project, add our brand, put some glitter and marketing on it, and sell it, without giving any fucks to its maintainers\".\n\nHate them." ],
    "url" : [ "https://mastodon.social/@pierstoval/112548701505208359" ]
  }
}
