{
  "type" : [ "h-entry" ],
  "properties" : {
    "name" : [ "Patricia Aas (@Patricia@vivaldi.net)" ],
    "summary" : [ "LaTeX error messages be like: YOU FUCKED UP SOMEWHERE BY DOING SOMETHING WHATEVER FUCK YOU" ],
    "url" : [ "https://social.vivaldi.net/@Patricia/113374923625409818" ]
  }
}
