{
  "type" : [ "h-card" ],
  "properties" : {
    "name" : [ "**kwargs" ],
    "photo" : [ {
      "value" : "https://eigenmagic.net/system/accounts/avatars/110/160/517/822/478/672/original/27313b86889abd40.png",
      "alt" : ""
    } ],
    "url" : [ "https://eigenmagic.net/@arichtman" ]
  },
  "lang" : "en-GB"
}
