{
  "type" : [ "h-entry" ],
  "properties" : {
    "name" : [ "jwz (@jwz@mastodon.social)" ],
    "summary" : [ "Any time I see someone saying something about \"X openly supporting Nazis\" I think, \"That's a *bit* hyperbolic about what happened with the XFree86 / Xorg schism...\"" ],
    "url" : [ "https://mastodon.social/@jwz/111825682833294958" ]
  }
}
