{
  "type" : [ "h-entry" ],
  "properties" : {
    "name" : [ "Dare Obasanjo (@carnage4life@mas.to)" ],
    "summary" : [ "Reading about Platformer leaving Substack after sending the company examples of Nazis hosted on the service and the company tried to discredit them about making a mountain out of a molehill.\n\nSo odd to see Substack ban porn yet go to the mat for Nazis. \n\nhttps://www.platformer.news/p/why-platformer-is-leaving-substack" ],
    "url" : [ "https://mas.to/@carnage4life/111743075287104319" ]
  }
}
