{
  "type" : [ "h-entry" ],
  "properties" : {
    "name" : [ "Low Quality Facts (@lowqualityfacts@mstdn.social)" ],
    "summary" : [ "Attached: 1 image\n\nWe made a comic about a job interview." ],
    "featured" : [ "https://media.mstdn.social/media_attachments/files/112/316/293/733/209/545/original/8dbdf69844c99440.jpg" ],
    "url" : [ "https://mstdn.social/@lowqualityfacts/112316394325165496" ]
  }
}
