{
  "type" : [ "h-entry" ],
  "properties" : {
    "name" : [ "tante (@tante@tldr.nettime.org)" ],
    "summary" : [ "Today more than on most days remember:\n\nWhen people show you who they are, believe them.\n\nThose who lick fascist boot today will never support you." ],
    "url" : [ "https://tldr.nettime.org/@tante/113437207454737495" ]
  }
}
