{
  "type" : [ "h-entry" ],
  "properties" : {
    "name" : [ "yeet" ],
    "featured" : [ "https://yeet.ols.wtf/emu/crt_green_lines.png", "https://yeet.ols.wtf/emu/joy.png" ],
    "url" : [ "https://yeet.ols.wtf/u/ols/h/Z38XWfYCx5v3jRwh41" ]
  }
}
