{
  "type" : [ "h-entry" ],
  "properties" : {
    "name" : [ "Terence Eden (@Edent@mastodon.social)" ],
    "summary" : [ "Attached: 1 image\n\nThanks Google Alerts!" ],
    "featured" : [ "https://files.mastodon.social/media_attachments/files/111/652/087/277/078/938/original/4b18fa76c01b8167.png" ],
    "url" : [ "https://mastodon.social/@Edent/111652087306051536" ]
  }
}
