{
  "type" : [ "h-entry" ],
  "properties" : {
    "name" : [ "🎄ADHDean Festive Edition🎄 (@adhdeanasl@beige.party)" ],
    "summary" : [ "I used to find tech stuff confusing and intimidating. Now, thanks to Mastodon, I still find it confusing and intimidating, but I also realize it’s SUPER boring, too. Thanks, Mastodon!" ],
    "url" : [ "https://beige.party/@adhdeanasl/113662636634409209" ]
  }
}
