{
  "type" : [ "h-entry" ],
  "properties" : {
    "name" : [ "Where I’m at on the whole CSS-Tricks thing" ],
    "summary" : [ "It was March 2022 when I sold CSS-Tricks to DigitalOcean. So it’s been just about 2 years now. This was me and my wife’s thinking: The negotiated sale price was fair. They are a big com…" ],
    "featured" : [ "https://jetpack.com/redirect/?source=sigenerate&query=t%3DeyJpbWciOiJodHRwczpcL1wvY2hyaXNjb3lpZXIubmV0XC93cC1jb250ZW50XC91cGxvYWRzXC8yMDI0XC8wMlwvU2NyZWVuc2hvdC0yMDI0LTAyLTI4LWF0LTEwLjIwLjU5JWUyJTgwJWFmQU0tMTAyNHg3ODkucG5nIiwidHh0IjoiYW55d2F5IHNvcnJ5IGFib3V0IGFsbCB0aGF0IiwidGVtcGxhdGUiOiJmdWxsc2NyZWVuIiwiYmxvZ19pZCI6NzQwNzQyNDh9.x4KuXKouyPG-T31MVhIE_KvvbcQgfv9daDsVAwe5p_sMQ" ],
    "url" : [ "https://chriscoyier.net/2024/02/28/where-im-at-on-the-whole-css-tricks-thing/" ],
    "published" : [ "2024-02-28T19:00:57+00:00" ]
  }
}
