{
  "type" : [ "h-entry" ],
  "properties" : {
    "name" : [ "Terence Eden (@Edent@mastodon.social)" ],
    "summary" : [ "Attached: 1 image\n\nI now have a page which automatically calculates how bad #linkrot is on my blog.\n\nhttps://shkspr.mobi/blog/link-rot/" ],
    "featured" : [ "https://files.mastodon.social/media_attachments/files/113/823/398/922/436/324/original/1e014bc6776d075d.png" ],
    "url" : [ "https://mastodon.social/@Edent/113823405610950698" ]
  }
}
