module gitlab.com/tanna.dev/github-branch-protection

go 1.19

require github.com/google/go-github/v50 v50.0.0

require (
	github.com/golang/protobuf v1.3.2 // indirect
	github.com/google/go-querystring v1.1.0 // indirect
	golang.org/x/crypto v0.0.0-20210817164053-32db794688a5 // indirect
	golang.org/x/net v0.0.0-20210226172049-e18ecbb05110 // indirect
	golang.org/x/oauth2 v0.0.0-20180821212333-d2e6202438be // indirect
	google.golang.org/appengine v1.6.7 // indirect
)
