<svg xmlns="http://www.w3.org/2000/svg" xmlns:xlink="http://www.w3.org/1999/xlink" width="100%" height="100%" viewBox="0 0 4168 685" version="1.1" xml:space="preserve" style="fill-rule:evenodd;clip-rule:evenodd;stroke-linejoin:round;stroke-miterlimit:1.41421;">
    <g transform="matrix(1,0,0,1,-59,-78)">
        <g transform="matrix(4.16667,0,0,4.16667,60,75)">
            <g>
                <g>
                    <g transform="matrix(1,0,0,1,0.000126326,-0.000126326)">
                        <path d="M384.862,85.59C384.862,83.089 384.444,81.054 383.609,79.488C382.776,77.926 381.628,76.698 380.168,75.814C378.708,74.926 376.908,74.325 374.771,74.014C372.632,73.701 370.259,73.545 367.651,73.545C362.019,73.545 356.023,74.639 349.66,76.829C348.199,74.117 347.105,71.561 346.376,69.163C345.646,66.765 345.279,63.897 345.279,60.558C349.869,58.994 354.457,57.847 359.047,57.117C363.635,56.387 367.914,56.021 371.875,56.021C382.723,56.021 391.197,58.628 397.299,63.845C403.4,69.06 406.451,77.402 406.451,88.875L406.451,135.809C402.8,136.956 398.367,138.052 393.152,139.095C387.939,140.138 382.045,140.66 375.474,140.66C370.155,140.66 365.278,140.19 360.845,139.251C356.413,138.313 352.605,136.747 349.427,134.557C346.244,132.369 343.794,129.552 342.071,126.11C340.352,122.667 339.491,118.444 339.491,113.437C339.491,108.432 340.56,104.234 342.698,100.844C344.836,97.455 347.601,94.742 350.989,92.709C354.38,90.675 358.16,89.215 362.333,88.328C366.505,87.441 370.676,86.998 374.848,86.998C377.873,86.998 381.21,87.156 384.862,87.467L384.862,85.59ZM384.862,101.705C383.609,101.496 382.254,101.312 380.792,101.157C379.332,101.001 378.031,100.923 376.882,100.923C371.771,100.923 367.729,101.834 364.756,103.66C361.784,105.485 360.298,108.432 360.298,112.499C360.298,115.212 360.872,117.296 362.019,118.758C363.166,120.217 364.549,121.286 366.165,121.963C367.782,122.642 369.501,123.059 371.327,123.216C373.154,123.371 374.744,123.452 376.098,123.452C377.664,123.452 379.229,123.32 380.792,123.059C382.358,122.798 383.713,122.565 384.862,122.355L384.862,101.705ZM421.262,74.795L411.092,74.795L410.308,71.666L439.566,34.275L443.164,34.275L443.164,57.898L462.094,57.898C462.405,59.464 462.615,60.871 462.721,62.122C462.823,63.375 462.875,64.678 462.875,66.035C462.875,67.494 462.823,68.902 462.721,70.258C462.615,71.615 462.405,73.127 462.094,74.795L443.164,74.795L443.164,106.555C443.164,109.787 443.426,112.394 443.948,114.377C444.467,116.356 445.224,117.922 446.214,119.07C447.207,120.217 448.431,120.999 449.891,121.416C451.351,121.835 453.074,122.043 455.053,122.043C456.619,122.043 458.156,121.912 459.67,121.651C461.181,121.391 462.511,121.156 463.658,120.948C464.39,122.927 464.909,124.988 465.223,127.127C465.537,129.265 465.692,131.17 465.692,132.838C465.692,133.985 465.667,134.949 465.614,135.732C465.562,136.513 465.485,137.272 465.379,138C460.582,139.149 455.629,139.72 450.518,139.72C441.026,139.72 433.776,137.505 428.771,133.074C423.765,128.64 421.262,121.416 421.262,111.404L421.262,74.795ZM479.958,74.795L469.79,74.795L469.006,71.666L498.263,34.275L501.861,34.275L501.861,57.898L520.791,57.898C521.103,59.464 521.313,60.871 521.418,62.122C521.52,63.375 521.573,64.678 521.573,66.035C521.573,67.494 521.52,68.902 521.418,70.258C521.313,71.615 521.103,73.127 520.791,74.795L501.861,74.795L501.861,106.555C501.861,109.787 502.124,112.394 502.644,114.377C503.166,116.356 503.922,117.922 504.912,119.07C505.904,120.217 507.127,120.999 508.589,121.416C510.048,121.835 511.771,122.043 513.75,122.043C515.315,122.043 516.853,121.912 518.367,121.651C519.879,121.391 521.209,121.156 522.356,120.948C523.086,122.927 523.607,124.988 523.919,127.127C524.234,129.265 524.39,131.17 524.39,132.838C524.39,133.985 524.364,134.949 524.311,135.732C524.26,136.513 524.182,137.272 524.077,138C519.279,139.149 514.327,139.72 509.214,139.72C499.724,139.72 492.474,137.505 487.468,133.074C482.462,128.64 479.958,121.416 479.958,111.404L479.958,74.795ZM582.725,89.66C582.517,84.651 581.134,80.611 578.579,77.534C576.024,74.457 572.452,72.917 567.862,72.917C562.647,72.917 558.684,74.378 555.972,77.298C553.261,80.219 551.645,84.339 551.124,89.66L582.725,89.66ZM550.966,105.146C551.384,111.404 553.574,115.941 557.537,118.758C561.5,121.574 566.715,122.982 573.183,122.982C576.729,122.982 580.351,122.642 584.055,121.963C587.758,121.286 591.277,120.321 594.616,119.07C595.763,121.156 596.753,123.659 597.588,126.58C598.422,129.498 598.891,132.629 598.996,135.966C590.86,139.095 581.681,140.66 571.459,140.66C563.951,140.66 557.512,139.617 552.138,137.53C546.768,135.445 542.387,132.549 538.998,128.849C535.608,125.146 533.104,120.739 531.488,115.627C529.872,110.517 529.065,104.938 529.065,98.89C529.065,92.944 529.898,87.364 531.567,82.149C533.234,76.932 535.712,72.397 538.998,68.539C542.283,64.678 546.35,61.628 551.201,59.385C556.051,57.143 561.709,56.021 568.175,56.021C573.807,56.021 578.814,57.012 583.194,58.994C587.575,60.975 591.303,63.688 594.38,67.131C597.457,70.57 599.779,74.666 601.343,79.411C602.908,84.156 603.69,89.242 603.69,94.664C603.69,96.646 603.612,98.603 603.455,100.531C603.299,102.459 603.114,103.999 602.908,105.146L550.966,105.146ZM612.174,57.898C613.738,57.587 615.224,57.351 616.632,57.196C618.042,57.037 619.578,56.96 621.248,56.96C622.813,56.96 624.352,57.066 625.862,57.272C627.376,57.481 628.862,57.743 630.32,58.056C630.635,58.578 630.922,59.333 631.182,60.324C631.443,61.315 631.677,62.358 631.886,63.454C632.095,64.549 632.276,65.642 632.433,66.739C632.59,67.835 632.719,68.744 632.825,69.478C635.119,66.243 637.937,63.348 641.273,60.794C644.611,58.238 648.783,56.96 653.788,56.96C654.833,56.96 656.032,57.012 657.387,57.117C658.742,57.221 659.733,57.377 660.359,57.587C660.568,58.628 660.725,59.828 660.828,61.184C660.935,62.54 660.986,63.948 660.986,65.409C660.986,67.182 660.906,69.111 660.751,71.197C660.594,73.283 660.307,75.264 659.889,77.142C658.742,76.932 657.465,76.829 656.058,76.829C654.65,76.829 653.788,76.829 653.477,76.829C651.702,76.829 649.722,77.012 647.53,77.376C645.341,77.742 643.255,78.706 641.273,80.272C639.29,81.836 637.649,84.183 636.344,87.313C635.041,90.44 634.387,94.821 634.387,100.454L634.387,138.94C632.512,139.251 630.635,139.46 628.756,139.564C626.88,139.669 625.055,139.72 623.281,139.72C621.507,139.72 619.709,139.669 617.883,139.564C616.058,139.46 614.155,139.251 612.174,138.94L612.174,57.898ZM671.4,57.898C672.859,57.587 674.32,57.351 675.779,57.196C677.24,57.037 678.856,56.96 680.63,56.96C682.403,56.96 683.967,57.037 685.323,57.196C686.679,57.351 688.087,57.587 689.547,57.898C689.859,58.42 690.148,59.177 690.408,60.168C690.668,61.158 690.904,62.203 691.112,63.296C691.321,64.392 691.502,65.46 691.659,66.503C691.818,67.546 691.947,68.433 692.051,69.163C692.883,67.6 693.98,66.035 695.337,64.469C696.692,62.907 698.308,61.5 700.185,60.246C702.062,58.994 704.174,57.977 706.522,57.196C708.868,56.412 711.503,56.021 714.423,56.021C727.042,56.021 735.125,60.82 738.672,70.416C740.757,66.556 743.704,63.194 747.51,60.324C751.318,57.455 756.142,56.021 761.984,56.021C771.161,56.021 777.914,58.553 782.242,63.611C786.572,68.668 788.736,76.569 788.736,87.313L788.736,138.783C784.982,139.409 781.277,139.72 777.628,139.72C773.977,139.72 770.274,139.409 766.52,138.783L766.52,93.099C766.52,87.467 765.815,83.14 764.406,80.116C763,77.091 760.158,75.578 755.882,75.578C754.107,75.578 752.362,75.84 750.642,76.36C748.919,76.88 747.355,77.845 745.948,79.254C744.54,80.662 743.393,82.645 742.505,85.2C741.618,87.753 741.175,91.067 741.175,95.134L741.175,138.783C737.42,139.409 733.717,139.72 730.067,139.72C726.417,139.72 722.713,139.409 718.958,138.783L718.958,93.099C718.958,87.467 718.255,83.14 716.846,80.116C715.438,77.091 712.597,75.578 708.321,75.578C706.55,75.578 704.775,75.84 703.001,76.36C701.23,76.88 699.638,77.898 698.23,79.411C696.821,80.922 695.7,83.034 694.867,85.747C694.032,88.458 693.614,92.005 693.614,96.385L693.614,138.783C689.859,139.409 686.159,139.72 682.507,139.72C678.856,139.72 675.155,139.409 671.4,138.783L671.4,57.898ZM833.98,123.763C839.821,123.763 844.019,121.6 846.573,117.27C849.129,112.943 850.407,106.71 850.407,98.576C850.407,90.44 849.129,84.209 846.573,79.88C844.019,75.55 839.821,73.387 833.98,73.387C828.244,73.387 824.098,75.55 821.543,79.88C818.986,84.209 817.708,90.44 817.708,98.576C817.708,106.71 818.986,112.943 821.543,117.27C824.098,121.6 828.244,123.763 833.98,123.763ZM833.98,140.66C827.409,140.66 821.698,139.59 816.849,137.452C811.999,135.315 807.983,132.342 804.802,128.534C801.621,124.727 799.222,120.269 797.607,115.158C795.989,110.047 795.181,104.521 795.181,98.576C795.181,92.631 795.989,87.05 797.607,81.836C799.222,76.621 801.621,72.11 804.802,68.303C807.983,64.495 811.999,61.5 816.849,59.307C821.698,57.117 827.409,56.021 833.98,56.021C840.551,56.021 846.286,57.117 851.189,59.307C856.09,61.5 860.157,64.495 863.393,68.303C866.626,72.11 869.024,76.621 870.59,81.836C872.154,87.05 872.935,92.631 872.935,98.576C872.935,104.521 872.154,110.047 870.59,115.158C869.024,120.269 866.626,124.727 863.393,128.534C860.157,132.342 856.09,135.315 851.189,137.452C846.286,139.59 840.551,140.66 833.98,140.66ZM901.457,103.582C895.615,101.912 891.052,99.436 887.768,96.15C884.482,92.866 882.839,87.937 882.839,81.365C882.839,73.438 885.682,67.235 891.367,62.75C897.05,58.264 904.796,56.021 914.599,56.021C918.667,56.021 922.681,56.387 926.645,57.117C930.609,57.847 934.624,58.941 938.691,60.403C938.482,63.113 937.961,65.929 937.125,68.851C936.293,71.77 935.302,74.325 934.155,76.518C931.651,75.474 928.888,74.561 925.862,73.778C922.839,72.997 919.657,72.606 916.32,72.606C912.773,72.606 910.011,73.153 908.027,74.248C906.046,75.344 905.055,77.091 905.055,79.488C905.055,81.783 905.759,83.4 907.167,84.339C908.575,85.277 910.584,86.166 913.19,86.998L922.108,89.66C925.029,90.493 927.662,91.509 930.009,92.709C932.355,93.909 934.364,95.395 936.032,97.167C937.701,98.94 939.004,101.131 939.942,103.738C940.882,106.346 941.352,109.526 941.352,113.28C941.352,117.141 940.543,120.739 938.926,124.076C937.31,127.414 934.962,130.308 931.886,132.758C928.809,135.211 925.08,137.14 920.699,138.547C916.32,139.956 911.365,140.66 905.837,140.66C903.333,140.66 901.041,140.581 898.955,140.425C896.868,140.267 894.861,140.007 892.931,139.643C891.002,139.277 889.098,138.835 887.221,138.313C885.343,137.792 883.309,137.114 881.119,136.279C881.329,133.462 881.824,130.62 882.605,127.753C883.387,124.886 884.405,122.094 885.656,119.382C889.098,120.739 892.358,121.755 895.435,122.433C898.512,123.112 901.719,123.452 905.055,123.452C906.517,123.452 908.107,123.32 909.826,123.059C911.548,122.798 913.139,122.329 914.599,121.651C916.06,120.973 917.286,120.086 918.276,118.992C919.267,117.897 919.76,116.463 919.76,114.688C919.76,112.187 919.005,110.387 917.493,109.292C915.98,108.198 913.868,107.23 911.158,106.397L901.457,103.582ZM955.569,74.795L945.402,74.795L944.617,71.666L973.873,34.275L977.471,34.275L977.471,57.898L996.402,57.898C996.715,59.464 996.923,60.871 997.029,62.122C997.132,63.375 997.185,64.678 997.185,66.035C997.185,67.494 997.132,68.902 997.029,70.258C996.923,71.615 996.715,73.127 996.402,74.795L977.471,74.795L977.471,106.555C977.471,109.787 977.734,112.394 978.254,114.377C978.777,116.356 979.532,117.922 980.522,119.07C981.515,120.217 982.74,120.999 984.199,121.416C985.658,121.835 987.382,122.043 989.362,122.043C990.927,122.043 992.464,121.912 993.978,121.651C995.489,121.391 996.819,121.156 997.966,120.948C998.697,122.927 999.219,124.988 999.53,127.127C999.845,129.265 1000,131.17 1000,132.838C1000,133.985 999.974,134.949 999.922,135.732C999.87,136.513 999.793,137.272 999.687,138C994.891,139.149 989.937,139.72 984.826,139.72C975.334,139.72 968.085,137.505 963.078,133.074C958.073,128.64 955.569,121.416 955.569,111.404L955.569,74.795ZM218.068,33.133C222.589,32.504 226.938,32.188 231.118,32.188C235.525,32.188 239.876,32.504 244.169,33.133L272.134,91.176L300.946,33.133C304.449,32.504 308.345,32.188 312.64,32.188C316.934,32.188 321.056,32.504 325.012,33.133L330.774,139.716C326.482,140.346 322.414,140.66 318.573,140.66C314.729,140.66 310.946,140.346 307.218,139.716L304.166,62.655L279.421,115.916C277.838,116.126 276.201,116.312 274.505,116.467C272.81,116.625 271.117,116.703 269.421,116.703C267.951,116.703 266.484,116.651 265.016,116.546C263.547,116.441 262.022,116.23 260.439,115.916L237.39,61.551L235.017,139.716C231.402,140.346 227.899,140.66 224.508,140.66C220.892,140.66 217.162,140.346 213.323,139.716L218.068,33.133Z" style="fill:rgb(34,34,34);"/>
                    </g>
                    <g transform="matrix(1,0,0,1,0.000126326,-0.000126326)">
                        <path d="M130.41,16.398L131.275,33.832C145.409,49.447 150.988,71.561 143.952,92.345C133.449,123.37 98.816,139.679 66.598,128.772C34.379,117.866 16.775,83.873 27.278,52.848C34.337,31.995 52.297,17.79 73.098,14.029L84.337,0.75C49.274,-0.199 16.194,21.565 4.358,56.528C-10.184,99.486 12.851,146.099 55.809,160.642C98.767,175.184 145.381,152.148 159.924,109.19C171.74,74.284 158.745,36.963 130.41,16.398Z" style="fill:rgb(34,34,34);"/>
                    </g>
                    <path d="M110.273,67.842L109.678,43.469L109.201,29.444L108.878,17.294C108.878,17.294 108.945,11.435 108.741,10.058C108.698,9.768 108.607,9.533 108.498,9.327L108.457,9.241L108.41,9.166C108.186,8.779 107.832,8.465 107.375,8.31C106.908,8.152 106.424,8.191 106.004,8.372L105.978,8.382L105.833,8.456C105.634,8.553 105.431,8.679 105.233,8.871C104.234,9.84 100.729,14.535 100.729,14.535L93.091,23.991L84.193,34.842L68.915,53.841C68.915,53.841 61.904,62.591 63.453,73.362C65.003,84.132 73.01,89.379 79.222,91.482C85.433,93.585 94.981,94.281 102.755,86.666C110.528,79.051 110.273,67.842 110.273,67.842Z" style="fill:rgb(34,34,34);"/>
                </g>
            </g>
        </g>
    </g>
<wappalyzerData id="wappalyzerData" style="display: none"/><script id="wappalyzerEnvDetection" src="chrome-extension://gppongmhjkpfnbhagpmjfkannfbllamg/js/inject.js"/></svg>