66005050000,60004010000,laulmine,1
66006060000,50001020000,eesti keel,3
66006060000,50001040000,eesti keel,4
66005050000,50001010000,laulmine,1
66006060000,60007010000,eesti keel,4
66006060000,60002010000,eesti keel,3
66006060000,60002010000,eesti keel,3
66006060000,50001010000,eesti keel,2
56003030000,50001030000,matemaatika,1
66005050000,60005010000,laulmine,2
66005050000,50001050000,laulmine,3
66006060000,50001050000,eesti keel,3
66005050000,60006010000,laulmine,5
66006060000,60004010000,eesti keel,4
66006060000,60003010000,eesti keel,5
66005050000,60005010000,laulmine,2
56004040000,60004010000,joonistamine,3
66005050000,60006010000,laulmine,4
66006060000,60002010000,eesti keel,5
56004040000,60003010000,joonistamine,5
66006060000,60006010000,eesti keel,1
56003030000,60002010000,matemaatika,3
66005050000,60005010000,laulmine,5
56004040000,50001030000,joonistamine,5
56003030000,50001040000,matemaatika,3
56004040000,50001010000,joonistamine,5
66005050000,50001040000,laulmine,4
56003030000,50001040000,matemaatika,5
66005050000,60004010000,laulmine,5
56004040000,50001030000,joonistamine,3
56004040000,60004010000,joonistamine,3
56003030000,60006010000,matemaatika,5
56003030000,50001010000,matemaatika,5
56003030000,60003010000,matemaatika,3
66005050000,60003010000,laulmine,5
66006060000,50001040000,eesti keel,5
66006060000,60003010000,eesti keel,4
66005050000,60002010000,laulmine,2
56003030000,50001020000,matemaatika,1
56004040000,50001010000,joonistamine,4
66005050000,50001030000,laulmine,2
56003030000,50001010000,matemaatika,3
56004040000,60006010000,joonistamine,3
56003030000,60002010000,matemaatika,3
56004040000,60003010000,joonistamine,4
66006060000,50001060000,eesti keel,3
66005050000,50001050000,laulmine,3
66005050000,60007010000,laulmine,4
66005050000,50001010000,laulmine,1
66006060000,50001050000,eesti keel,3
66006060000,50001030000,eesti keel,1
66005050000,60006010000,laulmine,4
66006060000,50001050000,eesti keel,2
66006060000,50001030000,eesti keel,1
56003030000,60006010000,matemaatika,1
66006060000,50001030000,eesti keel,3
56004040000,50001050000,joonistamine,5
56004040000,50001010000,joonistamine,5
56003030000,50001050000,matemaatika,3
66005050000,60002010000,laulmine,2
66006060000,60004010000,eesti keel,4
56004040000,50001060000,joonistamine,3
56004040000,50001020000,joonistamine,1
66006060000,60007010000,eesti keel,1
66006060000,60003010000,eesti keel,1
56003030000,60005010000,matemaatika,1
56003030000,60002010000,matemaatika,3
56003030000,50001010000,matemaatika,2
66005050000,60005010000,laulmine,4
66006060000,50001060000,eesti keel,2
56004040000,50001010000,joonistamine,5
66005050000,50001010000,laulmine,4
66006060000,50001030000,eesti keel,3
66005050000,50001020000,laulmine,2
66006060000,50001020000,eesti keel,4
66005050000,60007010000,laulmine,5
56004040000,60006010000,joonistamine,1
56004040000,60007010000,joonistamine,3
66005050000,50001020000,laulmine,4
56004040000,60004010000,joonistamine,4
56004040000,60005010000,joonistamine,3
66006060000,50001040000,eesti keel,1
66006060000,50001040000,eesti keel,2
56004040000,50001020000,joonistamine,3
56004040000,60005010000,joonistamine,1
66006060000,60005010000,eesti keel,1
66006060000,50001020000,eesti keel,2
56003030000,50001050000,matemaatika,4
56004040000,50001010000,joonistamine,3
66006060000,60003010000,eesti keel,3
66006060000,50001060000,eesti keel,3
66005050000,60003010000,laulmine,3
56004040000,50001040000,joonistamine,4
56004040000,50001010000,joonistamine,3
66006060000,60003010000,eesti keel,5
56003030000,60006010000,matemaatika,5
56004040000,60002010000,joonistamine,1
66006060000,50001060000,eesti keel,3
56004040000,50001050000,joonistamine,1
56004040000,60007010000,joonistamine,2
56003030000,50001030000,matemaatika,2
66006060000,60004010000,eesti keel,5
56004040000,50001040000,joonistamine,1
