

888888ba   88888888b  .d888888   a8888a  d8888b. 888888P     88888888b
88    `8b  88        d8'    88  d8' ..8b     `88 88'         88                                     
88     88 a88aaaa    88aaaaa88a 88 .P 88  aaad8' 88baaa.    a88aaaa    dP.  .dP .d8888b. 88d8b.d8b. 
88     88  88        88     88  88 d' 88     `88     `88     88         `8bd8'  88'  `88 88'`88'`88 
88     88  88        88     88  Y8'' .8P     .88      88     88         .d88b.  88.  .88 88  88  88 
dP     dP  dP        88     88   Y8888P  d88888P d88888P     88888888P dP'  `dP `88888P8 dP  dP  dP 
                                                                                                    
                                                                                                    