@startuml

title __MODEL's Class Diagram__\n

  namespace fr.cnam.foad.nfa035.exam {
    namespace model {
      class fr.cnam.foad.nfa035.exam.model.MyExam {
          - codeUe : String
          - date : Date
          - ecole : String
          - intitule : String
          - region : String
          + MyExam()
          + MyExam()
          + equals()
          + getCodeUe()
          + getDate()
          + getEcole()
          + getIntitule()
          + getRegion()
          + setCodeUe()
          + setDate()
          + setEcole()
          + setIntitule()
          + setRegion()
          + toString()
      }
    }
  }
  

  namespace fr.cnam.foad.nfa035.exam {
    namespace model {
      class fr.cnam.foad.nfa035.exam.model.MyExamSortingWrapper {
          + MyExamSortingWrapper()
          + compareTo()
          + getExam()
          + setExam()
          + toString()
      }
    }
  }
  

  fr.cnam.foad.nfa035.exam.model.MyExamSortingWrapper .up.|> java.lang.Comparable
  fr.cnam.foad.nfa035.exam.model.MyExamSortingWrapper o-- fr.cnam.foad.nfa035.exam.model.MyExam : exam


right footer


PlantUML diagram generated by SketchIt! (https://bitbucket.org/pmesmeur/sketch.it)
For more information about this tool, please contact philippe.mesmeur@gmail.com
endfooter

@enduml
