{
	"user1": {
		"password": "abc123",
		"groups": ["group1", "group2"]
	},
	"user2": {
		"password": "xyz789",
		"groups": ["group3"]
	},
	"admin": {
		"password": "qazWSX",
		"groups": ["examples", "default"]
	}
}
