module tangl.es/code/tanglesd

replace (
	tangl.es/code/blobs v0.0.0 => ../blobs
	tangl.es/code/images v0.0.0 => ../images
)

require (
	bitbucket.org/ww/goautoneg v0.0.0-20120707110453-75cd24fc2f2c // indirect
	cloud.google.com/go v0.26.0
	darlinggo.co/version v1.0.0
	github.com/mitchellh/cli v1.0.0
	google.golang.org/api v0.0.0-20180831000444-b810576d88a0
	tangl.es/code/blobs v0.0.0
	tangl.es/code/images v0.0.0
	yall.in v0.0.1
)
