[
{
    "model": "auth.user",
    "pk": 1,
    "fields": {
        "password": "pbkdf2_sha256$216000$SEhiTd9SKQ83$sGAIo7zkTmqqpl7B3M8ZZZQx5ONQKrTQKOD0BfwmKS8=",
        "last_login": "2020-12-31T21:30:45.278Z",
        "is_superuser": true,
        "username": "Tanbot",
        "first_name": "",
        "last_name": "",
        "email": "Tanbot@gsnail.com",
        "is_staff": true,
        "is_active": true,
        "date_joined": "2020-12-31T21:30:34.722Z",
        "groups": [],
        "user_permissions": []
    }
},
{
    "model": "auth.user",
    "pk": 2,
    "fields": {
        "password": "pbkdf2_sha256$216000$yXIr8FADB02y$FuatArhsDPIVN2GHReS7gtiffEV7W0w+rXex/Z8st9o=",
        "last_login": "2020-12-31T21:31:21.638Z",
        "is_superuser": true,
        "username": "JohnMay",
        "first_name": "",
        "last_name": "",
        "email": "jmay526@gmail.com",
        "is_staff": true,
        "is_active": true,
        "date_joined": "2020-12-31T21:21:56.124Z",
        "groups": [],
        "user_permissions": []
    }
},
{
    "model": "users.profile",
    "pk": 1,
    "fields": {
        "user": 1,
        "slack_username": "Tanbot",
        "fullname": "Tanbot Onboard",
        "latest_tanbot_message_id": 1
    }
},
{
    "model": "users.profile",
    "pk": 2,
    "fields": {
        "user": 2,
        "slack_username": "JohnMay",
        "fullname": "John May",
        "latest_tanbot_message_id": 1
    }
}
]

