[
  {
    "model": "users.synonym",
    "pk": 1,
    "fields": {
      "text": "CV",
      "tag": [1, 2],
      "synonym": [2]
    }
  },
  {
    "model": "users.synonym",
    "pk": 2,
    "fields": {
      "text": "resume",
      "tag": [1, 2],
      "synonym": [1]
    }
  },
  {
    "model": "users.synonym",
    "pk": 3,
    "fields": {
      "text": "computer",
      "tag": [1, 3],
      "synonym": [7]
    }
  },
  {
    "model": "users.synonym",
    "pk": 4,
    "fields": {
      "text": "ChatGPT",
      "tag": [3, 4],
      "synonym": [5, 6]
    }
  },
  {
    "model": "users.synonym",
    "pk": 5,
    "fields": {
      "text": "learning",
      "tag": [3],
      "synonym": [4]
    }
  },
  {
    "model": "users.synonym",
    "pk": 6,
    "fields": {
      "text": "logic",
      "tag": [4],
      "synonym": [4]
    }
  },
  {
    "model": "users.synonym",
    "pk": 7,
    "fields": {
      "text": "systems",
      "tag": [1, 2, 3, 4],
      "synonym": [3]
    }
  },
  {
    "model": "users.synonym",
    "pk": 8,
    "fields": {
      "text": "networks",
      "tag": [2, 3, 4],
      "synonym": [7]
    }
  },
  {
    "model": "users.synonym",
    "pk": 9,
    "fields": {
      "text": "vision",
      "tag": [1],
      "synonym": [10]
    }
  },
  {
    "model": "users.synonym",
    "pk": 10,
    "fields": {
      "text": "algorithms",
      "tag": [2],
      "synonym": [9]
    }
  }
]