<?xml version="1.0" encoding="UTF-8"?>
<svg version="1.1" xmlns="http://www.w3.org/2000/svg" width="1622" height="1322">
<path d="M0 0 C6.00850973 0.00248909 12.01700455 -0.00657394 18.02550864 -0.01403749 C29.76925513 -0.02672803 41.51298347 -0.02859078 53.25673488 -0.02623723 C62.81582886 -0.02439558 72.37491617 -0.02618234 81.93400931 -0.03046167 C83.3135131 -0.03106411 84.6930169 -0.03166531 86.07252069 -0.03226527 C88.15204394 -0.03317266 90.23156718 -0.03408133 92.31109043 -0.03499762 C111.61821385 -0.04341354 130.92533478 -0.04777248 150.23245978 -0.0435909 C151.32159374 -0.04335634 151.32159374 -0.04335634 152.43273039 -0.04311704 C156.1117489 -0.04231141 159.7907674 -0.04146564 163.4697859 -0.04060373 C164.56552353 -0.0403471 164.56552353 -0.0403471 165.68339727 -0.04008529 C167.16062712 -0.03973862 168.63785697 -0.03939009 170.11508681 -0.0390397 C193.07191154 -0.03368925 216.0286978 -0.04159928 238.98551536 -0.06007326 C264.85828471 -0.08087006 290.73103024 -0.0915011 316.6038084 -0.08749777 C319.37212936 -0.08710252 322.14045031 -0.08674095 324.90877128 -0.08640039 C325.59025383 -0.08630966 326.27173638 -0.08621893 326.97386992 -0.08612545 C337.18565524 -0.08496773 347.39741622 -0.09154441 357.60919547 -0.10221231 C369.25045999 -0.11436216 380.89167252 -0.11543897 392.53293827 -0.10342214 C398.45543095 -0.09759029 404.37782066 -0.09627292 410.30030608 -0.10842454 C443.75992974 -0.17239876 476.7121766 1.05367122 509.84928489 6.02610838 C510.71063041 6.15238616 511.57197593 6.27866393 512.45942283 6.4087683 C530.03647417 8.99540787 547.41817174 12.26431102 564.72428489 16.27610838 C565.4103884 16.43426024 566.09649192 16.5924121 566.80338645 16.75535643 C603.00451264 25.13712723 638.58915659 36.58114402 672.72428489 51.27610838 C673.63089866 51.66605986 673.63089866 51.66605986 674.55582786 52.06388915 C700.0401505 63.04727091 724.77933981 75.23814332 748.72428489 89.27610838 C750.12928245 90.09933592 750.12928245 90.09933592 751.56266379 90.93919432 C778.93744331 107.07858421 804.95370871 125.38181748 829.72428489 145.27610838 C830.64080832 146.00958495 831.55733176 146.74306151 832.50162864 147.49876463 C844.36701368 157.0990982 855.81445248 167.18651188 866.95084739 177.62034667 C868.88847178 179.42940072 870.83747328 181.22575087 872.78678489 183.02220213 C881.90010106 191.46018807 890.55914834 200.1938951 898.94987082 209.34886229 C900.69774179 211.2472791 902.46156564 213.12929711 904.23209739 215.00657713 C909.88779274 221.01342191 915.3479761 227.0869724 920.50553489 233.53392088 C922.45926328 235.94856407 924.46624391 238.30496231 926.50065207 240.65159667 C934.40882904 249.81099497 941.55436763 259.53552268 948.72428489 269.27610838 C949.29469504 270.04648436 949.8651052 270.81686034 950.45280051 271.61058104 C968.86720771 296.511144 985.05541567 323.01258139 999.72428489 350.27610838 C1000.17303977 351.10126952 1000.62179465 351.92643065 1001.08414817 352.77659667 C1038.39679771 421.58577532 1061.22771118 497.88016851 1074.72428489 718.27610838 C1074.66347739 718.96567626 1074.6026699 719.65524413 1074.54001975 720.36570799 C1066.83545297 806.82889247 1041.7202606 888.96520746 982.72428489 1002.27610838 C982.11729758 1003.27577635 981.51031028 1004.27544432 980.88492942 1005.30540526 C968.86274028 1025.04921392 955.80758872 1043.95043852 941.72428489 1062.27610838 C941.25925559 1062.88148436 940.79422629 1063.48686034 940.3151052 1064.11058104 C934.939624 1071.08290743 929.42112702 1077.91242717 923.69742942 1084.60203612 C920.90968392 1087.86034355 918.20549087 1091.16870409 915.53678489 1094.52610838 C904.07214435 1108.50979624 890.98215692 1121.1155585 878.22428489 1133.90110838 C877.52060782 1134.60746428 876.81693076 1135.31382018 876.09193015 1136.0415808 C874.04528602 1138.09412398 871.99483295 1140.14278099 869.94303489 1142.19017088 C869.03111129 1143.1050553 869.03111129 1143.1050553 868.10076499 1144.03842223 C863.80302332 1148.31352893 859.31779818 1152.32248976 854.72428489 1156.27610838 C853.55663064 1157.298419 852.38980899 1158.32168238 851.22428489 1159.34642088 C784.83075422 1217.40662654 707.7464918 1260.92650169 473.51725364 1320.51438963 C472.53785819 1320.60925658 472.53785819 1320.60925658 471.53867698 1320.70604002 C457.45373118 1322.00258735 443.47129187 1322.42068306 429.33683372 1322.3963629 C427.42561652 1322.39679991 425.51439938 1322.3976772 423.60318255 1322.39895207 C418.39460043 1322.40117153 413.18603914 1322.39721094 407.97745967 1322.39217401 C402.3444231 1322.38783281 396.7113876 1322.38931852 391.07834983 1322.39007628 C381.3330569 1322.3905992 371.5877707 1322.38747669 361.84247947 1322.38183844 C347.75263371 1322.37369193 333.66279119 1322.37110499 319.57294333 1322.36985045 C296.7099769 1322.36766488 273.84701485 1322.36102685 250.98405051 1322.35154784 C228.78222778 1322.34235361 206.58040601 1322.33529172 184.37858176 1322.33104002 C182.98084092 1322.33076938 181.58310008 1322.33049868 180.18535924 1322.33022791 C169.36251428 1322.32814215 158.53966929 1322.32619147 147.71682429 1322.32427335 C94.71930787 1322.31484928 41.72180042 1322.29472869 -11.27571511 1322.27610838 C-11.27571511 1238.78610838 -11.27571511 1155.29610838 -11.27571511 1069.27610838 C-21.50571511 1069.27610838 -31.73571511 1069.27610838 -42.27571511 1069.27610838 C-47.79565767 1068.98421116 -53.17323561 1068.66117111 -58.65071511 1068.08860838 C-60.00967781 1067.95484576 -61.36864611 1067.82114011 -62.72761941 1067.68748534 C-138.29824048 1060.01851193 -213.82716081 1037.3742035 -279.27571511 998.27610838 C-280.26088113 997.68861815 -281.24604714 997.10112792 -282.26106668 996.49583495 C-295.97445807 988.27434783 -309.41909086 979.79148112 -322.27571511 970.27610838 C-322.96874734 969.76563963 -323.66177957 969.25517088 -324.37581277 968.72923338 C-332.48024491 962.74761094 -340.46802444 956.64177965 -348.27571511 950.27610838 C-349.14325418 949.58259276 -350.01079324 948.88907713 -350.90462136 948.17454588 C-356.90414845 943.34420117 -362.62337295 938.29633199 -368.25618386 933.04954588 C-370.39888462 931.05705951 -372.59631495 929.14712297 -374.82259011 927.24876463 C-380.33017856 922.44831529 -385.4490266 917.25214634 -390.60310769 912.0790869 C-392.33466211 910.34217238 -394.0714987 908.61066949 -395.80891824 906.87962401 C-401.51252813 901.17974323 -407.06047369 895.43192979 -412.27571511 889.27610838 C-413.29662508 888.11892567 -414.32005094 886.96395751 -415.34602761 885.81126463 C-422.82602784 877.33546739 -429.83328208 868.58596741 -436.59456277 859.52806151 C-437.73667095 857.99817394 -438.88230884 856.47091637 -440.03108621 854.94603026 C-448.2680345 844.01143077 -456.06950637 832.91654693 -463.27571511 821.27610838 C-464.12021218 819.91969237 -464.12021218 819.91969237 -464.9817698 818.53587401 C-474.90912648 802.52194347 -483.84924298 786.12373961 -492.27571511 769.27610838 C-492.72753152 768.38568846 -493.17934793 767.49526854 -493.64485574 766.5778662 C-518.69612243 717.07179154 -533.9581609 661.96850108 -541.46321511 607.15110838 C-541.61830544 606.02140624 -541.77339578 604.89170409 -541.93318582 603.72776854 C-542.42693454 599.91500588 -542.86717965 596.09873871 -543.27571511 592.27610838 C-543.36398568 591.46338469 -543.45225625 590.650661 -543.54320168 589.81330931 C-545.29952532 573.10005592 -545.62063163 556.43896565 -545.59138894 539.65281737 C-545.58678173 536.79263028 -545.59361198 533.93287103 -545.61189675 531.07273924 C-546.15683607 444.85644032 -523.92999326 360.96558 -436.59505105 209.96019042 C-435.23931101 208.22963994 -433.90115143 206.4864885 -432.56477761 204.74095213 C-427.8246847 198.58528508 -422.91713426 192.5928975 -417.83821511 186.71360838 C-417.36134255 186.16116454 -416.88447 185.60872069 -416.39314675 185.03953612 C-406.94075131 174.21354344 -397.02448722 163.85884706 -386.84700418 153.71702635 C-385.00955751 151.88499843 -383.17759862 150.04760233 -381.34602761 148.20970213 C-375.49210794 142.3521291 -369.61705459 136.61085736 -363.27571511 131.27610838 C-362.14540033 130.29204684 -361.01646826 129.30639459 -359.88899636 128.31907713 C-352.81524056 122.18206738 -345.62513322 116.2722553 -338.12483621 110.66136229 C-336.82268128 109.6858636 -335.52382096 108.70595933 -334.22737527 107.72288573 C-316.69147234 94.43264111 -298.34615817 82.25745408 -279.27571511 71.27610838 C-278.65116433 70.91307616 -278.02661355 70.55004393 -277.38313699 70.17601073 C-214.26462952 33.64938687 -143.00642246 10.15989126 -70.44182277 2.50988102 C-69.0187586 2.3562998 -67.59645733 2.19544212 -66.17511725 2.02664876 C-44.2093074 -0.53553525 -22.07564762 -0.01716282 0 0 Z " fill="#4141F6" transform="translate(545.2757151126862,-0.27610838413238525)"/>
<path d="M0 0 C54.8036351 -0.06884843 109.60726578 -0.12162095 164.41093571 -0.15319599 C170.89879445 -0.15694757 177.38665311 -0.16083059 183.87451172 -0.16479492 C185.16598597 -0.16558185 186.45746022 -0.16636878 187.78807005 -0.16717956 C208.62801064 -0.18019049 229.46792609 -0.20382024 250.30785182 -0.23145839 C271.73305921 -0.25963321 293.15825354 -0.27620162 314.58347869 -0.28226548 C327.77619144 -0.28635704 340.96883312 -0.29922188 354.16152397 -0.3237494 C363.24029352 -0.33975615 372.31902699 -0.34436707 381.39780959 -0.34050413 C386.61535452 -0.33860549 391.83277635 -0.34126067 397.05029869 -0.35761642 C428.98705245 -0.45272327 460.49920111 1.00434458 492.125 5.75 C492.98634552 5.87627777 493.84769104 6.00255554 494.73513794 6.13265991 C512.31218928 8.71929948 529.69388685 11.98820263 547 16 C547.68610352 16.15815186 548.37220703 16.31630371 549.07910156 16.47924805 C585.28022776 24.86101885 620.8648717 36.30503564 655 51 C655.60440918 51.25996765 656.20881836 51.5199353 656.83154297 51.78778076 C682.31586561 62.77116253 707.05505492 74.96203494 731 89 C732.40499756 89.82322754 732.40499756 89.82322754 733.83837891 90.66308594 C761.21315842 106.80247582 787.22942382 125.10570909 812 145 C812.91652344 145.73347656 813.83304688 146.46695313 814.77734375 147.22265625 C826.64272879 156.82298981 838.09016759 166.91040349 849.2265625 177.34423828 C851.16418689 179.15329233 853.11318839 180.94964248 855.0625 182.74609375 C864.17581618 191.18407969 872.83486346 199.91778672 881.22558594 209.07275391 C882.9734569 210.97117072 884.73728075 212.85318873 886.5078125 214.73046875 C892.16350785 220.73731352 897.62369121 226.81086401 902.78125 233.2578125 C904.73497839 235.67245568 906.74195902 238.02885392 908.77636719 240.37548828 C916.68454415 249.53488659 923.83008274 259.2594143 931 269 C931.85561523 270.15556396 931.85561523 270.15556396 932.72851562 271.33447266 C951.14292282 296.23503562 967.33113079 322.73647301 982 350 C982.67313232 351.2377417 982.67313232 351.2377417 983.35986328 352.50048828 C1020.67251282 421.30966693 1043.50342629 497.60406013 1057 718 C1056.9391925 718.68956787 1056.87838501 719.37913574 1056.81573486 720.08959961 C1049.11116808 806.55278408 1023.99597572 888.68909908 965 1002 C964.3930127 1002.99966797 963.78602539 1003.99933594 963.16064453 1005.02929688 C951.1384554 1024.77310553 938.08330383 1043.67433014 924 1062 C923.5349707 1062.60537598 923.06994141 1063.21075195 922.59082031 1063.83447266 C917.21533911 1070.80679904 911.69684213 1077.63631878 905.97314453 1084.32592773 C903.18539904 1087.58423517 900.48120598 1090.8925957 897.8125 1094.25 C886.34785946 1108.23368786 873.25787203 1120.83945012 860.5 1133.625 C859.79632294 1134.3313559 859.09264587 1135.03771179 858.36764526 1135.76547241 C856.32100113 1137.8180156 854.27054807 1139.8666726 852.21875 1141.9140625 C851.3068264 1142.82894691 851.3068264 1142.82894691 850.3764801 1143.76231384 C846.07873843 1148.03742054 841.5935133 1152.04638138 837 1156 C835.83234575 1157.02231061 834.6655241 1158.045574 833.5 1159.0703125 C767.10646933 1217.13051816 690.02220692 1260.6503933 455.79296875 1320.23828125 C455.14003845 1320.30152588 454.48710815 1320.36477051 453.81439209 1320.42993164 C440.08614516 1321.69364412 426.451997 1322.1455402 412.67553711 1322.12025452 C410.87981431 1322.12069163 409.08409158 1322.1215691 407.28836918 1322.12284368 C402.39903059 1322.12506117 397.50971425 1322.12110535 392.62037849 1322.11606562 C387.33090343 1322.11172151 382.04142948 1322.11321034 376.75195312 1322.1139679 C367.6025259 1322.11449063 358.45310584 1322.11137004 349.30368042 1322.10573006 C336.07536916 1322.09758105 322.84706133 1322.09499636 309.61874783 1322.09374207 C288.15338201 1322.09155688 266.68802 1322.08491128 245.22265625 1322.07543945 C224.37890644 1322.06625152 203.53515767 1322.05917745 182.69140625 1322.05493164 C181.40522774 1322.05466892 180.11904922 1322.05440619 178.7938956 1322.05413551 C172.34110698 1322.05283041 165.88831835 1322.05156672 159.43552971 1322.05032361 C105.95701717 1322.03996761 52.47850877 1322.02236383 -1 1322 C-1 1321.67 -1 1321.34 -1 1321 C0.0430127 1320.93530518 1.08602539 1320.87061035 2.16064453 1320.80395508 C46.86830187 1317.98350396 90.57379426 1312.31174324 134 1301 C134.96942535 1300.74796814 134.96942535 1300.74796814 135.95843506 1300.49084473 C188.97902783 1286.6670405 240.70854671 1267.358345 288.52294922 1240.38916016 C290.90174925 1239.05510021 293.29292193 1237.7474902 295.69140625 1236.44921875 C330.98847128 1217.28165387 364.63005879 1193.67310647 395.07421875 1167.4921875 C397.75779581 1165.20631011 400.49038526 1163.00529732 403.25 1160.8125 C410.44977882 1154.9502708 417.08526471 1148.4790353 423.80371094 1142.07861328 C425.93017891 1140.06608012 428.07387499 1138.07427407 430.2265625 1136.08984375 C437.9996276 1128.91513226 445.38439982 1121.56053115 452.45654297 1113.69628906 C454.72454135 1111.20371508 457.04452866 1108.7612468 459.359375 1106.31225586 C464.71470602 1100.63723561 469.86841479 1094.89214838 474.73828125 1088.7890625 C476.86799421 1086.16278434 479.06077801 1083.61181927 481.28442383 1081.06567383 C488.29658098 1073.02057069 494.70481967 1064.61266975 501 1056 C501.77512939 1054.9483667 501.77512939 1054.9483667 502.56591797 1053.87548828 C555.39162373 982.18926585 592.70462814 901.37906653 632 673 C632.01514648 672.00516602 632.03029297 671.01033203 632.04589844 669.98535156 C632.93000396 603.54805572 624.13066714 536.66539917 605 473 C604.78128235 472.27208252 604.5625647 471.54416504 604.33721924 470.79418945 C594.60978264 438.58519767 582.61393993 407.320284 568 377 C567.65839844 376.29037109 567.31679687 375.58074219 566.96484375 374.84960938 C565.07897022 370.95951802 563.13616943 367.10156111 561.15771484 363.2578125 C559.80809361 360.62573803 558.47747241 357.9843095 557.14453125 355.34375 C537.73695627 317.16273584 513.81766057 281.36739947 487 248 C486.25492188 247.071875 485.50984375 246.14375 484.7421875 245.1875 C475.40947929 233.68050493 465.71725675 222.52465435 455.59472656 211.70800781 C453.90858191 209.90208804 452.23110592 208.08838743 450.5546875 206.2734375 C436.95830648 191.55002879 436.95830648 191.55002879 422.24609375 177.96484375 C419.78264765 175.80986394 417.40000427 173.58144964 415.01464844 171.34082031 C409.39631592 166.06481271 403.70715624 160.98113094 397.6875 156.16015625 C394.87702252 153.90115327 392.12714946 151.57960477 389.375 149.25 C381.77579517 142.91406505 373.92151421 136.92584484 366 131 C365.30696777 130.48066895 364.61393555 129.96133789 363.89990234 129.42626953 C338.6488575 110.60233137 311.73734498 93.89656131 284 79 C283.02740234 78.47680176 282.05480469 77.95360352 281.05273438 77.41455078 C231.61444845 50.96247222 179.30149206 31.98065771 124.95916748 18.4876709 C123.22702117 18.05650952 121.49644285 17.6190595 119.76611328 17.18066406 C80.71788199 7.33840755 40.13386197 3.09039383 0 1 C0 0.67 0 0.34 0 0 Z " fill="#A19AFD" transform="translate(563,0)"/>
<path d="M0 0 C0 352.77 0 705.54 0 1069 C-36.01466049 1069 -36.01466049 1069 -47.375 1067.8125 C-48.73396269 1067.67873738 -50.09293099 1067.54503173 -51.4519043 1067.41137695 C-127.02252536 1059.74240354 -202.5514457 1037.09809512 -268 998 C-268.98516602 997.41250977 -269.97033203 996.82501953 -270.98535156 996.21972656 C-284.69874296 987.99823945 -298.14337575 979.51537274 -311 970 C-311.69303223 969.48953125 -312.38606445 968.9790625 -313.10009766 968.453125 C-321.2045298 962.47150256 -329.19230933 956.36567126 -337 950 C-337.86753906 949.30648437 -338.73507812 948.61296875 -339.62890625 947.8984375 C-345.62843334 943.06809279 -351.34765784 938.02022361 -356.98046875 932.7734375 C-359.1231695 930.78095112 -361.32059984 928.87101459 -363.546875 926.97265625 C-369.05446344 922.1722069 -374.17331148 916.97603796 -379.32739258 911.80297852 C-381.058947 910.066064 -382.79578359 908.33456111 -384.53320312 906.60351562 C-390.23681302 900.90363485 -395.78475858 895.15582141 -401 889 C-402.02090997 887.84281728 -403.04433583 886.68784913 -404.0703125 885.53515625 C-411.55031273 877.05935901 -418.55756697 868.30985902 -425.31884766 859.25195312 C-426.46095583 857.72206555 -427.60659373 856.19480799 -428.75537109 854.66992188 C-436.99231939 843.73532239 -444.79379126 832.64043855 -452 821 C-452.84449707 819.64358398 -452.84449707 819.64358398 -453.70605469 818.25976562 C-463.63341136 802.24583508 -472.57352787 785.84763122 -481 769 C-481.45181641 768.10958008 -481.90363281 767.21916016 -482.36914062 766.30175781 C-507.42040732 716.79568316 -522.68244579 661.6923927 -530.1875 606.875 C-530.34259033 605.74529785 -530.49768066 604.6155957 -530.6574707 603.45166016 C-531.15121943 599.6388975 -531.59146454 595.82263032 -532 592 C-532.08827057 591.18727631 -532.17654114 590.37455261 -532.26748657 589.53720093 C-534.0238102 572.82394753 -534.34491652 556.16285726 -534.31567383 539.37670898 C-534.31106662 536.5165219 -534.31789687 533.65676265 -534.33618164 530.79663086 C-534.88112096 444.58033194 -512.65427815 360.68947162 -425.31933594 209.68408203 C-423.9635959 207.95353155 -422.62543632 206.21038012 -421.2890625 204.46484375 C-416.54896959 198.30917669 -411.64141914 192.31678911 -406.5625 186.4375 C-406.08562744 185.88505615 -405.60875488 185.3326123 -405.11743164 184.76342773 C-395.6650362 173.93743505 -385.74877211 163.58273868 -375.57128906 153.44091797 C-373.7338424 151.60889005 -371.9018835 149.77149395 -370.0703125 147.93359375 C-364.21639283 142.07602071 -358.34133948 136.33474897 -352 131 C-350.86968522 130.01593846 -349.74075315 129.03028621 -348.61328125 128.04296875 C-341.53952544 121.905959 -334.34941811 115.99614692 -326.84912109 110.38525391 C-325.54696617 109.40975522 -324.24810585 108.42985094 -322.95166016 107.44677734 C-305.41575723 94.15653272 -287.07044305 81.98134569 -268 71 C-267.37544922 70.63696777 -266.75089844 70.27393555 -266.10742188 69.89990234 C-202.02947565 32.81805213 -130.5137688 10.16464823 -57 2 C-55.47004395 1.82428467 -55.47004395 1.82428467 -53.90917969 1.64501953 C-35.84153456 -0.36881372 -18.31798906 0 0 0 Z " fill="#6767E4" transform="translate(534,0)"/>
</svg>
