email,name,is_active,is_admin,project_name,contact_origin_name
vlad@tangibleai.com,Vlad,TRUE,FALSE,Vlad's Test Project,Vlad's Test Contact
hobson@totalgood.com,Hobson,TRUE,FALSE,Hobson's Test Project,Hobson'a Test Contact
greg@tangibleai.com,Greg,TRUE,FALSE,Greg's Test Project,Greg's Test Contact
cetincakirtr@gmail.com,Cetin,TRUE,FALSE,Cetin's Test Project,Cetin's Test Contact
maria@tangibleai.com,Maria,TRUE,FALSE,Maria's Test Project,Maria's Test Contact