<svg xmlns="http://www.w3.org/2000/svg" xmlns:xlink="http://www.w3.org/1999/xlink" width="62" height="54" viewBox="0 0 62 54">
  <defs>
    <pattern id="pattern" preserveAspectRatio="none" width="100%" height="100%" viewBox="0 0 178 154">
      <image width="178" height="154" xlink:href="12-removebg-preview-image.png"/>
    </pattern>
  </defs>
  <rect id="_12-removebg-preview" data-name="12-removebg-preview" width="62" height="54" fill="url(#pattern)"/>
</svg>
