-- Merging decision tree log ---
manifest
ADDED from /Users/Non/.pub-cache/hosted/pub.dev/mobile_scanner-3.5.5/android/src/main/AndroidManifest.xml:1:1-6:12
INJECTED from /Users/Non/.pub-cache/hosted/pub.dev/mobile_scanner-3.5.5/android/src/main/AndroidManifest.xml:1:1-6:12
INJECTED from /Users/Non/.pub-cache/hosted/pub.dev/mobile_scanner-3.5.5/android/src/main/AndroidManifest.xml:1:1-6:12
	package
		ADDED from /Users/Non/.pub-cache/hosted/pub.dev/mobile_scanner-3.5.5/android/src/main/AndroidManifest.xml:2:3-43
		INJECTED from /Users/Non/.pub-cache/hosted/pub.dev/mobile_scanner-3.5.5/android/src/main/AndroidManifest.xml
		INJECTED from /Users/Non/.pub-cache/hosted/pub.dev/mobile_scanner-3.5.5/android/src/main/AndroidManifest.xml
	xmlns:android
		ADDED from /Users/Non/.pub-cache/hosted/pub.dev/mobile_scanner-3.5.5/android/src/main/AndroidManifest.xml:1:11-69
uses-permission#android.permission.CAMERA
ADDED from /Users/Non/.pub-cache/hosted/pub.dev/mobile_scanner-3.5.5/android/src/main/AndroidManifest.xml:4:5-65
	android:name
		ADDED from /Users/Non/.pub-cache/hosted/pub.dev/mobile_scanner-3.5.5/android/src/main/AndroidManifest.xml:4:22-62
uses-feature#android.hardware.camera
ADDED from /Users/Non/.pub-cache/hosted/pub.dev/mobile_scanner-3.5.5/android/src/main/AndroidManifest.xml:5:5-85
	android:required
		ADDED from /Users/Non/.pub-cache/hosted/pub.dev/mobile_scanner-3.5.5/android/src/main/AndroidManifest.xml:5:58-82
	android:name
		ADDED from /Users/Non/.pub-cache/hosted/pub.dev/mobile_scanner-3.5.5/android/src/main/AndroidManifest.xml:5:19-57
uses-sdk
INJECTED from /Users/Non/.pub-cache/hosted/pub.dev/mobile_scanner-3.5.5/android/src/main/AndroidManifest.xml reason: use-sdk injection requested
INJECTED from /Users/Non/.pub-cache/hosted/pub.dev/mobile_scanner-3.5.5/android/src/main/AndroidManifest.xml
INJECTED from /Users/Non/.pub-cache/hosted/pub.dev/mobile_scanner-3.5.5/android/src/main/AndroidManifest.xml
INJECTED from /Users/Non/.pub-cache/hosted/pub.dev/mobile_scanner-3.5.5/android/src/main/AndroidManifest.xml
INJECTED from /Users/Non/.pub-cache/hosted/pub.dev/mobile_scanner-3.5.5/android/src/main/AndroidManifest.xml
	android:targetSdkVersion
		INJECTED from /Users/Non/.pub-cache/hosted/pub.dev/mobile_scanner-3.5.5/android/src/main/AndroidManifest.xml
		ADDED from /Users/Non/.pub-cache/hosted/pub.dev/mobile_scanner-3.5.5/android/src/main/AndroidManifest.xml
		INJECTED from /Users/Non/.pub-cache/hosted/pub.dev/mobile_scanner-3.5.5/android/src/main/AndroidManifest.xml
	android:minSdkVersion
		INJECTED from /Users/Non/.pub-cache/hosted/pub.dev/mobile_scanner-3.5.5/android/src/main/AndroidManifest.xml
		ADDED from /Users/Non/.pub-cache/hosted/pub.dev/mobile_scanner-3.5.5/android/src/main/AndroidManifest.xml
		INJECTED from /Users/Non/.pub-cache/hosted/pub.dev/mobile_scanner-3.5.5/android/src/main/AndroidManifest.xml
