<svg width="569" height="673" viewBox="0 0 569 673" fill="none" xmlns="http://www.w3.org/2000/svg">
<path fill-rule="evenodd" clip-rule="evenodd" d="M510.957 673L158.434 577.475C149.897 575.161 143.218 568.51 140.87 559.984L1.76934 54.9809C-0.614131 46.3278 1.82396 37.0609 8.15734 30.7012L38.7311 0H544C557.807 0 569 11.1929 569 25V648C569 661.807 557.807 673 544 673H510.957Z" fill="url(#paint0_linear)"/>
<defs>
<linearGradient id="paint0_linear" x1="188" y1="84" x2="671" y2="915" gradientUnits="userSpaceOnUse">
<stop stop-color="#52DE97"/>
<stop offset="1" stop-color="#3C9D9B"/>
</linearGradient>
</defs>
</svg>
