<svg width="34" height="34" viewBox="0 0 34 34" fill="none" xmlns="http://www.w3.org/2000/svg">
<path d="M25.456 24.13L18.2965 16.9706L25.456 9.81111C25.8221 9.44498 25.8221 8.85141 25.456 8.48528C25.0899 8.11915 24.4963 8.11915 24.1302 8.48528L16.9707 15.6447L9.81125 8.48528C9.44512 8.11915 8.85155 8.11915 8.48542 8.48528C8.1193 8.85141 8.1193 9.44498 8.48542 9.81111L15.6449 16.9706L8.48542 24.13C8.1193 24.4961 8.1193 25.0897 8.48542 25.4558C8.85155 25.822 9.44512 25.822 9.81125 25.4558L16.9707 18.2964L24.1302 25.4558C24.4963 25.822 25.0899 25.822 25.456 25.4558C25.8221 25.0897 25.8221 24.4961 25.456 24.13Z" fill="black"/>
</svg>
