{
  "formatVersion": 1,
  "database": {
    "version": 5,
    "identityHash": "afb15244601f1f7eeed0e59e38b43183",
    "entities": [
      {
        "tableName": "language",
        "createSql": "CREATE TABLE IF NOT EXISTS `${TABLE_NAME}` (`id` INTEGER NOT NULL, `name` TEXT, `locale` TEXT, PRIMARY KEY(`id`))",
        "fields": [
          {
            "fieldPath": "id",
            "columnName": "id",
            "affinity": "INTEGER",
            "notNull": true
          },
          {
            "fieldPath": "name",
            "columnName": "name",
            "affinity": "TEXT",
            "notNull": false
          },
          {
            "fieldPath": "locale",
            "columnName": "locale",
            "affinity": "TEXT",
            "notNull": false
          }
        ],
        "primaryKey": {
          "columnNames": [
            "id"
          ],
          "autoGenerate": false
        },
        "indices": [],
        "foreignKeys": []
      },
      {
        "tableName": "preference",
        "createSql": "CREATE TABLE IF NOT EXISTS `${TABLE_NAME}` (`id` INTEGER NOT NULL, `preference_name` TEXT, `language_id` INTEGER NOT NULL, `icon` TEXT, `is_active` INTEGER NOT NULL, `created_at` INTEGER, `updated_at` INTEGER, PRIMARY KEY(`id`), FOREIGN KEY(`language_id`) REFERENCES `language`(`id`) ON UPDATE CASCADE ON DELETE CASCADE )",
        "fields": [
          {
            "fieldPath": "id",
            "columnName": "id",
            "affinity": "INTEGER",
            "notNull": true
          },
          {
            "fieldPath": "preferenceName",
            "columnName": "preference_name",
            "affinity": "TEXT",
            "notNull": false
          },
          {
            "fieldPath": "languageId",
            "columnName": "language_id",
            "affinity": "INTEGER",
            "notNull": true
          },
          {
            "fieldPath": "icon",
            "columnName": "icon",
            "affinity": "TEXT",
            "notNull": false
          },
          {
            "fieldPath": "isActive",
            "columnName": "is_active",
            "affinity": "INTEGER",
            "notNull": true
          },
          {
            "fieldPath": "createdAt",
            "columnName": "created_at",
            "affinity": "INTEGER",
            "notNull": false
          },
          {
            "fieldPath": "updatedAt",
            "columnName": "updated_at",
            "affinity": "INTEGER",
            "notNull": false
          }
        ],
        "primaryKey": {
          "columnNames": [
            "id"
          ],
          "autoGenerate": false
        },
        "indices": [
          {
            "name": "index_preference_language_id",
            "unique": false,
            "columnNames": [
              "language_id"
            ],
            "createSql": "CREATE  INDEX `index_preference_language_id` ON `${TABLE_NAME}` (`language_id`)"
          }
        ],
        "foreignKeys": [
          {
            "table": "language",
            "onDelete": "CASCADE",
            "onUpdate": "CASCADE",
            "columns": [
              "language_id"
            ],
            "referencedColumns": [
              "id"
            ]
          }
        ]
      },
      {
        "tableName": "category",
        "createSql": "CREATE TABLE IF NOT EXISTS `${TABLE_NAME}` (`id` INTEGER NOT NULL, `category_name` TEXT, `description` TEXT, `icon` TEXT, `language_id` INTEGER NOT NULL, `is_active` INTEGER NOT NULL, `created_at` INTEGER, `updated_at` INTEGER, PRIMARY KEY(`id`), FOREIGN KEY(`language_id`) REFERENCES `language`(`id`) ON UPDATE CASCADE ON DELETE CASCADE )",
        "fields": [
          {
            "fieldPath": "id",
            "columnName": "id",
            "affinity": "INTEGER",
            "notNull": true
          },
          {
            "fieldPath": "categoryName",
            "columnName": "category_name",
            "affinity": "TEXT",
            "notNull": false
          },
          {
            "fieldPath": "description",
            "columnName": "description",
            "affinity": "TEXT",
            "notNull": false
          },
          {
            "fieldPath": "icon",
            "columnName": "icon",
            "affinity": "TEXT",
            "notNull": false
          },
          {
            "fieldPath": "languageId",
            "columnName": "language_id",
            "affinity": "INTEGER",
            "notNull": true
          },
          {
            "fieldPath": "isActive",
            "columnName": "is_active",
            "affinity": "INTEGER",
            "notNull": true
          },
          {
            "fieldPath": "createdAt",
            "columnName": "created_at",
            "affinity": "INTEGER",
            "notNull": false
          },
          {
            "fieldPath": "updatedAt",
            "columnName": "updated_at",
            "affinity": "INTEGER",
            "notNull": false
          }
        ],
        "primaryKey": {
          "columnNames": [
            "id"
          ],
          "autoGenerate": false
        },
        "indices": [
          {
            "name": "index_category_language_id",
            "unique": false,
            "columnNames": [
              "language_id"
            ],
            "createSql": "CREATE  INDEX `index_category_language_id` ON `${TABLE_NAME}` (`language_id`)"
          }
        ],
        "foreignKeys": [
          {
            "table": "language",
            "onDelete": "CASCADE",
            "onUpdate": "CASCADE",
            "columns": [
              "language_id"
            ],
            "referencedColumns": [
              "id"
            ]
          }
        ]
      },
      {
        "tableName": "content",
        "createSql": "CREATE TABLE IF NOT EXISTS `${TABLE_NAME}` (`id` INTEGER NOT NULL, `title` TEXT, `short_description` TEXT, `description` TEXT, `content_url` TEXT, `site_url` TEXT, `language_id` INTEGER NOT NULL, `category_id` INTEGER NOT NULL, `preference_id` INTEGER NOT NULL, `user_id` INTEGER NOT NULL, `is_active` INTEGER NOT NULL, `created_by` TEXT, `created_at` INTEGER, `updated_at` INTEGER, `is_bookmark` INTEGER NOT NULL, `is_read` INTEGER NOT NULL, PRIMARY KEY(`id`), FOREIGN KEY(`language_id`) REFERENCES `language`(`id`) ON UPDATE CASCADE ON DELETE CASCADE )",
        "fields": [
          {
            "fieldPath": "id",
            "columnName": "id",
            "affinity": "INTEGER",
            "notNull": true
          },
          {
            "fieldPath": "title",
            "columnName": "title",
            "affinity": "TEXT",
            "notNull": false
          },
          {
            "fieldPath": "shortDescription",
            "columnName": "short_description",
            "affinity": "TEXT",
            "notNull": false
          },
          {
            "fieldPath": "description",
            "columnName": "description",
            "affinity": "TEXT",
            "notNull": false
          },
          {
            "fieldPath": "contentUrl",
            "columnName": "content_url",
            "affinity": "TEXT",
            "notNull": false
          },
          {
            "fieldPath": "siteUrl",
            "columnName": "site_url",
            "affinity": "TEXT",
            "notNull": false
          },
          {
            "fieldPath": "languageId",
            "columnName": "language_id",
            "affinity": "INTEGER",
            "notNull": true
          },
          {
            "fieldPath": "categoryId",
            "columnName": "category_id",
            "affinity": "INTEGER",
            "notNull": true
          },
          {
            "fieldPath": "preferenceId",
            "columnName": "preference_id",
            "affinity": "INTEGER",
            "notNull": true
          },
          {
            "fieldPath": "userId",
            "columnName": "user_id",
            "affinity": "INTEGER",
            "notNull": true
          },
          {
            "fieldPath": "isActive",
            "columnName": "is_active",
            "affinity": "INTEGER",
            "notNull": true
          },
          {
            "fieldPath": "createdBy",
            "columnName": "created_by",
            "affinity": "TEXT",
            "notNull": false
          },
          {
            "fieldPath": "createdAt",
            "columnName": "created_at",
            "affinity": "INTEGER",
            "notNull": false
          },
          {
            "fieldPath": "updatedAt",
            "columnName": "updated_at",
            "affinity": "INTEGER",
            "notNull": false
          },
          {
            "fieldPath": "isBookmark",
            "columnName": "is_bookmark",
            "affinity": "INTEGER",
            "notNull": true
          },
          {
            "fieldPath": "isRead",
            "columnName": "is_read",
            "affinity": "INTEGER",
            "notNull": true
          }
        ],
        "primaryKey": {
          "columnNames": [
            "id"
          ],
          "autoGenerate": false
        },
        "indices": [
          {
            "name": "index_content_language_id",
            "unique": false,
            "columnNames": [
              "language_id"
            ],
            "createSql": "CREATE  INDEX `index_content_language_id` ON `${TABLE_NAME}` (`language_id`)"
          }
        ],
        "foreignKeys": [
          {
            "table": "language",
            "onDelete": "CASCADE",
            "onUpdate": "CASCADE",
            "columns": [
              "language_id"
            ],
            "referencedColumns": [
              "id"
            ]
          }
        ]
      },
      {
        "tableName": "image",
        "createSql": "CREATE TABLE IF NOT EXISTS `${TABLE_NAME}` (`id` INTEGER NOT NULL, `image_url` TEXT, `video_url` TEXT, `content_id` INTEGER NOT NULL, `uploaded_at` INTEGER, PRIMARY KEY(`id`), FOREIGN KEY(`content_id`) REFERENCES `content`(`id`) ON UPDATE CASCADE ON DELETE CASCADE )",
        "fields": [
          {
            "fieldPath": "id",
            "columnName": "id",
            "affinity": "INTEGER",
            "notNull": true
          },
          {
            "fieldPath": "imageUrl",
            "columnName": "image_url",
            "affinity": "TEXT",
            "notNull": false
          },
          {
            "fieldPath": "videoUrl",
            "columnName": "video_url",
            "affinity": "TEXT",
            "notNull": false
          },
          {
            "fieldPath": "contentId",
            "columnName": "content_id",
            "affinity": "INTEGER",
            "notNull": true
          },
          {
            "fieldPath": "uploadedAt",
            "columnName": "uploaded_at",
            "affinity": "INTEGER",
            "notNull": false
          }
        ],
        "primaryKey": {
          "columnNames": [
            "id"
          ],
          "autoGenerate": false
        },
        "indices": [
          {
            "name": "index_image_content_id",
            "unique": false,
            "columnNames": [
              "content_id"
            ],
            "createSql": "CREATE  INDEX `index_image_content_id` ON `${TABLE_NAME}` (`content_id`)"
          }
        ],
        "foreignKeys": [
          {
            "table": "content",
            "onDelete": "CASCADE",
            "onUpdate": "CASCADE",
            "columns": [
              "content_id"
            ],
            "referencedColumns": [
              "id"
            ]
          }
        ]
      },
      {
        "tableName": "question",
        "createSql": "CREATE TABLE IF NOT EXISTS `${TABLE_NAME}` (`id` INTEGER, `is_active` INTEGER NOT NULL, `is_delete` INTEGER NOT NULL, `question_text` TEXT, `content_id` INTEGER, PRIMARY KEY(`id`), FOREIGN KEY(`content_id`) REFERENCES `content`(`id`) ON UPDATE CASCADE ON DELETE CASCADE )",
        "fields": [
          {
            "fieldPath": "id",
            "columnName": "id",
            "affinity": "INTEGER",
            "notNull": false
          },
          {
            "fieldPath": "isActive",
            "columnName": "is_active",
            "affinity": "INTEGER",
            "notNull": true
          },
          {
            "fieldPath": "isDelete",
            "columnName": "is_delete",
            "affinity": "INTEGER",
            "notNull": true
          },
          {
            "fieldPath": "questionText",
            "columnName": "question_text",
            "affinity": "TEXT",
            "notNull": false
          },
          {
            "fieldPath": "contentId",
            "columnName": "content_id",
            "affinity": "INTEGER",
            "notNull": false
          }
        ],
        "primaryKey": {
          "columnNames": [
            "id"
          ],
          "autoGenerate": false
        },
        "indices": [
          {
            "name": "index_question_content_id",
            "unique": false,
            "columnNames": [
              "content_id"
            ],
            "createSql": "CREATE  INDEX `index_question_content_id` ON `${TABLE_NAME}` (`content_id`)"
          }
        ],
        "foreignKeys": [
          {
            "table": "content",
            "onDelete": "CASCADE",
            "onUpdate": "CASCADE",
            "columns": [
              "content_id"
            ],
            "referencedColumns": [
              "id"
            ]
          }
        ]
      },
      {
        "tableName": "nativeads",
        "createSql": "CREATE TABLE IF NOT EXISTS `${TABLE_NAME}` (`id` INTEGER, `title` TEXT, `icon` TEXT, `is_active` INTEGER NOT NULL, `is_delete` INTEGER NOT NULL, PRIMARY KEY(`id`))",
        "fields": [
          {
            "fieldPath": "id",
            "columnName": "id",
            "affinity": "INTEGER",
            "notNull": false
          },
          {
            "fieldPath": "title",
            "columnName": "title",
            "affinity": "TEXT",
            "notNull": false
          },
          {
            "fieldPath": "icon",
            "columnName": "icon",
            "affinity": "TEXT",
            "notNull": false
          },
          {
            "fieldPath": "isActive",
            "columnName": "is_active",
            "affinity": "INTEGER",
            "notNull": true
          },
          {
            "fieldPath": "isDelete",
            "columnName": "is_delete",
            "affinity": "INTEGER",
            "notNull": true
          }
        ],
        "primaryKey": {
          "columnNames": [
            "id"
          ],
          "autoGenerate": false
        },
        "indices": [],
        "foreignKeys": []
      },
      {
        "tableName": "poll",
        "createSql": "CREATE TABLE IF NOT EXISTS `${TABLE_NAME}` (`id` INTEGER PRIMARY KEY AUTOINCREMENT, `question_id` INTEGER, `yes` REAL NOT NULL, `no` REAL NOT NULL)",
        "fields": [
          {
            "fieldPath": "id",
            "columnName": "id",
            "affinity": "INTEGER",
            "notNull": false
          },
          {
            "fieldPath": "questionId",
            "columnName": "question_id",
            "affinity": "INTEGER",
            "notNull": false
          },
          {
            "fieldPath": "yes",
            "columnName": "yes",
            "affinity": "REAL",
            "notNull": true
          },
          {
            "fieldPath": "no",
            "columnName": "no",
            "affinity": "REAL",
            "notNull": true
          }
        ],
        "primaryKey": {
          "columnNames": [
            "id"
          ],
          "autoGenerate": true
        },
        "indices": [],
        "foreignKeys": []
      }
    ],
    "setupQueries": [
      "CREATE TABLE IF NOT EXISTS room_master_table (id INTEGER PRIMARY KEY,identity_hash TEXT)",
      "INSERT OR REPLACE INTO room_master_table (id,identity_hash) VALUES(42, \"afb15244601f1f7eeed0e59e38b43183\")"
    ]
  }
}