<?xml version="1.0"?>
<opencv_storage>
<stage13>
  <maxWeakCount>22</maxWeakCount>
  <stageThreshold>-7.4649339914321899e-01</stageThreshold>
  <weakClassifiers>
    <_>
      <internalNodes>
        0 -1 2727 1.2750850990414619e-02</internalNodes>
      <leafValues>
        -1.3200722634792328e-01 4.7265836596488953e-01</leafValues></_>
    <_>
      <internalNodes>
        0 -1 4444 8.3087585866451263e-02</internalNodes>
      <leafValues>
        -7.0856668055057526e-02 7.0354944467544556e-01</leafValues></_>
    <_>
      <internalNodes>
        0 -1 3371 2.6505440473556519e-02</internalNodes>
      <leafValues>
        -2.4412915110588074e-01 3.0764552950859070e-01</leafValues></_>
    <_>
      <internalNodes>
        0 -1 5439 3.6336439661681652e-03</internalNodes>
      <leafValues>
        4.9002304673194885e-01 -1.4040556550025940e-01</leafValues></_>
    <_>
      <internalNodes>
        0 -1 4454 8.8872173801064491e-03</internalNodes>
      <leafValues>
        2.8362283110618591e-01 -2.7485713362693787e-01</leafValues></_>
    <_>
      <internalNodes>
        0 -1 5745 4.1744045913219452e-02</internalNodes>
      <leafValues>
        1.1967398226261139e-01 -6.0564219951629639e-01</leafValues></_>
    <_>
      <internalNodes>
        0 -1 3651 3.9949391037225723e-02</internalNodes>
      <leafValues>
        1.1466301977634430e-01 -4.9103224277496338e-01</leafValues></_>
    <_>
      <internalNodes>
        0 -1 2354 8.6579076945781708e-02</internalNodes>
      <leafValues>
        -8.2070581614971161e-02 7.7126348018646240e-01</leafValues></_>
    <_>
      <internalNodes>
        0 -1 3591 9.2822052538394928e-03</internalNodes>
      <leafValues>
        2.3050911724567413e-01 -2.7945247292518616e-01</leafValues></_>
    <_>
      <internalNodes>
        0 -1 5588 2.3461282253265381e-02</internalNodes>
      <leafValues>
        1.8109831213951111e-01 -3.4646034240722656e-01</leafValues></_>
    <_>
      <internalNodes>
        0 -1 1865 2.9041590169072151e-03</internalNodes>
      <leafValues>
        -6.9113862514495850e-01 8.7014071643352509e-02</leafValues></_>
    <_>
      <internalNodes>
        0 -1 424 1.3698833063244820e-02</internalNodes>
      <leafValues>
        1.9203330576419830e-01 -2.9171311855316162e-01</leafValues></_>
    <_>
      <internalNodes>
        0 -1 2162 5.4990649223327637e-02</internalNodes>
      <leafValues>
        -1.2481187283992767e-01 4.2087754607200623e-01</leafValues></_>
    <_>
      <internalNodes>
        0 -1 2753 4.9945846199989319e-02</internalNodes>
      <leafValues>
        -1.8925860524177551e-01 3.0176889896392822e-01</leafValues></_>
    <_>
      <internalNodes>
        0 -1 4301 5.2820898592472076e-02</internalNodes>
      <leafValues>
        1.4203229546546936e-01 -5.1660448312759399e-01</leafValues></_>
    <_>
      <internalNodes>
        0 -1 3175 3.7567548453807831e-02</internalNodes>
      <leafValues>
        1.1003249138593674e-01 -4.5271635055541992e-01</leafValues></_>
    <_>
      <internalNodes>
        0 -1 4781 3.1340263783931732e-02</internalNodes>
      <leafValues>
        1.1346253007650375e-01 -4.7743937373161316e-01</leafValues></_>
    <_>
      <internalNodes>
        0 -1 3129 9.4711825251579285e-02</internalNodes>
      <leafValues>
        -6.9026313722133636e-02 9.1880512237548828e-01</leafValues></_>
    <_>
      <internalNodes>
        0 -1 7019 8.0177262425422668e-03</internalNodes>
      <leafValues>
        -6.5586405992507935e-01 9.9580660462379456e-02</leafValues></_>
    <_>
      <internalNodes>
        0 -1 5424 6.4277020283043385e-03</internalNodes>
      <leafValues>
        -7.2553390264511108e-01 5.8267306536436081e-02</leafValues></_>
    <_>
      <internalNodes>
        0 -1 5469 2.5282010436058044e-02</internalNodes>
      <leafValues>
        1.1718522757291794e-01 -4.0183997154235840e-01</leafValues></_>
    <_>
      <internalNodes>
        0 -1 2756 2.6452060788869858e-02</internalNodes>
      <leafValues>
        1.4817140996456146e-01 -3.1722292304039001e-01</leafValues></_></weakClassifiers></stage13>
</opencv_storage>
