<?xml version="1.0"?>
<opencv_storage>
<stage3>
  <maxWeakCount>7</maxWeakCount>
  <stageThreshold>-7.8554004430770874e-01</stageThreshold>
  <weakClassifiers>
    <_>
      <internalNodes>
        0 -1 67879 1058307953 -1651443743 -2130211 536475895 -193921680
        -290394893 1978948860 130735353</internalNodes>
      <leafValues>
        -4.1704034805297852e-01 6.2333911657333374e-01</leafValues></_>
    <_>
      <internalNodes>
        0 -1 162258 -1040189713 -462852113 -65541 -1128727809 -831163099
        -1512573579 -193514443 -857737645</internalNodes>
      <leafValues>
        -3.9858478307723999e-01 5.8356767892837524e-01</leafValues></_>
    <_>
      <internalNodes>
        0 -1 79411 -455094147 -774639535 -2007805639 1225773387
        -511010728 -1450540919 -1978498983 -2113756851</internalNodes>
      <leafValues>
        -5.1060473918914795e-01 4.9369940161705017e-01</leafValues></_>
    <_>
      <internalNodes>
        0 -1 142856 -1430486141 -1915991730 -719317737 -1900838883
        -1448413036 -352245616 17226816 -889511931</internalNodes>
      <leafValues>
        -5.8915710449218750e-01 4.2702808976173401e-01</leafValues></_>
    <_>
      <internalNodes>
        0 -1 72039 -992750764 -805109424 277303639 18303240 -2113781235
        -330672110 1078010527 169826362</internalNodes>
      <leafValues>
        -6.7985433340072632e-01 3.8383552432060242e-01</leafValues></_>
    <_>
      <internalNodes>
        0 -1 79302 -880881604 -1076723632 134287488 -1738733545
        -1694463746 -134045688 1084917854 -1559880325</internalNodes>
      <leafValues>
        -5.9381061792373657e-01 4.7835707664489746e-01</leafValues></_>
    <_>
      <internalNodes>
        0 -1 62365 1549095024 -603749992 135349 1559298630 29378672
        285982929 629266570 1510513034</internalNodes>
      <leafValues>
        -6.8173241615295410e-01 4.1705530881881714e-01</leafValues></_></weakClassifiers></stage3>
</opencv_storage>
