<?xml version="1.0"?>
<opencv_storage>
<stage10>
  <maxWeakCount>29</maxWeakCount>
  <stageThreshold>-8.2393443584442139e-01</stageThreshold>
  <weakClassifiers>
    <_>
      <internalNodes>
        0 -1 3378 1.5958985313773155e-02</internalNodes>
      <leafValues>
        5.3520166873931885e-01 1.8143009394407272e-02</leafValues></_>
    <_>
      <internalNodes>
        0 -1 2978 4.8022992908954620e-02</internalNodes>
      <leafValues>
        -2.1107709407806396e-01 2.7407157421112061e-01</leafValues></_>
    <_>
      <internalNodes>
        0 -1 1142 1.5652935951948166e-02</internalNodes>
      <leafValues>
        1.4915074408054352e-01 -3.6653319001197815e-01</leafValues></_>
    <_>
      <internalNodes>
        0 -1 5145 5.6498698890209198e-02</internalNodes>
      <leafValues>
        5.8524955064058304e-02 -8.7713629007339478e-01</leafValues></_>
    <_>
      <internalNodes>
        0 -1 2154 3.0454378575086594e-02</internalNodes>
      <leafValues>
        1.1927499622106552e-01 -3.9057144522666931e-01</leafValues></_>
    <_>
      <internalNodes>
        0 -1 4581 2.3672349750995636e-02</internalNodes>
      <leafValues>
        1.1455883085727692e-01 -4.4877317547798157e-01</leafValues></_>
    <_>
      <internalNodes>
        0 -1 1039 5.8933001011610031e-02</internalNodes>
      <leafValues>
        1.0437072068452835e-01 -4.8653495311737061e-01</leafValues></_>
    <_>
      <internalNodes>
        0 -1 471 1.6641963273286819e-02</internalNodes>
      <leafValues>
        2.1190372109413147e-01 -2.3627340793609619e-01</leafValues></_>
    <_>
      <internalNodes>
        0 -1 3145 7.6985843479633331e-03</internalNodes>
      <leafValues>
        -8.4148579835891724e-01 4.0009744465351105e-02</leafValues></_>
    <_>
      <internalNodes>
        0 -1 4246 9.3113593757152557e-03</internalNodes>
      <leafValues>
        2.4233372509479523e-01 -2.1095795929431915e-01</leafValues></_>
    <_>
      <internalNodes>
        0 -1 4504 4.1530239395797253e-03</internalNodes>
      <leafValues>
        7.0925283432006836e-01 -1.0322634875774384e-01</leafValues></_>
    <_>
      <internalNodes>
        0 -1 1601 1.0253980755805969e-02</internalNodes>
      <leafValues>
        2.1969465911388397e-01 -2.6116827130317688e-01</leafValues></_>
    <_>
      <internalNodes>
        0 -1 6461 1.9725264981389046e-02</internalNodes>
      <leafValues>
        -2.7239954471588135e-01 2.1699523925781250e-01</leafValues></_>
    <_>
      <internalNodes>
        0 -1 6813 3.1565122306346893e-02</internalNodes>
      <leafValues>
        1.7110973596572876e-01 -3.1629851460456848e-01</leafValues></_>
    <_>
      <internalNodes>
        0 -1 6608 1.3802261091768742e-02</internalNodes>
      <leafValues>
        1.7234042286872864e-01 -3.0852404236793518e-01</leafValues></_>
    <_>
      <internalNodes>
        0 -1 4933 1.3739842921495438e-02</internalNodes>
      <leafValues>
        -4.9362760782241821e-01 1.0613833367824554e-01</leafValues></_>
    <_>
      <internalNodes>
        0 -1 5727 1.1952507495880127e-01</internalNodes>
      <leafValues>
        -6.5564736723899841e-02 7.7778720855712891e-01</leafValues></_>
    <_>
      <internalNodes>
        0 -1 6504 6.2442347407341003e-03</internalNodes>
      <leafValues>
        -8.6259865760803223e-01 7.6894663274288177e-02</leafValues></_>
    <_>
      <internalNodes>
        0 -1 2817 5.4934587329626083e-02</internalNodes>
      <leafValues>
        -1.6485767066478729e-01 3.1080737709999084e-01</leafValues></_>
    <_>
      <internalNodes>
        0 -1 5534 4.0546737611293793e-02</internalNodes>
      <leafValues>
        8.5716135799884796e-02 -6.2079900503158569e-01</leafValues></_>
    <_>
      <internalNodes>
        0 -1 2253 9.2112272977828979e-03</internalNodes>
      <leafValues>
        -5.1062923669815063e-01 8.7474636733531952e-02</leafValues></_>
    <_>
      <internalNodes>
        0 -1 2474 1.8151015974581242e-03</internalNodes>
      <leafValues>
        -5.2923172712326050e-01 9.0193495154380798e-02</leafValues></_>
    <_>
      <internalNodes>
        0 -1 7033 3.4096878021955490e-02</internalNodes>
      <leafValues>
        1.3353243470191956e-01 -3.3944121003150940e-01</leafValues></_>
    <_>
      <internalNodes>
        0 -1 1375 5.5412920191884041e-03</internalNodes>
      <leafValues>
        -4.6862950921058655e-01 1.0082020610570908e-01</leafValues></_>
    <_>
      <internalNodes>
        0 -1 823 1.2641744315624237e-01</internalNodes>
      <leafValues>
        -6.3043937087059021e-02 8.0886095762252808e-01</leafValues></_>
    <_>
      <internalNodes>
        0 -1 1498 3.6362968385219574e-02</internalNodes>
      <leafValues>
        1.6258493065834045e-01 -3.4979745745658875e-01</leafValues></_>
    <_>
      <internalNodes>
        0 -1 899 2.1086091175675392e-02</internalNodes>
      <leafValues>
        1.4168551564216614e-01 -3.8681960105895996e-01</leafValues></_>
    <_>
      <internalNodes>
        0 -1 1143 8.7974034249782562e-02</internalNodes>
      <leafValues>
        -5.9963315725326538e-02 9.5527023077011108e-01</leafValues></_>
    <_>
      <internalNodes>
        0 -1 3712 1.4987069182097912e-02</internalNodes>
      <leafValues>
        -7.2231042385101318e-01 8.0874860286712646e-02</leafValues></_></weakClassifiers></stage10>
</opencv_storage>
