<?xml version="1.0"?>
<opencv_storage>
<stage12>
  <maxWeakCount>8</maxWeakCount>
  <stageThreshold>-3.7279528379440308e-01</stageThreshold>
  <weakClassifiers>
    <_>
      <internalNodes>
        0 -1 120788 -4522288 -601030728 -294652912 -51777555 1597994999
        -1364396057 875558395 138302069</internalNodes>
      <leafValues>
        -3.8610661029815674e-01 5.8338010311126709e-01</leafValues></_>
    <_>
      <internalNodes>
        0 -1 143436 1409302748 2031042625 553687961 -128040925
        -1576877058 -436199416 -394088038 -1085402606</internalNodes>
      <leafValues>
        -4.9749842286109924e-01 4.2907562851905823e-01</leafValues></_>
    <_>
      <internalNodes>
        0 -1 80874 107994965 1056890237 1341964055 -1904747243 242900317
        536838143 519986556 -285229729</internalNodes>
      <leafValues>
        -4.0325295925140381e-01 5.4541558027267456e-01</leafValues></_>
    <_>
      <internalNodes>
        0 -1 2216 1827138794 95611118 151093251 1160741071 1151072955
        2026930214 1098968116 2038375384</internalNodes>
      <leafValues>
        -5.4658192396163940e-01 4.1231542825698853e-01</leafValues></_>
    <_>
      <internalNodes>
        0 -1 96395 273324218 1009570192 -2147450738 -854884329
        -133111077 -1098285016 1849840138 1815011444</internalNodes>
      <leafValues>
        -6.4598155021667480e-01 3.3951729536056519e-01</leafValues></_>
    <_>
      <internalNodes>
        0 -1 54543 -199883703 -742309681 -507388513 -1442702080
        -895462622 -401980982 -1744239701 436357547</internalNodes>
      <leafValues>
        -6.3287186622619629e-01 3.6840480566024780e-01</leafValues></_>
    <_>
      <internalNodes>
        0 -1 139421 1342370772 864112779 42010384 -64257867 -431258917
        135266440 17335633 81930971</internalNodes>
      <leafValues>
        -5.9514063596725464e-01 3.9062708616256714e-01</leafValues></_>
    <_>
      <internalNodes>
        0 -1 63306 1537800801 -1340964095 406917457 151111686
        -2134314336 -1886746446 -1656578397 -277992459</internalNodes>
      <leafValues>
        -5.0075364112854004e-01 4.4789060950279236e-01</leafValues></_></weakClassifiers></stage12>
</opencv_storage>
