<?xml version="1.0"?>
<opencv_storage>
<stage16>
  <maxWeakCount>9</maxWeakCount>
  <stageThreshold>-6.4952111244201660e-01</stageThreshold>
  <weakClassifiers>
    <_>
      <internalNodes>
        0 -1 53093 -2062521004 -1376207371 -50508673 -1999653065
        393928564 -50397186 -25232254 -1911661928</internalNodes>
      <leafValues>
        -2.6918074488639832e-01 6.1741262674331665e-01</leafValues></_>
    <_>
      <internalNodes>
        0 -1 141988 1873543155 203489265 1060239313 1488322522
        -307253306 -1942159363 133674323 -1125337723</internalNodes>
      <leafValues>
        -3.7998622655868530e-01 5.1075595617294312e-01</leafValues></_>
    <_>
      <internalNodes>
        0 -1 57285 400840533 -1212149563 -1877344072 -1794570589
        -2085440992 -1567457257 102468824 465225989</internalNodes>
      <leafValues>
        -5.6126308441162109e-01 3.7442633509635925e-01</leafValues></_>
    <_>
      <internalNodes>
        0 -1 119625 -1001849317 -611614680 815143067 490213381
        -527815927 -1097727989 76786091 223070424</internalNodes>
      <leafValues>
        -4.8699504137039185e-01 4.3283212184906006e-01</leafValues></_>
    <_>
      <internalNodes>
        0 -1 90855 -628241146 1540424144 1638074384 -1621292842 35160469
        -897056758 1510527174 -585711418</internalNodes>
      <leafValues>
        -4.8981738090515137e-01 4.5341461896896362e-01</leafValues></_>
    <_>
      <internalNodes>
        0 -1 147758 -872234429 -1937219258 1476477013 -872036275
        -389838293 -416202613 -1876315787 1169677103</internalNodes>
      <leafValues>
        -5.9964549541473389e-01 3.3965796232223511e-01</leafValues></_>
    <_>
      <internalNodes>
        0 -1 74396 1494372688 -786882368 1476412819 1359545470
        -1206231022 -1433796532 -627508061 445543507</internalNodes>
      <leafValues>
        -4.9869561195373535e-01 4.5072004199028015e-01</leafValues></_>
    <_>
      <internalNodes>
        0 -1 158097 1406085656 -1861779454 1375883447 1363624459
        -1840649272 -1996488640 673208510 -1236320401</internalNodes>
      <leafValues>
        -4.8718196153640747e-01 4.8639726638793945e-01</leafValues></_>
    <_>
      <internalNodes>
        0 -1 141534 -1059356431 897618050 1363198993 -1777283040
        1368064410 -930348923 176640138 338283424</internalNodes>
      <leafValues>
        -6.0020756721496582e-01 4.2557358741760254e-01</leafValues></_></weakClassifiers></stage16>
</opencv_storage>
