<?xml version="1.0"?>
<opencv_storage>
<stage4>
  <maxWeakCount>12</maxWeakCount>
  <stageThreshold>-7.3627555370330811e-01</stageThreshold>
  <weakClassifiers>
    <_>
      <internalNodes>
        0 -1 3159 1.1850906535983086e-02</internalNodes>
      <leafValues>
        5.9949624538421631e-01 -1.8719211220741272e-01</leafValues></_>
    <_>
      <internalNodes>
        0 -1 5487 1.6901122406125069e-02</internalNodes>
      <leafValues>
        3.3425509929656982e-01 -4.9891793727874756e-01</leafValues></_>
    <_>
      <internalNodes>
        0 -1 2852 2.4222699925303459e-02</internalNodes>
      <leafValues>
        1.8442428112030029e-01 -5.8490216732025146e-01</leafValues></_>
    <_>
      <internalNodes>
        0 -1 5797 9.7306072711944580e-03</internalNodes>
      <leafValues>
        3.1053364276885986e-01 -3.6930719017982483e-01</leafValues></_>
    <_>
      <internalNodes>
        0 -1 5460 7.8645609319210052e-03</internalNodes>
      <leafValues>
        -8.0226331949234009e-01 1.4122809469699860e-01</leafValues></_>
    <_>
      <internalNodes>
        0 -1 4415 1.4846056699752808e-02</internalNodes>
      <leafValues>
        2.3537114262580872e-01 -4.5662289857864380e-01</leafValues></_>
    <_>
      <internalNodes>
        0 -1 5318 2.2167783230543137e-02</internalNodes>
      <leafValues>
        1.9656230509281158e-01 -4.5924410223960876e-01</leafValues></_>
    <_>
      <internalNodes>
        0 -1 4909 5.5043827742338181e-02</internalNodes>
      <leafValues>
        -2.9767352342605591e-01 3.4491762518882751e-01</leafValues></_>
    <_>
      <internalNodes>
        0 -1 948 2.8502926230430603e-02</internalNodes>
      <leafValues>
        2.2767315804958344e-01 -5.1981180906295776e-01</leafValues></_>
    <_>
      <internalNodes>
        0 -1 6128 1.7854018136858940e-02</internalNodes>
      <leafValues>
        1.6900840401649475e-01 -5.2526378631591797e-01</leafValues></_>
    <_>
      <internalNodes>
        0 -1 6218 1.1823263019323349e-02</internalNodes>
      <leafValues>
        -8.4704905748367310e-01 1.3796667754650116e-01</leafValues></_>
    <_>
      <internalNodes>
        0 -1 6953 1.1527718976140022e-02</internalNodes>
      <leafValues>
        -9.2919278144836426e-01 7.2066150605678558e-02</leafValues></_></weakClassifiers></stage4>
</opencv_storage>
