<?xml version="1.0"?>
<opencv_storage>
<stage6>
  <maxWeakCount>20</maxWeakCount>
  <stageThreshold>-9.1756933927536011e-01</stageThreshold>
  <weakClassifiers>
    <_>
      <internalNodes>
        0 -1 2812 2.2671032696962357e-02</internalNodes>
      <leafValues>
        5.7356947660446167e-01 -4.5064378529787064e-02</leafValues></_>
    <_>
      <internalNodes>
        0 -1 3935 1.5154425054788589e-02</internalNodes>
      <leafValues>
        -6.1099851131439209e-01 1.9220314919948578e-01</leafValues></_>
    <_>
      <internalNodes>
        0 -1 4463 9.1225691139698029e-03</internalNodes>
      <leafValues>
        -6.9524586200714111e-01 1.0707078129053116e-01</leafValues></_>
    <_>
      <internalNodes>
        0 -1 3167 1.2181447818875313e-02</internalNodes>
      <leafValues>
        2.1594873070716858e-01 -3.6846229434013367e-01</leafValues></_>
    <_>
      <internalNodes>
        0 -1 152 3.7986636161804199e-02</internalNodes>
      <leafValues>
        -2.9816305637359619e-01 2.7946653962135315e-01</leafValues></_>
    <_>
      <internalNodes>
        0 -1 2816 2.6744518429040909e-02</internalNodes>
      <leafValues>
        1.2372891604900360e-01 -5.6204861402511597e-01</leafValues></_>
    <_>
      <internalNodes>
        0 -1 6633 1.6901705414056778e-02</internalNodes>
      <leafValues>
        -3.9009091258049011e-01 1.8078726530075073e-01</leafValues></_>
    <_>
      <internalNodes>
        0 -1 4905 2.0747415721416473e-02</internalNodes>
      <leafValues>
        1.2049351632595062e-01 -5.1631110906600952e-01</leafValues></_>
    <_>
      <internalNodes>
        0 -1 6133 1.9979435950517654e-02</internalNodes>
      <leafValues>
        2.7028071880340576e-01 -2.7444967627525330e-01</leafValues></_>
    <_>
      <internalNodes>
        0 -1 370 4.7757677733898163e-02</internalNodes>
      <leafValues>
        -1.6186049580574036e-01 4.4734072685241699e-01</leafValues></_>
    <_>
      <internalNodes>
        0 -1 1632 3.5066343843936920e-02</internalNodes>
      <leafValues>
        -2.3995919525623322e-01 3.2767093181610107e-01</leafValues></_>
    <_>
      <internalNodes>
        0 -1 2149 1.4479614794254303e-02</internalNodes>
      <leafValues>
        1.8170553445816040e-01 -4.5850843191146851e-01</leafValues></_>
    <_>
      <internalNodes>
        0 -1 5103 2.0724148489534855e-03</internalNodes>
      <leafValues>
        -7.5497162342071533e-01 9.5891408622264862e-02</leafValues></_>
    <_>
      <internalNodes>
        0 -1 1819 1.1526158079504967e-02</internalNodes>
      <leafValues>
        2.4117372930049896e-01 -3.1253698468208313e-01</leafValues></_>
    <_>
      <internalNodes>
        0 -1 1498 2.6081925258040428e-02</internalNodes>
      <leafValues>
        2.2999255359172821e-01 -3.0880740284919739e-01</leafValues></_>
    <_>
      <internalNodes>
        0 -1 3168 6.9141745567321777e-02</internalNodes>
      <leafValues>
        -1.1547287553548813e-01 6.2819457054138184e-01</leafValues></_>
    <_>
      <internalNodes>
        0 -1 6542 2.9175348579883575e-02</internalNodes>
      <leafValues>
        1.3854674994945526e-01 -5.7326257228851318e-01</leafValues></_>
    <_>
      <internalNodes>
        0 -1 4408 5.5058933794498444e-02</internalNodes>
      <leafValues>
        -1.5473414957523346e-01 4.9897494912147522e-01</leafValues></_>
    <_>
      <internalNodes>
        0 -1 1994 3.0047064647078514e-02</internalNodes>
      <leafValues>
        -2.6747587323188782e-01 2.8776884078979492e-01</leafValues></_>
    <_>
      <internalNodes>
        0 -1 1682 9.4808302819728851e-03</internalNodes>
      <leafValues>
        -4.3644198775291443e-01 1.7986498773097992e-01</leafValues></_></weakClassifiers></stage6>
</opencv_storage>
