<?xml version="1.0"?>
<opencv_storage>
<stage18>
  <maxWeakCount>9</maxWeakCount>
  <stageThreshold>-4.6535822749137878e-01</stageThreshold>
  <weakClassifiers>
    <_>
      <internalNodes>
        0 -1 98183 -134876684 150928628 -301991937 -1932759092
        -704760266 -739852 362575474 1109391022</internalNodes>
      <leafValues>
        -3.9661017060279846e-01 5.7127070426940918e-01</leafValues></_>
    <_>
      <internalNodes>
        0 -1 112064 -1725558518 1006399619 -2080271343 -1307836391
        268822143 -251068280 1019736260 -1365653498</internalNodes>
      <leafValues>
        -5.0544351339340210e-01 4.1721031069755554e-01</leafValues></_>
    <_>
      <internalNodes>
        0 -1 140388 -1943809093 -2127675232 1107362065 -2125131767
        -918449968 -878083952 -372768256 -2071363515</internalNodes>
      <leafValues>
        -5.3823375701904297e-01 3.8098657131195068e-01</leafValues></_>
    <_>
      <internalNodes>
        0 -1 74160 2031126776 1393496072 285217171 830673410 1363942374
        -1877999614 -1048016841 998654915</internalNodes>
      <leafValues>
        -5.6335562467575073e-01 3.9269590377807617e-01</leafValues></_>
    <_>
      <internalNodes>
        0 -1 62117 1937437107 1935671197 -1430510582 -138547395
        -1156519768 -1682309147 1587233022 -1564550409</internalNodes>
      <leafValues>
        -4.0059453248977661e-01 6.0036247968673706e-01</leafValues></_>
    <_>
      <internalNodes>
        0 -1 161606 -502087374 -179584984 37091 1443545374 -2130554565
        -1866334135 -1308032498 -1763864469</internalNodes>
      <leafValues>
        -4.5362824201583862e-01 5.0758302211761475e-01</leafValues></_>
    <_>
      <internalNodes>
        0 -1 23091 -633225213 1442972307 -268434382 378931863 1208058057
        -2013261696 -2012938221 -1901683577</internalNodes>
      <leafValues>
        -5.2449464797973633e-01 4.4105970859527588e-01</leafValues></_>
    <_>
      <internalNodes>
        0 -1 83852 1061149917 1061126057 -25231667 -282116913 1874499018
        -536911923 -1217282645 -819257444</internalNodes>
      <leafValues>
        -3.5491576790809631e-01 6.4817994832992554e-01</leafValues></_>
    <_>
      <internalNodes>
        0 -1 152237 -800896819 306659341 -2046820247 1477329422
        1614815275 -116916182 -800952149 -81002422</internalNodes>
      <leafValues>
        -4.9388852715492249e-01 4.5467928051948547e-01</leafValues></_></weakClassifiers></stage18>
</opencv_storage>
