<?xml version="1.0"?>
<opencv_storage>
<stage15>
  <maxWeakCount>8</maxWeakCount>
  <stageThreshold>-4.5835775136947632e-01</stageThreshold>
  <weakClassifiers>
    <_>
      <internalNodes>
        0 -1 114033 1339839992 1189961208 -46170115 1717521917
        1480122226 1610382512 1462828278 138075528</internalNodes>
      <leafValues>
        -3.9115044474601746e-01 5.5640327930450439e-01</leafValues></_>
    <_>
      <internalNodes>
        0 -1 131447 172414634 -1862221812 -1861704065 -1354592156
        -1476345317 -1710981102 -1970190303 -281675371</internalNodes>
      <leafValues>
        -4.5709022879600525e-01 4.3859764933586121e-01</leafValues></_>
    <_>
      <internalNodes>
        0 -1 86099 -1332727632 -169900015 -1056123627 -138718819
        -1608515138 -905314112 269009147 -1921043046</internalNodes>
      <leafValues>
        -4.8189306259155273e-01 4.1616538166999817e-01</leafValues></_>
    <_>
      <internalNodes>
        0 -1 91750 -168959539 500744260 18547097 -989349597 302023364
        -1987870543 147390520 649049109</internalNodes>
      <leafValues>
        -5.2921736240386963e-01 3.6494863033294678e-01</leafValues></_>
    <_>
      <internalNodes>
        0 -1 118235 -612238054 -721151984 -2130673315 -2058497687
        419463227 219811968 814449103 1420699659</internalNodes>
      <leafValues>
        -4.8924860358238220e-01 4.2304432392120361e-01</leafValues></_>
    <_>
      <internalNodes>
        0 -1 52514 -1160261551 -720322366 806158441 -653987818
        -1605729528 -1979022846 -833222525 -1442140105</internalNodes>
      <leafValues>
        -4.8858624696731567e-01 4.5149549841880798e-01</leafValues></_>
    <_>
      <internalNodes>
        0 -1 141755 -945565518 311431172 1082263890 395842488 555921912
        1913324290 -2010136526 35537100</internalNodes>
      <leafValues>
        -7.0329761505126953e-01 3.3671081066131592e-01</leafValues></_>
    <_>
      <internalNodes>
        0 -1 114449 1393684880 -796080896 1359282569 -2012363244
        -1046689224 -1618444140 1000015085 253970686</internalNodes>
      <leafValues>
        -5.6399518251419067e-01 3.9194831252098083e-01</leafValues></_></weakClassifiers></stage15>
</opencv_storage>
