<?xml version="1.0"?>
<opencv_storage>
<stage16>
  <maxWeakCount>33</maxWeakCount>
  <stageThreshold>-8.2562941312789917e-01</stageThreshold>
  <weakClassifiers>
    <_>
      <internalNodes>
        0 -1 4334 2.2168951109051704e-02</internalNodes>
      <leafValues>
        4.8421052098274231e-01 -4.0579710155725479e-02</leafValues></_>
    <_>
      <internalNodes>
        0 -1 5546 4.9315221607685089e-02</internalNodes>
      <leafValues>
        -9.8124846816062927e-02 4.7675514221191406e-01</leafValues></_>
    <_>
      <internalNodes>
        0 -1 2615 3.4254450350999832e-02</internalNodes>
      <leafValues>
        -2.0081622898578644e-01 2.8252622485160828e-01</leafValues></_>
    <_>
      <internalNodes>
        0 -1 584 1.2086112052202225e-02</internalNodes>
      <leafValues>
        -5.2831667661666870e-01 8.6408719420433044e-02</leafValues></_>
    <_>
      <internalNodes>
        0 -1 196 2.4186614900827408e-02</internalNodes>
      <leafValues>
        1.1674784123897552e-01 -3.9435750246047974e-01</leafValues></_>
    <_>
      <internalNodes>
        0 -1 1138 2.4517854675650597e-02</internalNodes>
      <leafValues>
        1.8024021387100220e-01 -2.4766853451728821e-01</leafValues></_>
    <_>
      <internalNodes>
        0 -1 1822 2.0070025697350502e-02</internalNodes>
      <leafValues>
        -2.8172105550765991e-01 1.6080538928508759e-01</leafValues></_>
    <_>
      <internalNodes>
        0 -1 1209 3.4009583294391632e-02</internalNodes>
      <leafValues>
        1.0603260248899460e-01 -4.7704529762268066e-01</leafValues></_>
    <_>
      <internalNodes>
        0 -1 6322 1.2513234280049801e-02</internalNodes>
      <leafValues>
        -4.1913026571273804e-01 1.4084829390048981e-01</leafValues></_>
    <_>
      <internalNodes>
        0 -1 965 1.0789744555950165e-02</internalNodes>
      <leafValues>
        -2.6870915293693542e-01 1.8237681686878204e-01</leafValues></_>
    <_>
      <internalNodes>
        0 -1 1104 3.7101893685758114e-03</internalNodes>
      <leafValues>
        -4.4940465688705444e-01 7.5594507157802582e-02</leafValues></_>
    <_>
      <internalNodes>
        0 -1 1312 2.3370562121272087e-02</internalNodes>
      <leafValues>
        1.2928095459938049e-01 -3.3985033631324768e-01</leafValues></_>
    <_>
      <internalNodes>
        0 -1 5762 7.9956315457820892e-03</internalNodes>
      <leafValues>
        2.7879855036735535e-01 -1.8870691955089569e-01</leafValues></_>
    <_>
      <internalNodes>
        0 -1 2162 5.5937536060810089e-02</internalNodes>
      <leafValues>
        -1.1018471419811249e-01 4.3304023146629333e-01</leafValues></_>
    <_>
      <internalNodes>
        0 -1 6500 3.5919226706027985e-02</internalNodes>
      <leafValues>
        8.0282501876354218e-02 -5.9964817762374878e-01</leafValues></_>
    <_>
      <internalNodes>
        0 -1 1177 1.4449012232944369e-03</internalNodes>
      <leafValues>
        -6.8418729305267334e-01 6.3354223966598511e-02</leafValues></_>
    <_>
      <internalNodes>
        0 -1 5874 4.2029216885566711e-02</internalNodes>
      <leafValues>
        6.0162868350744247e-02 -6.1218565702438354e-01</leafValues></_>
    <_>
      <internalNodes>
        0 -1 2798 1.0669196024537086e-02</internalNodes>
      <leafValues>
        1.5512634813785553e-01 -2.6131281256675720e-01</leafValues></_>
    <_>
      <internalNodes>
        0 -1 2335 3.6023885011672974e-02</internalNodes>
      <leafValues>
        1.4507642388343811e-01 -3.5606962442398071e-01</leafValues></_>
    <_>
      <internalNodes>
        0 -1 2624 4.7445144504308701e-02</internalNodes>
      <leafValues>
        -1.4229176938533783e-01 4.1039910912513733e-01</leafValues></_>
    <_>
      <internalNodes>
        0 -1 5094 4.9316376447677612e-02</internalNodes>
      <leafValues>
        9.8092459142208099e-02 -5.1230227947235107e-01</leafValues></_>
    <_>
      <internalNodes>
        0 -1 4782 3.4504793584346771e-02</internalNodes>
      <leafValues>
        8.3419397473335266e-02 -4.5622131228446960e-01</leafValues></_>
    <_>
      <internalNodes>
        0 -1 1669 2.3344349116086960e-02</internalNodes>
      <leafValues>
        -4.3144914507865906e-01 9.2757657170295715e-02</leafValues></_>
    <_>
      <internalNodes>
        0 -1 5156 1.2659537792205811e-01</internalNodes>
      <leafValues>
        5.3127601742744446e-02 -8.2303750514984131e-01</leafValues></_>
    <_>
      <internalNodes>
        0 -1 450 7.1810469031333923e-02</internalNodes>
      <leafValues>
        -9.1648906469345093e-02 4.8578989505767822e-01</leafValues></_>
    <_>
      <internalNodes>
        0 -1 4228 8.2346931099891663e-02</internalNodes>
      <leafValues>
        -6.1480592936277390e-02 6.6331374645233154e-01</leafValues></_>
    <_>
      <internalNodes>
        0 -1 2648 1.0535430163145065e-02</internalNodes>
      <leafValues>
        -3.4152141213417053e-01 1.5369115769863129e-01</leafValues></_>
    <_>
      <internalNodes>
        0 -1 5948 9.7774136811494827e-03</internalNodes>
      <leafValues>
        -5.2925997972488403e-01 8.2250997424125671e-02</leafValues></_>
    <_>
      <internalNodes>
        0 -1 3077 4.8290517181158066e-02</internalNodes>
      <leafValues>
        5.6893695145845413e-02 -6.4781183004379272e-01</leafValues></_>
    <_>
      <internalNodes>
        0 -1 7055 1.0820248164236546e-02</internalNodes>
      <leafValues>
        -4.6302908658981323e-01 9.3927338719367981e-02</leafValues></_>
    <_>
      <internalNodes>
        0 -1 5439 1.1777822859585285e-02</internalNodes>
      <leafValues>
        2.0018693804740906e-01 -2.0329199731349945e-01</leafValues></_>
    <_>
      <internalNodes>
        0 -1 5431 5.7950422167778015e-02</internalNodes>
      <leafValues>
        7.9281955957412720e-02 -5.9638029336929321e-01</leafValues></_>
    <_>
      <internalNodes>
        0 -1 4146 5.6184191256761551e-02</internalNodes>
      <leafValues>
        4.9685023725032806e-02 -7.7977496385574341e-01</leafValues></_></weakClassifiers></stage16>
</opencv_storage>
