<svg xmlns="http://www.w3.org/2000/svg" id="googleplay" data-name="googleplay" viewBox="0 0 110.659 37.065" fill="#fff" stroke="#fff">
                                        <g>
                                          <path d="M105.168 37.065H5.484A5.489 5.489 0 0 1 0 31.588V5.484A5.49 5.49 0 0 1 5.484 0h99.691a5.49 5.49 0 0 1 5.484 5.484v26.1a5.5 5.5 0 0 1-5.491 5.481zM5.484 1.295a4.192 4.192 0 0 0-4.189 4.189v26.1a4.192 4.192 0 0 0 4.189 4.189h99.691a4.192 4.192 0 0 0 4.189-4.189v-26.1a4.192 4.192 0 0 0-4.189-4.189H5.484z" data-name="Path 1375"/>
                                        </g>
                                        <g transform="translate(33.861 7.763)">
                                          <path d="M55.207 15.081h-.738a5.089 5.089 0 0 0-.207-.861h-1.056a4.5 4.5 0 0 0-.214.861H52.3c0-.058.181-.55.537-1.47a11.611 11.611 0 0 0 .537-1.521h.868a12.581 12.581 0 0 0 .486 1.5 14.229 14.229 0 0 1 .479 1.491zm-1.055-1.295c-.259-.79-.395-1.217-.395-1.282h-.039q0 .087-.408 1.282h.842z" data-name="Path 1376" transform="translate(-52.3 -12.025)"/>
                                          <path d="M60.03 15.081h-.57a5.715 5.715 0 0 0-.634-1 5.394 5.394 0 0 1-.751-1.295h-.032a8.018 8.018 0 0 1 .058.906c0 .376.013.842.032 1.385h-.563c.026-.473.032-1 .032-1.567s-.013-1.036-.032-1.424h.68a4.085 4.085 0 0 0 .57.971 5.72 5.72 0 0 1 .693 1.224h.032a8.232 8.232 0 0 1-.058-.919c0-.414-.013-.842-.032-1.275h.576c-.019.382-.032.855-.032 1.424s.012 1.104.031 1.57z" data-name="Path 1377" transform="translate(-54.158 -12.025)"/>
                                          <path d="M65.131 13.475a1.7 1.7 0 0 1-.421 1.139 1.459 1.459 0 0 1-1.172.486c-.227 0-.537-.006-.939-.026.019-.46.032-.984.032-1.567 0-.557-.013-1.036-.032-1.424H63c.065 0 .162 0 .291-.006s.214-.006.253-.006a1.551 1.551 0 0 1 1.2.414 1.4 1.4 0 0 1 .387.99zm-.628.1a1.1 1.1 0 0 0-.259-.745.973.973 0 0 0-.783-.3 2.631 2.631 0 0 0-.272.019c.013.3.026.628.026.958 0 .369.006.732.026 1.088a1.553 1.553 0 0 0 .3.032.872.872 0 0 0 .732-.3 1.175 1.175 0 0 0 .227-.755z" data-name="Path 1378" transform="translate(-55.931 -12.018)"/>
                                          <path d="M69.931 15.074h-.68a4.292 4.292 0 0 0-.408-1 .529.529 0 0 0-.46-.188h-.253c0 .395.006.79.019 1.191h-.639c.019-.46.032-.984.032-1.567 0-.557-.013-1.036-.032-1.424h.39c.045 0 .142 0 .291-.006s.278-.006.408-.006c.706 0 1.055.24 1.055.719a.806.806 0 0 1-.6.8v.032a.719.719 0 0 1 .408.363 9.131 9.131 0 0 1 .469 1.086zm-.861-2.111c0-.3-.194-.46-.589-.46a2.214 2.214 0 0 0-.382.032c.019.24.026.544.026.926.084 0 .155.006.214.006.492.001.731-.167.731-.504z" data-name="Path 1379" transform="translate(-57.663 -12.018)"/>
                                          <path d="M74.746 13.5a1.64 1.64 0 0 1-.434 1.172 1.389 1.389 0 0 1-1.068.466 1.354 1.354 0 0 1-1.016-.427 1.506 1.506 0 0 1-.408-1.081 1.64 1.64 0 0 1 .434-1.172 1.389 1.389 0 0 1 1.068-.466 1.354 1.354 0 0 1 1.016.427 1.485 1.485 0 0 1 .408 1.081zm-.634.065a1.188 1.188 0 0 0-.246-.777.754.754 0 0 0-.609-.3.692.692 0 0 0-.57.3 1.349 1.349 0 0 0 .013 1.534.75.75 0 0 0 .6.3.7.7 0 0 0 .57-.3 1.136 1.136 0 0 0 .242-.759z" data-name="Path 1380" transform="translate(-59.182 -11.99)"/>
                                          <path d="M77.987 15.081h-.647c.019-.473.032-1 .032-1.567s-.013-1.036-.032-1.424h.647c-.019.388-.032.861-.032 1.424.007.586.013 1.101.032 1.567z" data-name="Path 1381" transform="translate(-61.128 -12.025)"/>
                                          <path d="M82.1 13.475a1.7 1.7 0 0 1-.421 1.139 1.459 1.459 0 0 1-1.172.486c-.227 0-.537-.006-.939-.026.019-.46.032-.984.032-1.567 0-.557-.013-1.036-.032-1.424h.4c.065 0 .162 0 .291-.006s.214-.006.253-.006a1.551 1.551 0 0 1 1.2.414 1.4 1.4 0 0 1 .388.99zm-.622.1a1.1 1.1 0 0 0-.259-.745.973.973 0 0 0-.783-.3 2.631 2.631 0 0 0-.272.019c.013.3.026.628.026.958 0 .369.006.732.026 1.088a1.553 1.553 0 0 0 .3.032.872.872 0 0 0 .732-.3 1.215 1.215 0 0 0 .232-.755z" data-name="Path 1382" transform="translate(-61.915 -12.018)"/>
                                          <path d="M88.723 15.081h-.738a5.088 5.088 0 0 0-.207-.861h-1.062a4.494 4.494 0 0 0-.214.861h-.692c0-.058.181-.55.537-1.47a11.61 11.61 0 0 0 .537-1.521h.868a12.58 12.58 0 0 0 .486 1.5 13.506 13.506 0 0 1 .485 1.491zm-1.062-1.295c-.259-.79-.395-1.217-.395-1.282h-.039q0 .087-.408 1.282h.842z" data-name="Path 1383" transform="translate(-64.115 -12.025)"/>
                                          <path d="M93.252 12.863a.89.89 0 0 1-.408.809 1.8 1.8 0 0 1-1 .259.964.964 0 0 1-.155-.006c0 .285.006.667.026 1.139h-.645c.019-.44.032-.965.032-1.567 0-.55-.013-1.029-.032-1.424h.4c.058 0 .168 0 .324-.006s.3-.006.421-.006a1.284 1.284 0 0 1 .738.2.678.678 0 0 1 .299.602zm-.589.129c0-.33-.22-.492-.654-.492a2.117 2.117 0 0 0-.343.032c.019.291.026.615.026.984.039 0 .084.006.136.006.556.001.835-.18.835-.53z" data-name="Path 1384" transform="translate(-65.969 -12.015)"/>
                                          <path d="M97.508 12.863a.89.89 0 0 1-.408.809 1.808 1.808 0 0 1-1 .259.964.964 0 0 1-.155-.006c0 .285.006.667.026 1.139h-.651c.019-.44.032-.965.032-1.567 0-.55-.013-1.029-.032-1.424h.4c.058 0 .168 0 .324-.006s.3-.006.421-.006a1.284 1.284 0 0 1 .738.2.683.683 0 0 1 .305.602zm-.6.129c0-.33-.22-.492-.654-.492a2.117 2.117 0 0 0-.343.032c.019.291.026.615.026.984.039 0 .084.006.136.006.561.001.84-.18.84-.53z" data-name="Path 1385" transform="translate(-67.468 -12.015)"/>
                                          <path d="M104.056 13.5a1.64 1.64 0 0 1-.434 1.172 1.389 1.389 0 0 1-1.068.466 1.354 1.354 0 0 1-1.016-.427 1.507 1.507 0 0 1-.408-1.081 1.64 1.64 0 0 1 .434-1.172 1.389 1.389 0 0 1 1.068-.466 1.354 1.354 0 0 1 1.016.427 1.485 1.485 0 0 1 .408 1.081zm-.628.065a1.188 1.188 0 0 0-.246-.777.754.754 0 0 0-.609-.3.692.692 0 0 0-.57.3 1.349 1.349 0 0 0 .013 1.534.75.75 0 0 0 .6.3.7.7 0 0 0 .57-.3 1.172 1.172 0 0 0 .242-.759z" data-name="Path 1386" transform="translate(-69.516 -11.99)"/>
                                          <path d="M109.117 15.081h-.57a5.715 5.715 0 0 0-.634-1 5.4 5.4 0 0 1-.751-1.295h-.039a8.017 8.017 0 0 1 .058.906c0 .376.013.842.032 1.385h-.563c.026-.473.032-1 .032-1.567s-.013-1.036-.032-1.424h.68a4.086 4.086 0 0 0 .57.971 5.72 5.72 0 0 1 .693 1.224h.032a8.235 8.235 0 0 1-.058-.919c0-.414-.013-.842-.032-1.275h.576c-.019.382-.032.855-.032 1.424s.021 1.104.038 1.57z" data-name="Path 1387" transform="translate(-71.462 -12.025)"/>
                                        </g>
                                        <g transform="translate(33.673 14.425)">
                                          <path d="M62.757 28.256a4.8 4.8 0 0 1-1.32 3.544 5.141 5.141 0 0 1-3.9 1.573 5.472 5.472 0 0 1-5.523-5.548 5.472 5.472 0 0 1 5.523-5.548 5.459 5.459 0 0 1 2.182.447 4.4 4.4 0 0 1 1.664 1.185l-.932.932a3.585 3.585 0 0 0-2.907-1.262 4.1 4.1 0 0 0-4.124 4.241 4.176 4.176 0 0 0 7.08 3.058 3.366 3.366 0 0 0 .893-2.149h-3.854v-1.276h5.154a4.963 4.963 0 0 1 .064.803z" data-name="Path 1388" transform="translate(-52.01 -22.28)"/>
                                          <path d="M70.535 28.557a3.814 3.814 0 0 1 5.374 0 4.166 4.166 0 0 1 0 5.542 3.814 3.814 0 0 1-5.374 0 4.166 4.166 0 0 1 0-5.542zm1.016 4.674a2.3 2.3 0 0 0 3.341 0 2.937 2.937 0 0 0 0-3.82 2.3 2.3 0 0 0-3.341 0 2.6 2.6 0 0 0-.706 1.91 2.622 2.622 0 0 0 .707 1.911z" data-name="Path 1389" transform="translate(-58.169 -24.103)"/>
                                          <path d="M82.805 28.557a3.814 3.814 0 0 1 5.374 0 4.166 4.166 0 0 1 0 5.542 3.814 3.814 0 0 1-5.374 0 4.166 4.166 0 0 1 0-5.542zm1.016 4.674a2.3 2.3 0 0 0 3.341 0 2.937 2.937 0 0 0 0-3.82 2.3 2.3 0 0 0-3.341 0 2.937 2.937 0 0 0 0 3.82z" data-name="Path 1390" transform="translate(-62.495 -24.103)"/>
                                          <path d="M97.594 38.412a3.284 3.284 0 0 1-2.111-.647 3.862 3.862 0 0 1-1.172-1.476l1.25-.518a2.071 2.071 0 0 0 .764 1 2.13 2.13 0 0 0 1.269.4 2.357 2.357 0 0 0 1.774-.673 2.534 2.534 0 0 0 .647-1.832v-.7h-.058a2.843 2.843 0 0 1-1.01.893 2.993 2.993 0 0 1-1.47.356 3.19 3.19 0 0 1-2.434-1.115 4.23 4.23 0 0 1 0-5.516 3.19 3.19 0 0 1 2.434-1.114 2.993 2.993 0 0 1 1.47.356 2.843 2.843 0 0 1 1.01.893h.058V27.71h1.308v6.9a3.628 3.628 0 0 1-1.081 2.842 3.905 3.905 0 0 1-2.648.96zm.1-4.454a2.177 2.177 0 0 0 1.638-.712 2.653 2.653 0 0 0 .673-1.916 2.692 2.692 0 0 0-.673-1.916 2.225 2.225 0 0 0-3.27.006 3.023 3.023 0 0 0 0 3.82 2.167 2.167 0 0 0 1.638.717z" data-name="Path 1391" transform="translate(-66.822 -24.11)"/>
                                          <path d="M108.656 33.264h-1.366V22.64h1.366z" data-name="Path 1392" transform="translate(-71.5 -22.407)"/>
                                          <path d="M114.34 35.2a3.509 3.509 0 0 1-2.68-1.1 3.9 3.9 0 0 1-1.029-2.777 4.012 4.012 0 0 1 1-2.732 3.24 3.24 0 0 1 2.557-1.139 3.339 3.339 0 0 1 2.59 1.055 4 4 0 0 1 .971 2.823l-.013.252H112a2.468 2.468 0 0 0 .732 1.735 2.228 2.228 0 0 0 1.58.641 1.953 1.953 0 0 0 1.988-1.25l1.217.5a3.286 3.286 0 0 1-1.172 1.418 3.41 3.41 0 0 1-2.005.574zm1.962-4.752a1.954 1.954 0 0 0-.57-1.185 2.042 2.042 0 0 0-1.567-.563 1.952 1.952 0 0 0-1.314.473 2.435 2.435 0 0 0-.764 1.275z" data-name="Path 1393" transform="translate(-72.678 -24.103)"/>
                                          <path d="M129.2 33.264h-1.37V22.64h3.619a3.348 3.348 0 0 1 2.337.9 3.1 3.1 0 0 1 0 4.532 3.378 3.378 0 0 1-2.337.9H129.2zm0-5.607h2.285a1.764 1.764 0 0 0 1.379-.576 1.829 1.829 0 0 0 0-2.551 1.762 1.762 0 0 0-1.379-.576H129.2z" data-name="Path 1394" transform="translate(-78.742 -22.407)"/>
                                          <path d="M141.3 33.264h-1.37V22.64h1.37z" data-name="Path 1395" transform="translate(-83.008 -22.407)"/>
                                          <path d="M145.993 35.2a2.861 2.861 0 0 1-1.936-.667 2.22 2.22 0 0 1-.777-1.767 2.188 2.188 0 0 1 .92-1.866 3.722 3.722 0 0 1 2.272-.673 3.91 3.91 0 0 1 1.975.447v-.214a1.6 1.6 0 0 0-.55-1.282 1.972 1.972 0 0 0-1.353-.486 2.083 2.083 0 0 0-1.075.285 1.442 1.442 0 0 0-.66.77l-1.25-.537a2.81 2.81 0 0 1 1-1.211 3.191 3.191 0 0 1 1.962-.557 3.367 3.367 0 0 1 2.318.816 2.911 2.911 0 0 1 .919 2.3v4.4h-1.308V33.94h-.058a2.679 2.679 0 0 1-2.399 1.26zm.227-1.25a2.245 2.245 0 0 0 1.534-.628 1.963 1.963 0 0 0 .693-1.489 2.693 2.693 0 0 0-1.735-.473 2.284 2.284 0 0 0-1.5.427 1.287 1.287 0 0 0-.5 1.01.98.98 0 0 0 .46.848 1.87 1.87 0 0 0 1.047.302z" data-name="Path 1396" transform="translate(-84.189 -24.099)"/>
                                          <path d="M156.379 38.3h-1.411l1.69-3.664-3-6.811h1.483l2.169 5.225h.032l2.1-5.225h1.483z" data-name="Path 1397" transform="translate(-87.849 -24.233)"/>
                                        </g>
                                        <g transform="translate(8.205 8.106)">
                                          <path d="M12.677 24.36V14.175a1.528 1.528 0 0 1 .376-1.114c.117-.123.194-.155.337-.013q3.428 3.5 6.863 6.979 2.224 2.263 4.454 4.513c.142.142.155.22.006.376q-5.458 5.429-10.9 10.877a.372.372 0 0 1-.589.032 1.385 1.385 0 0 1-.537-1.178c0-2.014 0-4.021-.006-6.034a502.682 502.682 0 0 1 0-4.254z" data-name="Path 1398" transform="translate(-12.673 -12.673)"/>
                                          <path d="M14.69 12.52a1.28 1.28 0 0 1 .66.181q6.973 3.9 13.946 7.808c.214.117.207.188.045.35a334.302 334.302 0 0 0-3.1 3.088c-.11.11-.181.175-.33.026q-5.545-5.662-11.1-11.3c-.03-.036-.056-.073-.121-.153z" data-name="Path 1399" transform="translate(-13.384 -12.52)"/>
                                          <path d="M16.3 42.446L26.419 32.21c.207-.214.3-.181.492.013.855.893 1.722 1.767 2.6 2.642.155.155.168.214-.039.33q-6.5 3.554-12.987 7.128a.961.961 0 0 0-.185.123z" data-name="Path 1400" transform="translate(-13.951 -19.41)"/>
                                          <path d="M41.5 28.951a1.064 1.064 0 0 1-.466.855 5.956 5.956 0 0 1-.647.395c-1.308.725-2.622 1.444-3.93 2.169a.292.292 0 0 1-.427-.058 400.119 400.119 0 0 0-2.81-2.862c-.136-.136-.142-.214 0-.35 1.1-1.081 2.195-2.175 3.282-3.27a.264.264 0 0 1 .382-.052c1.295.732 2.6 1.457 3.891 2.182a1.192 1.192 0 0 1 .725.991z" data-name="Path 1401" transform="translate(-19.881 -17.174)"/>
                                        </g>
                                    </svg>
