{
  "vtex.menu@2.x:menu#category-menu": {
    "props": {
      "experimentalOptimizeRendering": true,
      "id": "menu-desktop"
    },
    "children": [
      "menu-item#categories",
      "menu-item#category-autoajudaMenu",
      "menu-item#category-biografiaMenu",
      "menu-item#category-ficcaoMenu",
      "menu-item#category-historiaMenu",
      "menu-item#category-negociosMenu",
      "menu-item#category-poesiaMenu",
      "menu-item#category-suspenseMenu",
      "menu-item#category-autibestMenu"
    ]
  },
  "menu-item#categories": {
    "props": {
      "id": "menu-item-categories",
      "type": "custom",
      "iconId": null,
      "highlight": false,
      "itemProps": {
        "type": "internal",
        "href": "/apparel---accessories/",
        "noFollow": false,
        "tagTitle": "Categorias",
        "text": "Categorias"
      }
    },
    "blocks": ["vtex.menu@2.x:submenu#categories"]
  },
  "vtex.menu@2.x:submenu#categories": {
    "props": {
      "width": "auto"
    },
    "children": ["vtex.menu@2.x:menu#category-books"]
  },
  "vtex.menu@2.x:menu#category-books": {
    "props": {
      "orientation": "vertical"
    },
    "children": ["flex-layout.row#containerSubmenu"]
  },

  "flex-layout.row#containerSubmenu": {
    "children": [
      "flex-layout.col#col1Submenu",
      "flex-layout.col#col2Submenu",
      "flex-layout.col#col3Submenu",
      "flex-layout.col#col4Submenu"
    ]
  },

  "flex-layout.col#col1Submenu": {
    "children": [
      "menu-item#category-autoajuda",
      "menu-item#category-biografia",
      "menu-item#category-cinema",
      "menu-item#category-classico",
      "menu-item#category-comportamento",
      "menu-item#category-contos",
      "menu-item#category-direito",
      "menu-item#category-economia",
      "menu-item#category-educacao"
    ]
  },

  "flex-layout.col#col2Submenu": {
    "children": [
      "menu-item#category-erotico",
      "menu-item#category-espiritualidade",
      "menu-item#category-esporte",
      "menu-item#category-fantasia",
      "menu-item#category-ficcao",
      "menu-item#category-filosofia",
      "menu-item#category-gastronomia",
      "menu-item#category-gospel",
      "menu-item#category-historia"
    ]
  },

  "flex-layout.col#col3Submenu": {
    "children": [
      "menu-item#category-historiaBrasil",
      "menu-item#category-infantil",
      "menu-item#category-juvenil",
      "menu-item#category-midias",
      "menu-item#category-motivacao",
      "menu-item#category-naoFiccao",
      "menu-item#category-negocios",
      "menu-item#category-espanhol",
      "menu-item#category-ingles"
    ]
  },

  "flex-layout.col#col4Submenu": {
    "children": [
      "menu-item#category-poesia",
      "menu-item#category-politica",
      "menu-item#category-politica",
      "menu-item#category-psicologia",
      "menu-item#category-qualidadeVida",
      "menu-item#category-religiao",
      "menu-item#category-romance",
      "menu-item#category-saude",
      "menu-item#category-suspense",
      "menu-item#category-viagem"
    ]
  },

  "menu-item#category-autoajuda": {
    "props": {
      "id": "menu-item-category-autoajuda",
      "type": "custom",
      "iconId": null,
      "highlight": false,
      "itemProps": {
        "type": "internal",
        "href": "/apparel---accessories/clothing/",
        "noFollow": false,
        "tagTitle": "Autoajuda",
        "text": "Autoajuda"
      }
    }
  },

  "menu-item#category-biografia": {
    "props": {
      "id": "menu-item-category-autoajuda",
      "type": "custom",
      "iconId": null,
      "highlight": false,
      "itemProps": {
        "type": "internal",
        "href": "/apparel---accessories/clothing/",
        "noFollow": false,
        "tagTitle": "Biografia",
        "text": "Biografia"
      }
    }
  },

  "menu-item#category-cinema": {
    "props": {
      "id": "menu-item-category-autoajuda",
      "type": "custom",
      "iconId": null,
      "highlight": false,
      "itemProps": {
        "type": "internal",
        "href": "/apparel---accessories/clothing/",
        "noFollow": false,
        "tagTitle": "Cinema e Teatro",
        "text": "Cinema e Teatro"
      }
    }
  },

  "menu-item#category-classico": {
    "props": {
      "id": "menu-item-category-autoajuda",
      "type": "custom",
      "iconId": null,
      "highlight": false,
      "itemProps": {
        "type": "internal",
        "href": "/apparel---accessories/clothing/",
        "noFollow": false,
        "tagTitle": "Clássico",
        "text": "Clássico"
      }
    }
  },

  "menu-item#category-comportamento": {
    "props": {
      "id": "menu-item-category-autoajuda",
      "type": "custom",
      "iconId": null,
      "highlight": false,
      "itemProps": {
        "type": "internal",
        "href": "/apparel---accessories/clothing/",
        "noFollow": false,
        "tagTitle": "Comportamento e relacionamento",
        "text": "Comportamento e relacionamento"
      }
    }
  },

  "menu-item#category-contos": {
    "props": {
      "id": "menu-item-category-autoajuda",
      "type": "custom",
      "iconId": null,
      "highlight": false,
      "itemProps": {
        "type": "internal",
        "href": "/apparel---accessories/clothing/",
        "noFollow": false,
        "tagTitle": "Contos e crônicas",
        "text": "Contos e crônicas"
      }
    }
  },

  "menu-item#category-direito": {
    "props": {
      "id": "menu-item-category-autoajuda",
      "type": "custom",
      "iconId": null,
      "highlight": false,
      "itemProps": {
        "type": "internal",
        "href": "/apparel---accessories/clothing/",
        "noFollow": false,
        "tagTitle": "Direito",
        "text": "Direito"
      }
    }
  },

  "menu-item#category-economia": {
    "props": {
      "id": "menu-item-category-autoajuda",
      "type": "custom",
      "iconId": null,
      "highlight": false,
      "itemProps": {
        "type": "internal",
        "href": "/apparel---accessories/clothing/",
        "noFollow": false,
        "tagTitle": "Economia",
        "text": "Economia"
      }
    }
  },

  "menu-item#category-educacao": {
    "props": {
      "id": "menu-item-category-autoajuda",
      "type": "custom",
      "iconId": null,
      "highlight": false,
      "itemProps": {
        "type": "internal",
        "href": "/apparel---accessories/clothing/",
        "noFollow": false,
        "tagTitle": "Educação",
        "text": "Educação"
      }
    }
  },

  "menu-item#category-erotico": {
    "props": {
      "id": "menu-item-category-autoajuda",
      "type": "custom",
      "iconId": null,
      "highlight": false,
      "itemProps": {
        "type": "internal",
        "href": "/apparel---accessories/clothing/",
        "noFollow": false,
        "tagTitle": "Erótico",
        "text": "Erótico"
      }
    }
  },

  "menu-item#category-espiritualidade": {
    "props": {
      "id": "menu-item-category-autoajuda",
      "type": "custom",
      "iconId": null,
      "highlight": false,
      "itemProps": {
        "type": "internal",
        "href": "/apparel---accessories/clothing/",
        "noFollow": false,
        "tagTitle": "Espiritualidade",
        "text": "Espiritualidade"
      }
    }
  },

  "menu-item#category-esporte": {
    "props": {
      "id": "menu-item-category-autoajuda",
      "type": "custom",
      "iconId": null,
      "highlight": false,
      "itemProps": {
        "type": "internal",
        "href": "/apparel---accessories/clothing/",
        "noFollow": false,
        "tagTitle": "Esporte e estilo de vida",
        "text": "Esporte e estilo de vida"
      }
    }
  },

  "menu-item#category-fantasia": {
    "props": {
      "id": "menu-item-category-autoajuda",
      "type": "custom",
      "iconId": null,
      "highlight": false,
      "itemProps": {
        "type": "internal",
        "href": "/apparel---accessories/clothing/",
        "noFollow": false,
        "tagTitle": "Fantasia e ficção científica",
        "text": "Fantasia e ficção científica"
      }
    }
  },

  "menu-item#category-ficcao": {
    "props": {
      "id": "menu-item-category-autoajuda",
      "type": "custom",
      "iconId": null,
      "highlight": false,
      "itemProps": {
        "type": "internal",
        "href": "/apparel---accessories/clothing/",
        "noFollow": false,
        "tagTitle": "Ficção e literatura",
        "text": "Ficção e literatura"
      }
    }
  },

  "menu-item#category-filosofia": {
    "props": {
      "id": "menu-item-category-autoajuda",
      "type": "custom",
      "iconId": null,
      "highlight": false,
      "itemProps": {
        "type": "internal",
        "href": "/apparel---accessories/clothing/",
        "noFollow": false,
        "tagTitle": "Filosofia",
        "text": "Filosofia"
      }
    }
  },

  "menu-item#category-gastronomia": {
    "props": {
      "id": "menu-item-category-autoajuda",
      "type": "custom",
      "iconId": null,
      "highlight": false,
      "itemProps": {
        "type": "internal",
        "href": "/apparel---accessories/clothing/",
        "noFollow": false,
        "tagTitle": "Gastronomia",
        "text": "Gastronomia"
      }
    }
  },

  "menu-item#category-gospel": {
    "props": {
      "id": "menu-item-category-autoajuda",
      "type": "custom",
      "iconId": null,
      "highlight": false,
      "itemProps": {
        "type": "internal",
        "href": "/apparel---accessories/clothing/",
        "noFollow": false,
        "tagTitle": "Gospel",
        "text": "Gospel"
      }
    }
  },

  "menu-item#category-historia": {
    "props": {
      "id": "menu-item-category-autoajuda",
      "type": "custom",
      "iconId": null,
      "highlight": false,
      "itemProps": {
        "type": "internal",
        "href": "/apparel---accessories/clothing/",
        "noFollow": false,
        "tagTitle": "História",
        "text": "História"
      }
    }
  },

  "menu-item#category-historiaBrasil": {
    "props": {
      "id": "menu-item-category-autoajuda",
      "type": "custom",
      "iconId": null,
      "highlight": false,
      "itemProps": {
        "type": "internal",
        "href": "/apparel---accessories/clothing/",
        "noFollow": false,
        "tagTitle": "História do Brasil",
        "text": "História do Brasil"
      }
    }
  },

  "menu-item#category-infantil": {
    "props": {
      "id": "menu-item-category-autoajuda",
      "type": "custom",
      "iconId": null,
      "highlight": false,
      "itemProps": {
        "type": "internal",
        "href": "/apparel---accessories/clothing/",
        "noFollow": false,
        "tagTitle": "Infantil",
        "text": "Infantil"
      }
    }
  },

  "menu-item#category-juvenil": {
    "props": {
      "id": "menu-item-category-autoajuda",
      "type": "custom",
      "iconId": null,
      "highlight": false,
      "itemProps": {
        "type": "internal",
        "href": "/apparel---accessories/clothing/",
        "noFollow": false,
        "tagTitle": "Juvenil",
        "text": "Juvenil"
      }
    }
  },

  "menu-item#category-midias": {
    "props": {
      "id": "menu-item-category-autoajuda",
      "type": "custom",
      "iconId": null,
      "highlight": false,
      "itemProps": {
        "type": "internal",
        "href": "/apparel---accessories/clothing/",
        "noFollow": false,
        "tagTitle": "Mídias e tecnologia",
        "text": "Mídias e tecnologia"
      }
    }
  },

  "menu-item#category-motivacao": {
    "props": {
      "id": "menu-item-category-autoajuda",
      "type": "custom",
      "iconId": null,
      "highlight": false,
      "itemProps": {
        "type": "internal",
        "href": "/apparel---accessories/clothing/",
        "noFollow": false,
        "tagTitle": "Motivação",
        "text": "Motivação"
      }
    }
  },

  "menu-item#category-naoFiccao": {
    "props": {
      "id": "menu-item-category-autoajuda",
      "type": "custom",
      "iconId": null,
      "highlight": false,
      "itemProps": {
        "type": "internal",
        "href": "/apparel---accessories/clothing/",
        "noFollow": false,
        "tagTitle": "Não ficção",
        "text": "Não ficção"
      }
    }
  },

  "menu-item#category-negocios": {
    "props": {
      "id": "menu-item-category-autoajuda",
      "type": "custom",
      "iconId": null,
      "highlight": false,
      "itemProps": {
        "type": "internal",
        "href": "/apparel---accessories/clothing/",
        "noFollow": false,
        "tagTitle": "Negócios e carreira",
        "text": "Negócios e carreira"
      }
    }
  },

  "menu-item#category-espanhol": {
    "props": {
      "id": "menu-item-category-autoajuda",
      "type": "custom",
      "iconId": null,
      "highlight": false,
      "itemProps": {
        "type": "internal",
        "href": "/apparel---accessories/clothing/",
        "noFollow": false,
        "tagTitle": "Outros idiomas - Espanhol",
        "text": "Outros idiomas - Espanhol"
      }
    }
  },

  "menu-item#category-ingles": {
    "props": {
      "id": "menu-item-category-autoajuda",
      "type": "custom",
      "iconId": null,
      "highlight": false,
      "itemProps": {
        "type": "internal",
        "href": "/apparel---accessories/clothing/",
        "noFollow": false,
        "tagTitle": "Outros idiomas - Inglês",
        "text": "Outros idiomas - Inglês"
      }
    }
  },

  "menu-item#category-poesia": {
    "props": {
      "id": "menu-item-category-autoajuda",
      "type": "custom",
      "iconId": null,
      "highlight": false,
      "itemProps": {
        "type": "internal",
        "href": "/apparel---accessories/clothing/",
        "noFollow": false,
        "tagTitle": "Poesia",
        "text": "Poesia"
      }
    }
  },

  "menu-item#category-politica": {
    "props": {
      "id": "menu-item-category-autoajuda",
      "type": "custom",
      "iconId": null,
      "highlight": false,
      "itemProps": {
        "type": "internal",
        "href": "/apparel---accessories/clothing/",
        "noFollow": false,
        "tagTitle": "Política e sociedade",
        "text": "Política e sociedade"
      }
    }
  },

  "menu-item#category-psicologia": {
    "props": {
      "id": "menu-item-category-autoajuda",
      "type": "custom",
      "iconId": null,
      "highlight": false,
      "itemProps": {
        "type": "internal",
        "href": "/apparel---accessories/clothing/",
        "noFollow": false,
        "tagTitle": "Psicologia",
        "text": "Psicologia"
      }
    }
  },

  "menu-item#category-qualidadeVida": {
    "props": {
      "id": "menu-item-category-autoajuda",
      "type": "custom",
      "iconId": null,
      "highlight": false,
      "itemProps": {
        "type": "internal",
        "href": "/apparel---accessories/clothing/",
        "noFollow": false,
        "tagTitle": "Qualidade de Vida",
        "text": "Qualidade de Vida"
      }
    }
  },

  "menu-item#category-religiao": {
    "props": {
      "id": "menu-item-category-autoajuda",
      "type": "custom",
      "iconId": null,
      "highlight": false,
      "itemProps": {
        "type": "internal",
        "href": "/apparel---accessories/clothing/",
        "noFollow": false,
        "tagTitle": "Religião",
        "text": "Religião"
      }
    }
  },

  "menu-item#category-romance": {
    "props": {
      "id": "menu-item-category-autoajuda",
      "type": "custom",
      "iconId": null,
      "highlight": false,
      "itemProps": {
        "type": "internal",
        "href": "/apparel---accessories/clothing/",
        "noFollow": false,
        "tagTitle": "Romance histórico",
        "text": "Romance histórico"
      }
    }
  },

  "menu-item#category-saude": {
    "props": {
      "id": "menu-item-category-autoajuda",
      "type": "custom",
      "iconId": null,
      "highlight": false,
      "itemProps": {
        "type": "internal",
        "href": "/apparel---accessories/clothing/",
        "noFollow": false,
        "tagTitle": "Saúde e família",
        "text": "Saúde e família"
      }
    }
  },

  "menu-item#category-suspense": {
    "props": {
      "id": "menu-item-category-autoajuda",
      "type": "custom",
      "iconId": null,
      "highlight": false,
      "itemProps": {
        "type": "internal",
        "href": "/apparel---accessories/clothing/",
        "noFollow": false,
        "tagTitle": "Suspense e ação",
        "text": "Motivação"
      }
    }
  },

  "menu-item#category-viagem": {
    "props": {
      "id": "menu-item-category-autoajuda",
      "type": "custom",
      "iconId": null,
      "highlight": false,
      "itemProps": {
        "type": "internal",
        "href": "/apparel---accessories/clothing/",
        "noFollow": false,
        "tagTitle": "Viagem e aventura",
        "text": "Viagem e aventura"
      }
    }
  },

  // Fim do Submenu

  "menu-item#category-autoajudaMenu": {
    "props": {
      "id": "menu-item-category-autoajuda",
      "type": "custom",
      "iconId": null,
      "highlight": false,
      "itemProps": {
        "type": "internal",
        "href": "/home---decor/",
        "noFollow": false,
        "tagTitle": "Autoajuda",
        "text": "Autoajuda"
      }
    }
  },

  "menu-item#category-biografiaMenu": {
    "props": {
      "id": "menu-item-category-biografia",
      "type": "custom",
      "iconId": null,
      "highlight": false,
      "itemProps": {
        "type": "internal",
        "href": "/home---decor/",
        "noFollow": false,
        "tagTitle": "Biografia",
        "text": "Biografia"
      }
    }
  },

  "menu-item#category-ficcaoMenu": {
    "props": {
      "id": "menu-item-category-ficcao",
      "type": "custom",
      "iconId": null,
      "highlight": false,
      "itemProps": {
        "type": "internal",
        "href": "/home---decor/",
        "noFollow": false,
        "tagTitle": "Ficção",
        "text": "Ficção"
      }
    }
  },

  "menu-item#category-historiaMenu": {
    "props": {
      "id": "menu-item-category-historia",
      "type": "custom",
      "iconId": null,
      "highlight": false,
      "itemProps": {
        "type": "internal",
        "href": "/home---decor/",
        "noFollow": false,
        "tagTitle": "História",
        "text": "História"
      }
    }
  },

  "menu-item#category-negociosMenu": {
    "props": {
      "id": "menu-item-category-negocios",
      "type": "custom",
      "iconId": null,
      "highlight": false,
      "itemProps": {
        "type": "internal",
        "href": "/home---decor/",
        "noFollow": false,
        "tagTitle": "Negócios",
        "text": "Negócios"
      }
    }
  },

  "menu-item#category-poesiaMenu": {
    "props": {
      "id": "menu-item-category-poesia",
      "type": "custom",
      "iconId": null,
      "highlight": false,
      "itemProps": {
        "type": "internal",
        "href": "/home---decor/",
        "noFollow": false,
        "tagTitle": "Poesia",
        "text": "Poesia"
      }
    }
  },

  "menu-item#category-suspenseMenu": {
    "props": {
      "id": "menu-item-category-suspense",
      "type": "custom",
      "iconId": null,
      "highlight": false,
      "itemProps": {
        "type": "internal",
        "href": "/home---decor/",
        "noFollow": false,
        "tagTitle": "Suspense",
        "text": "Suspense"
      }
    }
  },

  "menu-item#category-autibestMenu": {
    "props": {
      "id": "menu-item-category-autibest",
      "type": "custom",
      "iconId": null,
      "highlight": false,
      "itemProps": {
        "type": "internal",
        "href": "/login",
        "noFollow": false,
        "tagTitle": "Auti Best",
        "text": "Auti Best"
      }
    }
  }
}
