{
  "LazyVim": { "branch": "main", "commit": "a72a84972d85e5bbc6b9d60a0983b37efef21b8a" },
  "LuaSnip": { "branch": "master", "commit": "ea7d7ea510c641c4f15042becd27f35b3e5b3c2b" },
  "alpha-nvim": { "branch": "main", "commit": "712dc1dccd4fd515ef8bd126b3718f79d3e23b0d" },
  "barbar.nvim": { "branch": "master", "commit": "dd852401ee902745b67fc09a83d113b3fe82a96f" },
  "catppuccin": { "branch": "main", "commit": "85e93601e0f0b48aa2c6bbfae4d0e9d7a1898280" },
  "cmp-buffer": { "branch": "main", "commit": "3022dbc9166796b644a841a02de8dd1cc1d311fa" },
  "cmp-nvim-lsp": { "branch": "main", "commit": "44b16d11215dce86f253ce0c30949813c0a90765" },
  "cmp-path": { "branch": "main", "commit": "91ff86cd9c29299a64f968ebb45846c485725f23" },
  "cmp_luasnip": { "branch": "master", "commit": "18095520391186d634a0045dacaa346291096566" },
  "dressing.nvim": { "branch": "master", "commit": "c1e1d5fa44fe08811b6ef4aadac2b50e602f9504" },
  "flash.nvim": { "branch": "main", "commit": "8a8e74922a383c253b7f92e042b749150140c8d1" },
  "friendly-snippets": { "branch": "main", "commit": "ebf6d6e83494cdd88a54a429340256f4dbb6a052" },
  "gitsigns.nvim": { "branch": "main", "commit": "907ae8636016aab2f283576fc60d46ca3427e579" },
  "indent-blankline.nvim": { "branch": "master", "commit": "9637670896b68805430e2f72cf5d16be5b97a22a" },
  "lazy.nvim": { "branch": "main", "commit": "3ad55ae678876516156cca2f361c51f7952a924b" },
  "lualine.nvim": { "branch": "master", "commit": "45e27ca739c7be6c49e5496d14fcf45a303c3a63" },
  "mason-lspconfig.nvim": { "branch": "main", "commit": "01b4b6724ebcf5b43fc021486f6a260f1d09311e" },
  "mason.nvim": { "branch": "main", "commit": "d66c60e17dd6fd8165194b1d14d21f7eb2c1697a" },
  "mini.ai": { "branch": "main", "commit": "7ae226f331885e6f30e9a8229e113debc59308ae" },
  "mini.bufremove": { "branch": "main", "commit": "7821606e35c1ac931b56d8e3155f45ffe76ee7e5" },
  "mini.comment": { "branch": "main", "commit": "877acea5b2a32ff55f808fc0ebe9aa898648318c" },
  "mini.indentscope": { "branch": "main", "commit": "f60e9b51a6214c73a170ffc5445ce91560981031" },
  "mini.pairs": { "branch": "main", "commit": "dfa9f6e2576bb8853be277d96b735af59d9be7c2" },
  "mini.surround": { "branch": "main", "commit": "9d1956b576d7051da3a483b251dfc778121c60db" },
  "modus-themes-vim": { "branch": "master", "commit": "451fdfa20fb9fb93c0dc1b5dfb613fd00514d084" },
  "neo-tree.nvim": { "branch": "v3.x", "commit": "2d89ca96e08eb6e9c8e50e1bb4738bc5125c9f12" },
  "neoconf.nvim": { "branch": "main", "commit": "ebd2f07743796e6bcd3c147f02a22ede2c69b33a" },
  "neodev.nvim": { "branch": "main", "commit": "b07f1c4c0d5f0d077f29c776df3fd8c98c70e2f7" },
  "noice.nvim": { "branch": "main", "commit": "74c2902146b080035beb19944baf6f014a954720" },
  "nui.nvim": { "branch": "main", "commit": "c8de23342caf8d50b15d6b28368d36a56a69d76f" },
  "null-ls.nvim": { "branch": "main", "commit": "0010ea927ab7c09ef0ce9bf28c2b573fc302f5a7" },
  "nvim-cmp": { "branch": "main", "commit": "5dce1b778b85c717f6614e3f4da45e9f19f54435" },
  "nvim-lspconfig": { "branch": "master", "commit": "57139c690dc8d594b2f9de8d1e609f2854a4fe45" },
  "nvim-navic": { "branch": "master", "commit": "9c89730da6a05acfeb6a197e212dfadf5aa60ca0" },
  "nvim-notify": { "branch": "master", "commit": "94859430020f5cf32a1b97ddd9e596fed9db7981" },
  "nvim-spectre": { "branch": "master", "commit": "97cfd1b0f5a6ab35979ce1bee6c17f54745fd1e5" },
  "nvim-treesitter": { "branch": "master", "commit": "9ab4e9cc8989e3811b14897cd0eb21ae35e5541e" },
  "nvim-treesitter-textobjects": { "branch": "master", "commit": "bd103502252027434ec42f628d2dbf54821d4ce6" },
  "nvim-ts-context-commentstring": { "branch": "main", "commit": "12db414edf72c76c62e3621994cc54bc091babea" },
  "nvim-web-devicons": { "branch": "master", "commit": "925e2aa30dc9fe9332060199c19f132ec0f3d493" },
  "persistence.nvim": { "branch": "main", "commit": "4b8051c01f696d8849a5cb8afa9767be8db16e40" },
  "plenary.nvim": { "branch": "master", "commit": "9ce85b0f7dcfe5358c0be937ad23e456907d410b" },
  "telescope.nvim": { "branch": "master", "commit": "a19770625aed49ad2a9f591a5e3946707f7359f6" },
  "todo-comments.nvim": { "branch": "main", "commit": "3094ead8edfa9040de2421deddec55d3762f64d1" },
  "tokyonight.nvim": { "branch": "main", "commit": "9a01eada39558dc3243278e6805d90e8dff45dc0" },
  "trouble.nvim": { "branch": "main", "commit": "3f85d8ed30e97ceeddbbcf80224245d347053711" },
  "vim-illuminate": { "branch": "master", "commit": "8c910b2f84ae6acd9b4b17330bb94dd783c0c11a" },
  "vim-startuptime": { "branch": "master", "commit": "454b3de856b7bd298700de33d79774ca9b9e3875" },
  "which-key.nvim": { "branch": "main", "commit": "7ccf476ebe0445a741b64e36c78a682c1c6118b7" }
}