${AnsiColor.RED}         ____|   __ \    ____|              \       _ \   _ _|
${AnsiColor.RED}         __|     |   |   |                 _ \     |   |    |
${AnsiColor.BLUE}         |       |   |   __|    _____|    ___ \    ___/     |
${AnsiColor.BLUE}        _____|  ____/   _|              _/    _\  _|      ___|
${AnsiColor.DEFAULT}
