<?xml version="1.0" standalone="no"?>
<!DOCTYPE svg PUBLIC "-//W3C//DTD SVG 20010904//EN"
 "http://www.w3.org/TR/2001/REC-SVG-20010904/DTD/svg10.dtd">
<svg version="1.0" xmlns="http://www.w3.org/2000/svg"
 width="1280.000000pt" height="1051.000000pt" viewBox="0 0 1280.000000 1051.000000"
 preserveAspectRatio="xMidYMid meet">
<metadata>
Created by potrace 1.15, written by Peter Selinger 2001-2017
</metadata>
<g transform="translate(0.000000,1051.000000) scale(0.100000,-0.100000)"
fill="#000000" stroke="none">
<path d="M9538 10447 c-53 -15 -77 -32 -208 -149 -474 -420 -1195 -949 -2033
-1492 -356 -230 -518 -343 -728 -507 -749 -584 -1393 -1312 -2016 -2279 -207
-322 -366 -583 -381 -624 -9 -29 -12 -61 -7 -109 l7 -68 -85 -127 c-317 -472
-725 -855 -1422 -1337 -455 -315 -671 -489 -1311 -1060 -148 -132 -352 -311
-452 -399 -289 -250 -476 -478 -605 -733 -34 -66 -103 -239 -111 -279 -4 -17
-18 -46 -32 -65 -13 -18 -24 -36 -24 -40 0 -3 15 -22 33 -41 18 -20 82 -90
141 -157 60 -66 112 -121 116 -121 5 0 11 13 15 29 6 27 8 28 49 24 l44 -5 7
41 c6 35 10 40 28 36 67 -14 72 -12 77 30 l5 39 47 -3 48 -3 0 38 0 37 44 -6
c24 -4 50 -8 58 -9 10 -2 12 8 10 41 l-4 44 39 -8 c21 -4 43 -7 48 -8 6 -1 11
17 13 40 2 24 6 43 10 43 4 0 23 -4 44 -9 l36 -8 7 44 7 45 49 -4 49 -5 0 38
0 39 47 0 46 0 -6 103 -5 102 515 355 516 356 91 -91 c54 -53 85 -91 77 -93
-7 -2 -243 -211 -525 -465 -281 -253 -521 -469 -533 -480 -21 -19 -24 -19 -63
-3 -22 9 -43 16 -45 16 -3 0 -5 -17 -5 -38 0 -21 -3 -41 -6 -44 -3 -4 -21 0
-39 8 -19 8 -36 14 -39 14 -2 0 -7 -22 -11 -50 -4 -27 -9 -50 -11 -50 -2 0
-26 9 -54 20 l-51 20 7 -56 c6 -52 5 -56 -12 -51 -11 3 -40 8 -65 12 l-47 6
-6 -46 c-6 -37 -11 -45 -24 -41 -9 3 -39 8 -65 12 l-49 7 7 -57 7 -57 -43 7
c-24 3 -50 7 -56 10 -9 2 -13 -13 -13 -54 0 -55 -3 -61 -80 -169 l-79 -112
136 -128 c74 -70 140 -127 147 -125 6 2 421 157 921 344 l910 342 244 235
c134 130 300 291 370 357 l126 122 -23 24 -22 24 252 195 c139 107 258 198
265 202 7 4 21 2 31 -4 16 -10 29 -4 88 38 38 27 143 99 234 160 699 467 1245
741 1572 788 57 9 109 18 116 20 7 3 34 -6 60 -19 129 -64 194 -68 437 -26
740 129 1565 470 2605 1078 627 366 819 514 1620 1243 737 671 1122 979 1793
1434 134 91 150 105 173 152 25 49 26 60 22 165 -5 119 -25 198 -68 258 -41
57 -190 77 -346 45 -127 -27 -522 -204 -779 -350 -245 -139 -387 -242 -655
-477 -1813 -1585 -3808 -2592 -5365 -2709 -199 -15 -205 -17 -205 -67 l0 -39
-327 -13 c-181 -6 -359 -15 -398 -19 l-70 -7 -350 -240 c-401 -276 -393 -271
-401 -249 -4 9 -4 18 -1 21 3 3 171 120 373 260 l368 254 150 435 151 434 50
33 c77 51 233 212 317 328 97 134 178 268 368 610 352 633 553 914 889 1251
316 314 553 494 1666 1254 378 259 589 410 870 625 127 97 298 227 380 290
624 474 798 695 797 1015 0 107 -23 179 -82 253 -88 112 -271 175 -402 139z"/>
</g>
</svg>
