<?xml version="1.0" standalone="no"?>
<!DOCTYPE svg PUBLIC "-//W3C//DTD SVG 20010904//EN"
 "http://www.w3.org/TR/2001/REC-SVG-20010904/DTD/svg10.dtd">
<svg version="1.0" xmlns="http://www.w3.org/2000/svg"
 width="1280.000000pt" height="1066.000000pt" viewBox="0 0 1280.000000 1066.000000"
 preserveAspectRatio="xMidYMid meet">
<metadata>
Created by potrace 1.15, written by Peter Selinger 2001-2017
</metadata>
<g transform="translate(0.000000,1066.000000) scale(0.100000,-0.100000)"
fill="#000000" stroke="none">
<path d="M535 10650 c-72 -4 -133 -8 -136 -9 -4 0 -9 -20 -13 -43 -3 -24 -26
-149 -51 -278 l-45 -235 -64 -1080 c-88 -1458 -84 -1397 -96 -1600 -6 -99 -15
-252 -20 -340 -5 -88 -14 -241 -20 -340 -6 -99 -15 -252 -20 -340 -5 -88 -14
-241 -20 -340 -6 -99 -15 -250 -20 -335 -5 -85 -14 -245 -21 -355 -22 -371 7
-756 71 -946 39 -116 111 -191 246 -258 72 -36 194 -71 245 -71 l36 0 -1 -87
c0 -93 15 -154 61 -247 14 -27 27 -73 30 -103 l6 -55 -44 3 -44 4 -26 -433
c-15 -239 -29 -436 -32 -438 -3 -3 -47 -8 -98 -11 -106 -6 -121 -15 -167 -92
-32 -55 -32 -115 1 -226 l24 -80 76 -23 c87 -26 82 -17 92 -172 8 -118 28
-307 55 -510 20 -154 41 -313 80 -607 11 -84 29 -222 40 -305 11 -84 29 -220
40 -303 11 -82 25 -193 31 -247 6 -53 14 -100 18 -106 3 -5 29 -13 57 -16 47
-7 51 -6 62 18 16 35 36 33 73 -9 59 -65 78 -48 187 171 153 306 262 553 262
594 0 21 4 41 8 44 5 3 431 1 948 -4 516 -5 1511 -14 2209 -20 699 -6 1747
-15 2330 -20 583 -5 1663 -14 2400 -20 1502 -12 2037 -20 1957 -31 -29 -4 -69
-10 -88 -14 l-36 -6 7 -52 c3 -29 8 -69 11 -89 l6 -38 330 0 c304 0 341 2 482
25 237 39 359 74 372 109 3 7 -4 146 -15 308 -25 356 -26 398 -7 398 7 0 25
10 40 21 22 17 26 27 21 48 -19 74 -32 207 -70 731 -20 279 -85 1278 -85 1312
0 23 -8 32 -43 49 l-42 21 3 76 c4 89 -15 135 -66 165 -50 29 -177 48 -372 55
-177 7 -185 8 -188 28 -4 27 5 34 122 85 l98 43 -6 90 c-12 153 -11 152 -69
175 -75 30 -159 50 -265 63 -170 21 -378 -18 -517 -96 l-60 -34 2 -68 c1 -38
5 -102 9 -142 l6 -72 139 0 139 0 0 -51 0 -52 -167 7 c-93 3 -247 9 -343 12
l-175 6 -39 -56 c-21 -31 -41 -56 -44 -56 -2 0 -1 32 2 70 l7 70 -208 -2 -207
-3 -66 -79 c-56 -68 -65 -75 -68 -55 -2 13 -20 467 -40 1010 l-37 987 34 44
c43 56 83 136 111 223 19 58 24 103 30 270 8 214 19 266 63 295 17 11 73 16
242 20 257 6 252 4 319 108 89 136 101 181 122 433 5 62 7 67 32 72 49 11 93
47 130 107 37 60 52 73 52 46 0 -26 20 -28 31 -2 13 28 39 25 39 -5 0 -25 20
-24 27 1 6 24 35 27 31 4 -5 -27 21 -28 27 -2 5 20 11 24 35 20 26 -4 30 -9
36 -47 l6 -43 194 -7 c106 -4 200 -5 207 -2 8 3 19 25 26 49 l12 43 130 -5
c127 -5 130 -4 145 18 l15 22 47 -24 c46 -23 52 -23 257 -19 339 6 355 6 460
-5 95 -10 101 -9 123 11 35 32 82 136 94 208 13 73 -6 202 -45 319 l-22 65
-135 5 c-122 5 -149 10 -275 48 -299 91 -311 91 -385 13 l-56 -59 -52 63 -51
63 -96 7 -95 7 0 29 0 29 -255 0 -255 0 0 -25 0 -25 -130 0 -130 0 -6 28 c-27
121 -46 163 -99 214 -21 20 -54 44 -75 53 -35 16 -39 22 -50 77 -18 84 -62
146 -130 183 l-55 30 -602 10 -602 10 -53 51 -53 52 -730 11 c-401 6 -1002 16
-1335 21 -1088 18 -1846 30 -2357 36 l-501 7 -11 -39 c-6 -21 -11 -46 -11 -54
0 -13 -24 -14 -182 -8 -418 17 -471 28 -523 106 -35 53 -41 114 -21 224 49
281 72 679 46 797 -20 91 -59 153 -109 172 -13 5 -195 112 -405 238 l-381 228
-395 27 c-217 15 -476 34 -575 42 -208 17 -869 26 -1060 14z m10512 -2852 c-3
-7 -5 -2 -5 12 0 14 2 19 5 13 2 -7 2 -19 0 -25z m976 -5 c-7 -2 -21 -2 -30 0
-10 3 -4 5 12 5 17 0 24 -2 18 -5z m735 -10 c-10 -2 -26 -2 -35 0 -10 3 -2 5
17 5 19 0 27 -2 18 -5z m-6958 -1123 c212 -6 511 -15 665 -20 154 -5 692 -21
1195 -36 1020 -29 941 -22 1037 -101 66 -53 96 -105 182 -314 44 -107 94 -225
111 -264 l31 -70 19 -625 c30 -954 39 -1274 42 -1398 l3 -114 -180 1 c-99 1
-434 6 -745 11 -311 5 -846 14 -1190 20 -344 6 -893 15 -1220 20 -1476 25
-1853 31 -2415 40 -330 5 -749 12 -931 16 l-330 7 4 116 c2 64 7 153 10 197
l7 82 94 -84 c102 -90 101 -90 143 -32 20 28 32 90 58 288 5 41 25 190 44 330
18 140 44 341 56 445 12 105 24 195 26 202 4 17 106 67 186 91 127 40 277 56
503 56 382 -1 764 -62 960 -153 133 -62 315 -202 508 -390 70 -68 127 -122
127 -119 0 3 7 21 15 41 l14 35 -71 103 c-274 402 -555 729 -710 829 -121 79
-384 120 -765 120 l-192 0 -68 44 c-37 24 -101 60 -140 80 -40 20 -73 38 -73
41 0 3 87 5 193 5 l193 0 38 -65 c21 -36 41 -65 44 -65 4 0 133 -14 287 -30
154 -16 291 -30 305 -30 21 0 33 14 78 100 l53 100 247 1 c136 1 368 4 515 8
l268 6 58 145 c61 153 107 249 148 311 l25 38 77 -4 c42 -3 249 -10 461 -15z
m-4525 -3020 c3 -5 1 -10 -4 -10 -6 0 -11 5 -11 10 0 6 2 10 4 10 3 0 8 -4 11
-10z m635 -44 c0 -69 8 -66 -207 -66 l-196 0 6 36 c3 20 8 39 11 41 5 5 218
19 324 22 l62 1 0 -34z m8799 -136 l-1 -25 -8 25 c-4 14 -8 32 -9 40 -1 13 0
13 9 0 5 -8 9 -26 9 -40z"/>
</g>
</svg>
