astroid==2.15.2
black==23.3.0
cairocffi==1.5.0
CairoSVG==2.7.0
certifi==2022.12.7
cffi==1.15.1
charset-normalizer==3.1.0
click==8.1.3
cssselect2==0.7.0
defusedxml==0.7.1
dill==0.3.6
idna==3.4
isort==5.12.0
lazy-object-proxy==1.9.0
mccabe==0.7.0
mypy==1.2.0
mypy-extensions==1.0.0
packaging==23.0
pathspec==0.11.1
Pillow==9.5.0
platformdirs==3.2.0
pycparser==2.21
pylint==2.17.2
requests==2.28.2
sentry-sdk==1.19.1
tinycss2==1.2.1
tomlkit==0.11.7
typing_extensions==4.5.0
urllib3==1.26.15
webencodings==0.5.1
wrapt==1.15.0
