{
  "core": {
    "dimension": {
      "scale": {
        "value": "2",
        "type": "dimension"
      },
      "xs": {
        "value": "4",
        "type": "dimension"
      },
      "sm": {
        "value": "{dimension.xs} * {dimension.scale}",
        "type": "dimension"
      },
      "md": {
        "value": "{dimension.sm} * {dimension.scale}",
        "type": "dimension"
      },
      "lg": {
        "value": "{dimension.md} * {dimension.scale}",
        "type": "dimension"
      },
      "xl": {
        "value": "{dimension.lg} * {dimension.scale}",
        "type": "dimension"
      }
    },
    "spacing": {
      "xs": {
        "value": "{dimension.xs}",
        "type": "spacing"
      },
      "sm": {
        "value": "{dimension.sm}",
        "type": "spacing"
      },
      "md": {
        "value": "{dimension.md}",
        "type": "spacing"
      },
      "lg": {
        "value": "{dimension.lg}",
        "type": "spacing"
      },
      "xl": {
        "value": "{dimension.xl}",
        "type": "spacing"
      },
      "multi-value": {
        "value": "{dimension.sm} {dimension.xl}",
        "type": "spacing",
        "description": "You can have multiple values in a single spacing token. Read more on these: https://docs.tokens.studio/available-tokens/spacing-tokens#multi-value-spacing-tokens"
      }
    },
    "borderRadius": {
      "sm": {
        "value": "4",
        "type": "borderRadius"
      },
      "lg": {
        "value": "8",
        "type": "borderRadius"
      },
      "xl": {
        "value": "16",
        "type": "borderRadius"
      },
      "multi-value": {
        "value": "{borderRadius.sm} {borderRadius.lg}",
        "type": "borderRadius",
        "description": "You can have multiple values in a single radius token. Read more on these: https://docs.tokens.studio/available-tokens/border-radius-tokens#single--multiple-values"
      }
    },
    "colors": {
      "black": {
        "value": "#000000",
        "type": "color"
      },
      "white": {
        "value": "#ffffff",
        "type": "color"
      },
      "gray": {
        "100": {
          "value": "#f7fafc",
          "type": "color"
        },
        "200": {
          "value": "#edf2f7",
          "type": "color"
        },
        "300": {
          "value": "#909090",
          "type": "color",
          "description": "form-line"
        },
        "400": {
          "value": "#cbd5e0",
          "type": "color"
        },
        "500": {
          "value": "#444444",
          "type": "color",
          "description": "text"
        },
        "600": {
          "value": "#ddd",
          "type": "color"
        }
      },
      "red": {
        "100": {
          "value": "#fff5f5",
          "type": "color"
        },
        "200": {
          "value": "#fed7d7",
          "type": "color"
        },
        "300": {
          "value": "#feb2b2",
          "type": "color"
        }
      },
      "orange": {
        "100": {
          "value": "#fffaf0",
          "type": "color"
        },
        "200": {
          "value": "#feebc8",
          "type": "color"
        },
        "300": {
          "value": "#fbd38d",
          "type": "color"
        }
      },
      "yellow": {
        "100": {
          "value": "#fffff0",
          "type": "color"
        },
        "200": {
          "value": "#fefcbf",
          "type": "color"
        },
        "300": {
          "value": "#faf089",
          "type": "color"
        }
      },
      "green": {
        "100": {
          "value": "#f0fff4",
          "type": "color"
        },
        "200": {
          "value": "#c6f6d5",
          "type": "color"
        },
        "300": {
          "value": "#9ae6b4",
          "type": "color"
        }
      },
      "blue": {
        "100": {
          "value": "#ebf8ff",
          "type": "color"
        },
        "200": {
          "value": "#bee3f8",
          "type": "color"
        },
        "300": {
          "value": "#90cdf4",
          "type": "color"
        }
      },
      "purple": {
        "100": {
          "value": "#faf5ff",
          "type": "color"
        },
        "200": {
          "value": "#e9d8fd",
          "type": "color"
        },
        "300": {
          "value": "#d6bcfa",
          "type": "color"
        }
      },
      "pink": {
        "50": {
          "value": "#FFF4F8",
          "type": "color",
          "description": "current color"
        },
        "100": {
          "value": "#FBD5E3",
          "type": "color"
        },
        "200": {
          "value": "#EA5188",
          "type": "color"
        },
        "300": {
          "value": "#DF0050",
          "type": "color",
          "description": "CAPS brand color"
        },
        "400": {
          "value": "#BA0043",
          "type": "color"
        }
      }
    },
    "opacity": {
      "low": {
        "value": "10%",
        "type": "opacity"
      },
      "md": {
        "value": "50%",
        "type": "opacity"
      },
      "high": {
        "value": "90%",
        "type": "opacity"
      }
    },
    "fontFamilies": {
      "heading": {
        "value": "Inter",
        "type": "fontFamilies"
      },
      "body": {
        "value": "Roboto",
        "type": "fontFamilies"
      }
    },
    "lineHeights": {
      "heading": {
        "value": "110%",
        "type": "lineHeights"
      },
      "body": {
        "value": "140%",
        "type": "lineHeights"
      }
    },
    "letterSpacing": {
      "default": {
        "value": "0",
        "type": "letterSpacing"
      },
      "increased": {
        "value": "150%",
        "type": "letterSpacing"
      },
      "decreased": {
        "value": "-5%",
        "type": "letterSpacing"
      }
    },
    "paragraphSpacing": {
      "h1": {
        "value": "32",
        "type": "paragraphSpacing"
      },
      "h2": {
        "value": "26",
        "type": "paragraphSpacing"
      }
    },
    "fontWeights": {
      "headingRegular": {
        "value": "Regular",
        "type": "fontWeights"
      },
      "headingBold": {
        "value": "Bold",
        "type": "fontWeights"
      },
      "bodyRegular": {
        "value": "Regular",
        "type": "fontWeights"
      },
      "bodyBold": {
        "value": "Bold",
        "type": "fontWeights"
      }
    },
    "fontSizes": {
      "h1": {
        "value": "{fontSizes.h2} * 1.25",
        "type": "fontSizes"
      },
      "h2": {
        "value": "{fontSizes.h3} * 1.25",
        "type": "fontSizes"
      },
      "h3": {
        "value": "{fontSizes.h4} * 1.25",
        "type": "fontSizes"
      },
      "h4": {
        "value": "{fontSizes.h5} * 1.25",
        "type": "fontSizes"
      },
      "h5": {
        "value": "{fontSizes.h6} * 1.25",
        "type": "fontSizes"
      },
      "h6": {
        "value": "{fontSizes.body} * 1",
        "type": "fontSizes"
      },
      "body": {
        "value": "16",
        "type": "fontSizes"
      },
      "sm": {
        "value": "{fontSizes.body} * 0.85",
        "type": "fontSizes"
      },
      "xs": {
        "value": "{fontSizes.body} * 0.65",
        "type": "fontSizes"
      }
    }
  },
  "light": {
    "fg": {
      "default": {
        "value": "{colors.black}",
        "type": "color"
      },
      "muted": {
        "value": "{colors.gray.700}",
        "type": "color"
      },
      "subtle": {
        "value": "{colors.gray.500}",
        "type": "color"
      }
    },
    "bg": {
      "default": {
        "value": "{colors.white}",
        "type": "color"
      },
      "muted": {
        "value": "{colors.gray.100}",
        "type": "color"
      },
      "subtle": {
        "value": "{colors.gray.200}",
        "type": "color"
      }
    },
    "accent": {
      "default": {
        "value": "{colors.indigo.400}",
        "type": "color"
      },
      "onAccent": {
        "value": "{colors.white}",
        "type": "color"
      },
      "bg": {
        "value": "{colors.indigo.200}",
        "type": "color"
      }
    },
    "shadows": {
      "default": {
        "value": "{colors.gray.900}",
        "type": "color"
      }
    }
  },
  "dark": {
    "fg": {
      "default": {
        "value": "{colors.white}",
        "type": "color"
      },
      "muted": {
        "value": "{colors.gray.300}",
        "type": "color"
      },
      "subtle": {
        "value": "{colors.gray.500}",
        "type": "color"
      }
    },
    "bg": {
      "default": {
        "value": "{colors.gray.900}",
        "type": "color"
      },
      "muted": {
        "value": "{colors.gray.700}",
        "type": "color"
      },
      "subtle": {
        "value": "{colors.gray.600}",
        "type": "color"
      }
    },
    "accent": {
      "default": {
        "value": "{colors.indigo.600}",
        "type": "color"
      },
      "onAccent": {
        "value": "{colors.white}",
        "type": "color"
      },
      "bg": {
        "value": "{colors.indigo.800}",
        "type": "color"
      }
    },
    "shadows": {
      "default": {
        "value": "rgba({colors.black}, 0.3)",
        "type": "color"
      }
    }
  },
  "theme": {
    "button": {
      "primary": {
        "background": {
          "value": "{accent.default}",
          "type": "color"
        },
        "text": {
          "value": "{accent.onAccent}",
          "type": "color"
        }
      },
      "borderRadius": {
        "value": "{borderRadius.lg}",
        "type": "borderRadius"
      },
      "borderWidth": {
        "value": "{dimension.sm}",
        "type": "borderWidth"
      }
    },
    "card": {
      "borderRadius": {
        "value": "{borderRadius.lg}",
        "type": "borderRadius"
      },
      "background": {
        "value": "{bg.default}",
        "type": "color"
      },
      "padding": {
        "value": "{dimension.md}",
        "type": "dimension"
      }
    },
    "boxShadow": {
      "default": {
        "value": [
          {
            "x": 5,
            "y": 5,
            "spread": 3,
            "color": "rgba({shadows.default}, 0.15)",
            "blur": 5,
            "type": "dropShadow"
          },
          {
            "x": 4,
            "y": 4,
            "spread": 6,
            "color": "#00000033",
            "blur": 5,
            "type": "innerShadow"
          }
        ],
        "type": "boxShadow"
      }
    },
    "typography": {
      "H1": {
        "Bold": {
          "type": "typography",
          "value": {
            "fontFamily": "{fontFamilies.heading}",
            "fontWeight": "{fontWeights.headingBold}",
            "lineHeight": "{lineHeights.heading}",
            "fontSize": "{fontSizes.h1}",
            "paragraphSpacing": "{paragraphSpacing.h1}",
            "letterSpacing": "{letterSpacing.decreased}"
          }
        },
        "Regular": {
          "type": "typography",
          "value": {
            "fontFamily": "{fontFamilies.heading}",
            "fontWeight": "{fontWeights.headingRegular}",
            "lineHeight": "{lineHeights.heading}",
            "fontSize": "{fontSizes.h1}",
            "paragraphSpacing": "{paragraphSpacing.h1}",
            "letterSpacing": "{letterSpacing.decreased}"
          }
        }
      },
      "H2": {
        "Bold": {
          "type": "typography",
          "value": {
            "fontFamily": "{fontFamilies.heading}",
            "fontWeight": "{fontWeights.headingBold}",
            "lineHeight": "{lineHeights.heading}",
            "fontSize": "{fontSizes.h2}",
            "paragraphSpacing": "{paragraphSpacing.h2}",
            "letterSpacing": "{letterSpacing.decreased}"
          }
        },
        "Regular": {
          "type": "typography",
          "value": {
            "fontFamily": "{fontFamilies.heading}",
            "fontWeight": "{fontWeights.headingRegular}",
            "lineHeight": "{lineHeights.heading}",
            "fontSize": "{fontSizes.h2}",
            "paragraphSpacing": "{paragraphSpacing.h2}",
            "letterSpacing": "{letterSpacing.decreased}"
          }
        }
      },
      "Body": {
        "type": "typography",
        "value": {
          "fontFamily": "{fontFamilies.body}",
          "fontWeight": "{fontWeights.bodyRegular}",
          "lineHeight": "{lineHeights.heading}",
          "fontSize": "{fontSizes.body}",
          "paragraphSpacing": "{paragraphSpacing.h2}"
        }
      }
    }
  },
  "$themes": [],
  "$metadata": {
    "tokenSetOrder": [
      "core",
      "light",
      "dark",
      "theme"
    ]
  }
}