{
    "name": "Deploy",
    "application": "devops-test",
    "id": "2650c7c9-dd0a-4f59-ab0d-9c96a34cd1bc",
    "appConfig": {},
    "keepWaitingPipelines": true,
    "lastModifiedBy": "anonymous",
    "limitConcurrent": true,
    "parallel": true,
    "expectedArtifacts": [
        {
            "defaultArtifact": {
                "kind": "default.gcs",
                "name": "gs://PROJECT-kubernetes-manifests/deployment.yaml",
                "reference": "gs://PROJECT-kubernetes-manifests/deployment.yaml",
                "type": "gcs/object"
            },
            "id": "f07830d8-80ac-4d21-a879-35c1f3592698",
            "matchArtifact": {
                "kind": "gcs",
                "name": "gs://PROJECT-kubernetes-manifests/deployment.yaml",
                "type": "gcs/object"
            },
            "useDefaultArtifact": true,
            "usePriorArtifact": true,
            "usePriorExecution": false
        },
        {
            "defaultArtifact": {
                "kind": "default.docker",
                "name": "gcr.io/PROJECT/devops-test",
                "reference": "gcr.io/PROJECT/devops-test:v1.0.0",
                "type": "docker/image",
                "version": "v1.0.0"
            },
            "id": "80c8982d-f5df-4d31-b828-5d537d8f67aa",
            "matchArtifact": {
                "kind": "docker",
                "name": "gcr.io/PROJECT/devops-test",
                "type": "docker/image"
            },
            "useDefaultArtifact": true,
            "usePriorArtifact": true,
            "usePriorExecution": false
        },
        {
            "defaultArtifact": {
                "id": "1821af7d-d1ed-43c0-b8d1-fca97ed761d0",
                "kind": "default.gcs",
                "name": "gs://PROJECT-kubernetes-manifests/service.yaml",
                "reference": "gs://PROJECT-kubernetes-manifests/service.yaml",
                "type": "gcs/object"
            },
            "id": "3252c062-dcf0-48cf-a948-569d101f0622",
            "matchArtifact": {
                "id": "7da3f869-69b7-480a-9623-cac2e6c7552c",
                "kind": "gcs",
                "name": "gs://PROJECT-kubernetes-manifests/service.yaml",
                "type": "gcs/object"
            },
            "useDefaultArtifact": true,
            "usePriorArtifact": true
        },
        {
            "defaultArtifact": {
                "id": "f34787e7-fd0c-417e-94fd-3b841e0d4448",
                "kind": "default.gcs",
                "name": "gs://PROJECT-kubernetes-manifests/deployment-canary.yaml",
                "reference": "gs://PROJECT-kubernetes-manifests/deployment-canary.yaml",
                "type": "gcs/object"
            },
            "id": "a436ab58-954a-4f3d-99f0-c80f54e09a00",
            "matchArtifact": {
                "id": "37fb12bf-22c7-482f-b606-a176ddaecd85",
                "kind": "gcs",
                "name": "gs://PROJECT-kubernetes-manifests/deployment-canary.yaml",
                "type": "gcs/object"
            },
            "useDefaultArtifact": true,
            "usePriorArtifact": true
        }
    ],
    "keepWaitingPipelines": false,
    "lastModifiedBy": "anonymous",
    "limitConcurrent": true,
    "stages": [
        {
            "account": "default",
            "cloudProvider": "kubernetes",
            "completeOtherBranchesThenFail": false,
            "continuePipeline": false,
            "failPipeline": true,
            "manifestArtifactAccount": "gcs-PROJECT",
            "manifestArtifactId": "f07830d8-80ac-4d21-a879-35c1f3592698",
            "moniker": {
                "app": "sample"
            },
            "name": "Deploy Production",
            "refId": "1",
            "relationships": {
                "loadBalancers": [],
                "securityGroups": []
            },
            "requiredArtifactIds": [
                "80c8982d-f5df-4d31-b828-5d537d8f67aa"
            ],
            "requisiteStageRefIds": [
                "2"
            ],
            "source": "artifact",
            "type": "deployManifest"
        },
        {
            "failPipeline": true,
            "judgmentInputs": [],
            "name": "Deploy to Production?",
            "notifications": [],
            "refId": "2",
            "requisiteStageRefIds": [
                "3",
                "4"
            ],
            "type": "manualJudgment"
        },
        {
            "account": "default",
            "cloudProvider": "kubernetes",
            "completeOtherBranchesThenFail": false,
            "continuePipeline": false,
            "failPipeline": true,
            "manifestArtifactAccount": "gcs-PROJECT",
            "manifestArtifactId": "a436ab58-954a-4f3d-99f0-c80f54e09a00",
            "moniker": {
                "app": "sample"
            },
            "name": "Deploy Canary",
            "refId": "3",
            "relationships": {
                "loadBalancers": [],
                "securityGroups": []
            },
            "requiredArtifactIds": [
                "80c8982d-f5df-4d31-b828-5d537d8f67aa"
            ],
            "requisiteStageRefIds": [],
            "source": "artifact",
            "type": "deployManifest"
        },
        {
            "account": "default",
            "cloudProvider": "kubernetes",
            "manifestArtifactAccount": "gcs-PROJECT",
            "manifestArtifactId": "3252c062-dcf0-48cf-a948-569d101f0622",
            "moniker": {
                "app": "sample"
            },
            "name": "Deploy Service",
            "refId": "4",
            "relationships": {
                "loadBalancers": [],
                "securityGroups": []
            },
            "requisiteStageRefIds": [],
            "source": "artifact",
            "type": "deployManifest"
        }
    ],
    "triggers": [
        {
            "account": "gcr",
            "attributeConstraints": {},
            "enabled": true,
            "expectedArtifactIds": [
                "80c8982d-f5df-4d31-b828-5d537d8f67aa"
            ],
            "organization": "PROJECT",
            "payloadConstraints": {
                "tag": "gcr.io/PROJECT/devops-test:v.*"
            },
            "pubsubSystem": "google",
            "registry": "gcr.io",
            "repository": "PROJECT/devops-test",
            "subscriptionName": "gcr-triggers",
            "tag": "v.*",
            "type": "pubsub"
        }
    ],
    "updateTs": "1541650310471"
}
