hiragana,number,
!,0,start
"""",1,1st
#,2,2nd
$,3,period
あ,4,
ぁ,5,
い,6,
ぃ,7,
う,8,
ぅ,9,
え,10,
ぇ,11,
お,12,
ぉ,13,
か,14,
が,15,
き,16,
ぎ,17,
く,18,
ぐ,19,
け,20,
げ,21,
こ,22,
ご,23,
さ,24,
ざ,25,
し,26,
じ,27,
す,28,
ず,29,
せ,30,
ぜ,31,
そ,32,
ぞ,33,
た,34,
だ,35,
ち,36,
ぢ,37,
つ,38,
づ,39,
て,40,
で,41,
と,42,
ど,43,
な,44,
に,45,
ぬ,46,
ね,47,
の,48,
は,49,
ば,50,
ぱ,51,
ひ,52,
び,53,
ぴ,54,
ふ,55,
ぶ,56,
ぷ,57,
へ,58,
べ,59,
ぺ,60,
ほ,61,
ぼ,62,
ぽ,63,
ま,64,
み,65,
む,66,
め,67,
も,68,
や,69,
ゃ,70,
ゆ,71,
ゅ,72,
よ,73,
ょ,74,
ら,75,
り,76,
る,77,
れ,78,
ろ,79,
わ,80,
ゎ,81,
を,82,
ゐ,83,
ゑ,84,
ん,85,
ゝ,86,
ゞ,87,
っ,88,
