<?xml version="1.0" encoding="UTF-8" ?>
<testsuite tests="1" failures="0" name="org.spaceinvaders.app.AppTest" time="0.015" errors="0" skipped="0">
  <properties>
    <property name="java.runtime.name" value="Java(TM) SE Runtime Environment"/>
    <property name="sun.boot.library.path" value="C:\Users\Petra\Desktop\PPKE\workspace\UNIVERSITY_PACK\jdk1.8.0_181\jre\bin"/>
    <property name="java.vm.version" value="25.181-b13"/>
    <property name="java.vm.vendor" value="Oracle Corporation"/>
    <property name="maven.multiModuleProjectDirectory" value="C:\Users\Petra\Desktop\PPKE\workspace\UNIVERSITY_PACK\jenkins_home\workspace\spaceinvaders-build"/>
    <property name="java.vendor.url" value="http://java.oracle.com/"/>
    <property name="path.separator" value=";"/>
    <property name="guice.disable.misplaced.annotation.check" value="true"/>
    <property name="java.vm.name" value="Java HotSpot(TM) 64-Bit Server VM"/>
    <property name="file.encoding.pkg" value="sun.io"/>
    <property name="user.script" value=""/>
    <property name="user.country" value="HU"/>
    <property name="sun.java.launcher" value="SUN_STANDARD"/>
    <property name="sun.os.patch.level" value=""/>
    <property name="java.vm.specification.name" value="Java Virtual Machine Specification"/>
    <property name="user.dir" value="C:\Users\Petra\Desktop\PPKE\workspace\UNIVERSITY_PACK\jenkins_home\workspace\spaceinvaders-build"/>
    <property name="java.runtime.version" value="1.8.0_181-b13"/>
    <property name="java.awt.graphicsenv" value="sun.awt.Win32GraphicsEnvironment"/>
    <property name="java.endorsed.dirs" value="C:\Users\Petra\Desktop\PPKE\workspace\UNIVERSITY_PACK\jdk1.8.0_181\jre\lib\endorsed"/>
    <property name="os.arch" value="amd64"/>
    <property name="java.io.tmpdir" value="C:\Users\Petra\AppData\Local\Temp\"/>
    <property name="line.separator" value="
"/>
    <property name="java.vm.specification.vendor" value="Oracle Corporation"/>
    <property name="user.variant" value=""/>
    <property name="os.name" value="Windows 10"/>
    <property name="classworlds.conf" value="C:\Users\Petra\Desktop\PPKE\workspace\UNIVERSITY_PACK\jenkins_home\tools\hudson.tasks.Maven_MavenInstallation\Maven_3.5.4\bin\..\bin\m2.conf"/>
    <property name="sun.jnu.encoding" value="Cp1250"/>
    <property name="java.library.path" value="C:\Users\Petra\Desktop\PPKE\workspace\UNIVERSITY_PACK\jdk1.8.0_181\bin;C:\WINDOWS\Sun\Java\bin;C:\WINDOWS\system32;C:\WINDOWS;C:\Users\Petra\Desktop\PPKE\workspace\UNIVERSITY_PACK\jenkins_home\tools\hudson.tasks.Maven_MavenInstallation\Maven_3.5.4/bin;C:\Program Files (x86)\Common Files\Oracle\Java\javapath;C:\WINDOWS\system32;C:\WINDOWS;C:\WINDOWS\System32\Wbem;C:\WINDOWS\System32\WindowsPowerShell\v1.0\;C:\WINDOWS\System32\OpenSSH\;C:\Program Files\Git\cmd;C:\Users\Petra\AppData\Local\Microsoft\WindowsApps;C:\Users\Petra\AppData\Local\GitHubDesktop\bin;C:\Program Files\Java\jdk1.8.0_181\bin;C:\Users\Petra\Desktop\PPKE\apache-maven-3.5.4\bin;;."/>
    <property name="maven.conf" value="C:\Users\Petra\Desktop\PPKE\workspace\UNIVERSITY_PACK\jenkins_home\tools\hudson.tasks.Maven_MavenInstallation\Maven_3.5.4\bin\../conf"/>
    <property name="java.specification.name" value="Java Platform API Specification"/>
    <property name="java.class.version" value="52.0"/>
    <property name="sun.management.compiler" value="HotSpot 64-Bit Tiered Compilers"/>
    <property name="os.version" value="10.0"/>
    <property name="library.jansi.path" value="C:\Users\Petra\Desktop\PPKE\workspace\UNIVERSITY_PACK\jenkins_home\tools\hudson.tasks.Maven_MavenInstallation\Maven_3.5.4\bin\..\lib\jansi-native"/>
    <property name="user.home" value="C:\Users\Petra"/>
    <property name="user.timezone" value="Europe/Prague"/>
    <property name="java.awt.printerjob" value="sun.awt.windows.WPrinterJob"/>
    <property name="java.specification.version" value="1.8"/>
    <property name="file.encoding" value="Cp1250"/>
    <property name="user.name" value="Petra"/>
    <property name="java.class.path" value="C:\Users\Petra\Desktop\PPKE\workspace\UNIVERSITY_PACK\jenkins_home\tools\hudson.tasks.Maven_MavenInstallation\Maven_3.5.4\bin\..\boot\plexus-classworlds-2.5.2.jar"/>
    <property name="java.vm.specification.version" value="1.8"/>
    <property name="sun.arch.data.model" value="64"/>
    <property name="java.home" value="C:\Users\Petra\Desktop\PPKE\workspace\UNIVERSITY_PACK\jdk1.8.0_181\jre"/>
    <property name="sun.java.command" value="org.codehaus.plexus.classworlds.launcher.Launcher -f C:\Users\Petra\Desktop\PPKE\workspace\spaceinvaders\spaceinvaders-app\pom.xml clean install"/>
    <property name="java.specification.vendor" value="Oracle Corporation"/>
    <property name="user.language" value="hu"/>
    <property name="awt.toolkit" value="sun.awt.windows.WToolkit"/>
    <property name="java.vm.info" value="mixed mode"/>
    <property name="java.version" value="1.8.0_181"/>
    <property name="java.ext.dirs" value="C:\Users\Petra\Desktop\PPKE\workspace\UNIVERSITY_PACK\jdk1.8.0_181\jre\lib\ext;C:\WINDOWS\Sun\Java\lib\ext"/>
    <property name="sun.boot.class.path" value="C:\Users\Petra\Desktop\PPKE\workspace\UNIVERSITY_PACK\jdk1.8.0_181\jre\lib\resources.jar;C:\Users\Petra\Desktop\PPKE\workspace\UNIVERSITY_PACK\jdk1.8.0_181\jre\lib\rt.jar;C:\Users\Petra\Desktop\PPKE\workspace\UNIVERSITY_PACK\jdk1.8.0_181\jre\lib\sunrsasign.jar;C:\Users\Petra\Desktop\PPKE\workspace\UNIVERSITY_PACK\jdk1.8.0_181\jre\lib\jsse.jar;C:\Users\Petra\Desktop\PPKE\workspace\UNIVERSITY_PACK\jdk1.8.0_181\jre\lib\jce.jar;C:\Users\Petra\Desktop\PPKE\workspace\UNIVERSITY_PACK\jdk1.8.0_181\jre\lib\charsets.jar;C:\Users\Petra\Desktop\PPKE\workspace\UNIVERSITY_PACK\jdk1.8.0_181\jre\lib\jfr.jar;C:\Users\Petra\Desktop\PPKE\workspace\UNIVERSITY_PACK\jdk1.8.0_181\jre\classes"/>
    <property name="java.vendor" value="Oracle Corporation"/>
    <property name="maven.home" value="C:\Users\Petra\Desktop\PPKE\workspace\UNIVERSITY_PACK\jenkins_home\tools\hudson.tasks.Maven_MavenInstallation\Maven_3.5.4\bin\.."/>
    <property name="file.separator" value="\"/>
    <property name="java.vendor.url.bug" value="http://bugreport.sun.com/bugreport/"/>
    <property name="sun.cpu.endian" value="little"/>
    <property name="sun.io.unicode.encoding" value="UnicodeLittle"/>
    <property name="sun.desktop" value="windows"/>
    <property name="sun.cpu.isalist" value="amd64"/>
  </properties>
  <testcase classname="org.spaceinvaders.app.AppTest" name="testApp" time="0.015"/>
</testsuite>