125.66666666667 1.9629273414612
126.0 1.9464422464371
126.33333333333 1.9303030967712
126.66666666667 1.9145011901855
127.0 1.8990272283554
127.33333333333 1.8838717937469
127.66666666667 1.8690258264542
128.0 1.8544808626175
128.66666666667 1.8402296304703
129.0 1.8262639045715
129.33333333333 1.8125764131546
129.66666666667 1.799159526825
130.0 1.7860071659088
130.33333333333 1.7731114625931
130.66666666667 1.7604664564133
131.0 1.7480661869049
131.33333333333 1.7359036207199
131.66666666667 1.7239742279053
132.0 1.7122718095779
132.33333333333 1.7007904052734
132.66666666667 1.6895252466202
133.0 1.6784712076187
133.33333333333 1.6676231622696
133.66666666667 1.6569765806198
134.0 1.6465260982513
134.33333333333 1.6362683773041
134.66666666667 1.6261985301971
135.33333333333 1.6163121461868
135.66666666667 1.6066055297852
136.0 1.5970746278763
136.33333333333 1.5950109958649
136.66666666667 1.6053882837296
137.0 1.6159627437592
137.33333333333 1.6267386674881
137.66666666667 1.6377221345901
138.0 1.6489174365997
138.33333333333 1.6603286266327
138.66666666667 1.6719632148743
139.0 1.5186064243317
139.33333333333 1.5106400251389
139.66666666667 1.502812743187
140.0 1.4951224327087
140.33333333333 1.4875659942627
140.66666666667 1.4801412820816
141.0 1.4728449583054
141.66666666667 1.4656755924225
142.0 1.4586305618286
142.33333333333 1.4517070055008
142.66666666667 1.4449026584625
143.0 1.4382160902023
143.33333333333 1.431644320488
143.66666666667 1.4251860380173
144.0 1.4188392162323
144.33333333333 1.4126014709473
144.66666666667 1.4064711332321
145.0 1.4004460573196
145.33333333333 1.3945246934891
145.66666666667 1.3887053728104
146.0 1.3829857110977
146.33333333333 1.3773655891418
146.66666666667 1.3718419075012
147.0 1.3664134740829
147.33333333333 1.3610792160034
148.0 1.3558371067047
148.33333333333 1.3506858348846
148.66666666667 1.3456239700317
149.0 1.3406505584717
149.33333333333 1.3357632160187
149.66666666667 1.330962061882
150.0 1.326244354248
150.33333333333 1.3216097354889
150.66666666667 1.3170567750931
151.0 1.3125848770142
151.33333333333 1.3081915378571
151.66666666667 1.3038773536682
152.0 1.299639582634
152.33333333333 1.2954782247543
152.66666666667 1.2913918495178
153.0 1.2873793840408
153.33333333333 1.2834399938583
153.66666666667 1.2795726060867
154.33333333333 1.2757762670517
154.66666666667 1.2720499038696
155.0 1.2683937549591
155.33333333333 1.2648054361343
155.66666666667 1.2612847089767
156.0 1.2578308582306
156.33333333333 1.2544429302216
156.66666666667 1.2686163187027
157.0 1.2870657444
157.33333333333 1.3061093091965
157.66666666667 1.3257759809494
158.0 1.3460943698883
158.33333333333 1.3670983314514
158.66666666667 1.3888211250305
159.0 1.4112997055054
159.33333333333 1.4345717430115
159.66666666667 1.4586815834045
160.0 1.4836708307266
160.33333333333 1.5095900297165
161.0 1.5364903211594
161.33333333333 1.5644258260727
161.66666666667 1.5934566259384
162.0 1.6236488819122
162.33333333333 1.6550698280334
162.66666666667 1.687795996666
163.0 1.7219080924988
163.33333333333 1.7209932804108
163.66666666667 1.7178989648819
164.0 1.7148802280426
164.33333333333 1.711936712265
164.66666666667 1.7090672254562
165.0 1.7062712907791
165.33333333333 1.7035487890244
165.66666666667 1.7008990049362
166.0 1.6983209848404
166.33333333333 1.6958146095276
166.66666666667 1.6933796405792
167.33333333333 1.6910146474838
167.66666666667 1.6887201070786
168.0 1.686495423317
168.33333333333 1.684339761734
168.66666666667 1.6822526454926
169.0 1.680233836174
169.33333333333 1.6782832145691
169.66666666667 1.6764000654221
170.0 1.6745842695236
170.33333333333 1.6728349924088
170.66666666667 1.671152472496
171.0 1.669536113739
171.33333333333 1.6679855585098
171.66666666667 1.6665003299713
172.0 1.6650807857513
172.33333333333 1.6637259721756
172.66666666667 1.6624358892441
173.0 1.6612106561661
173.66666666667 1.6600487232208
174.0 1.6589521169662
174.33333333333 1.6579186916351
174.66666666667 1.6569488048553
175.0 1.6560426950455
175.33333333333 1.6551995277405
175.66666666667 1.6544196605682
176.0 1.6537028551102
176.33333333333 1.6530487537384
176.66666666667 1.6524572372437
177.0 1.6519284248352
177.33333333333 1.6514623165131
177.66666666667 1.6510585546494
178.0 1.6507167816162
178.33333333333 1.6504373550415
178.66666666667 1.6502199172974
179.0 1.6500649452209
179.33333333333 1.6499722003937
179.66666666667 1.6499415636063
180.33333333333 1.649973154068
181.0 1.6502369642258
181.33333333333 1.6504546403885
181.66666666667 1.6507347822189
182.0 1.6510770320892
182.33333333333 1.6514815092087
182.66666666667 1.6519485712051
183.0 1.6524782180786
183.33333333333 1.6530702114105
183.66666666667 1.6537251472473
184.0 1.6544424295425
184.33333333333 1.6552231311798
184.66666666667 1.6560668945312
185.0 1.6569737195969
185.33333333333 1.6579444408417
185.66666666667 1.6589784622192
186.0 1.6600762605667
186.66666666667 1.6612383127213
187.0 1.662464261055
187.33333333333 1.6637552976608
187.66666666667 1.6651105880737
188.0 1.666531085968
188.33333333333 1.668016910553
188.66666666667 1.6695680618286
189.0 1.6711851358414
189.33333333333 1.6728686094284
189.66666666667 1.6746187210083
190.0 1.6764353513718
190.33333333333 1.678318977356
190.66666666667 1.6802704334259
191.0 1.6822900772095
191.33333333333 1.6843776702881
191.66666666667 1.6865346431732
192.0 1.6887601613998
192.33333333333 1.6910552978516
193.0 1.6934206485748
193.33333333333 1.6958566904068
193.66666666667 1.6983642578125
194.0 1.7009428739548
194.33333333333 1.7035934925079
194.66666666667 1.7063167095184
195.0 1.7091127634048
195.33333333333 1.7119833230972
195.66666666667 1.7149279117584
196.0 1.7179474830627
196.33333333333 1.7210422754288
196.66666666667 1.723970413208
197.0 1.689824461937
197.33333333333 1.6570662260056
197.66666666667 1.6256140470505
198.0 1.5953928232193
198.33333333333 1.5663322210312
198.66666666667 1.5383684635162
199.33333333333 1.5114414691925
199.66666666667 1.4854961633682
200.0 1.4604805707932
200.33333333333 1.4363459348679
200.66666666667 1.4130494594574
201.0 1.3905472755432
201.33333333333 1.3688017129898
201.66666666667 1.3477755784988
202.0 1.3274350166321
202.33333333333 1.3077478408813
202.66666666667 1.2886834144592
203.0 1.270214676857
203.33333333333 1.2544943094254
203.66666666667 1.2578830718994
204.0 1.2613376379013
204.33333333333 1.2648589611053
204.66666666667 1.2684481143951
205.0 1.2721055746078
205.33333333333 1.2758324146271
206.0 1.2796294689178
206.33333333333 1.2834975719452
206.66666666667 1.2874377965927
207.0 1.2914510965347
207.33333333333 1.2955384254456
207.66666666667 1.2997004985809
208.0 1.3039392232895
208.33333333333 1.3082547187805
208.66666666667 1.3126482963562
209.0 1.3171217441559
209.33333333333 1.3216753005981
209.66666666667 1.3263105154037
210.0 1.331029176712
210.33333333333 1.3358317613602
210.66666666667 1.3407195806503
211.0 1.3456943035126
211.33333333333 1.3507567644119
211.66666666667 1.3559092283249
212.33333333333 1.3611525297165
212.66666666667 1.3664880990982
213.0 1.3719174861908
213.33333333333 1.3774418830872
213.66666666667 1.3830636739731
214.0 1.3887841701508
214.33333333333 1.3946043252945
214.66666666667 1.4005270004272
215.0 1.4065535068512
215.33333333333 1.41268491745
215.66666666667 1.4189234972
216.0 1.4252723455429
216.33333333333 1.4317318201065
216.66666666667 1.4383043050766
217.0 1.444992184639
217.33333333333 1.4517978429794
217.66666666667 1.4587227106094
218.0 1.4657692909241
218.66666666667 1.472940325737
219.0 1.4802374839783
219.33333333333 1.4876642227173
219.66666666667 1.4952218532562
220.0 1.5029138326645
220.33333333333 1.5107425451279
220.66666666667 1.5187108516693
221.0 1.6349083185196
221.33333333333 1.6235332489014
221.66666666667 1.6123752593994
222.0 1.60142993927
222.33333333333 1.5906918048859
222.66666666667 1.5801554918289
223.0 1.5786409378052
223.33333333333 1.5878341197968
223.66666666667 1.5971950292587
224.0 1.6067273616791
224.33333333333 1.6164366006851
224.66666666667 1.6263253688812
225.33333333333 1.6363972425461
225.66666666667 1.646656870842
226.0 1.6571093797684
226.33333333333 1.6677577495575
226.66666666667 1.6786090135574
227.0 1.689665555954
227.33333333333 1.7009327411652
227.66666666667 1.7124162912369
228.0 1.7241215705872
228.33333333333 1.736053943634
228.66666666667 1.7482186555862
229.0 1.7606213092804
229.33333333333 1.7732692956924
229.66666666667 1.7861676216125
230.0 1.7993233203888
230.33333333333 1.81274330616
230.66666666667 1.8264336585999
231.0 1.8404022455215
231.66666666667 1.854657292366
232.0 1.8692046403885
232.33333333333 1.8840540647507
232.66666666667 1.8992133140564
233.0 1.9146913290024
233.33333333333 1.9304966926575
233.66666666667 1.9466395378113