<svg width="17" height="17" viewBox="0 0 17 17" fill="none" xmlns="http://www.w3.org/2000/svg">
<path d="M5.44685 1.91078H5.28613C5.37453 1.91078 5.44685 1.83846 5.44685 1.75007V1.91078H11.554V1.75007C11.554 1.83846 11.6263 1.91078 11.7147 1.91078H11.554V3.35721H13.0004V1.75007C13.0004 1.04092 12.4239 0.464355 11.7147 0.464355H5.28613C4.57698 0.464355 4.00042 1.04092 4.00042 1.75007V3.35721H5.44685V1.91078ZM15.5718 3.35721H1.42899C1.07341 3.35721 0.786133 3.64449 0.786133 4.00007V4.64293C0.786133 4.73132 0.858454 4.80364 0.946847 4.80364H2.16024L2.65645 15.3103C2.68859 15.9954 3.25511 16.5358 3.94015 16.5358H13.0607C13.7477 16.5358 14.3123 15.9974 14.3444 15.3103L14.8406 4.80364H16.054C16.1424 4.80364 16.2147 4.73132 16.2147 4.64293V4.00007C16.2147 3.64449 15.9274 3.35721 15.5718 3.35721ZM12.906 15.0894H4.09484L3.60868 4.80364H13.3922L12.906 15.0894Z" fill="#8E91A0"/>
</svg>
