<svg width="16" height="16" viewBox="0 0 16 16" fill="none" xmlns="http://www.w3.org/2000/svg">
<path d="M6.25 13C6.00391 13 5.78516 12.918 5.62109 12.7539C5.26562 12.4258 5.26562 11.8516 5.62109 11.5234L9.36719 7.75L5.62109 4.00391C5.26562 3.67578 5.26562 3.10156 5.62109 2.77344C5.94922 2.41797 6.52344 2.41797 6.85156 2.77344L11.2266 7.14844C11.582 7.47656 11.582 8.05078 11.2266 8.37891L6.85156 12.7539C6.6875 12.918 6.46875 13 6.25 13Z" fill="#757688"/>
</svg>
