<svg width="16" height="15" viewBox="0 0 16 15" fill="none" xmlns="http://www.w3.org/2000/svg">
<g clip-path="url(#clip0_1691_71067)">
<path d="M4.44434 8.27189L6.87912 10.5881L12.4443 5.29395" stroke="#58B778" stroke-width="2" stroke-linecap="round" stroke-linejoin="round"/>
</g>
<defs>
<clipPath id="clip0_1691_71067">
<rect width="16" height="15" fill="white"/>
</clipPath>
</defs>
</svg>
