<svg width="16" height="17" viewBox="0 0 16 17" fill="none" xmlns="http://www.w3.org/2000/svg">
<path d="M12.5351 2.76087C12.8562 2.41304 13.4181 2.41304 13.7391 2.76087C14.087 3.08194 14.087 3.64381 13.7391 3.96488L9.21739 8.48662L13.7391 13.0351C14.087 13.3562 14.087 13.9181 13.7391 14.2391C13.4181 14.587 12.8562 14.587 12.5351 14.2391L7.98662 9.71739L3.46488 14.2391C3.14381 14.587 2.58194 14.587 2.26087 14.2391C1.91304 13.9181 1.91304 13.3562 2.26087 13.0351L6.78261 8.48662L2.26087 3.96488C1.91304 3.64381 1.91304 3.08194 2.26087 2.76087C2.58194 2.41304 3.14381 2.41304 3.46488 2.76087L7.98662 7.28261L12.5351 2.76087Z" fill="#757688"/>
</svg>
