<svg width="24" height="24" viewBox="0 0 24 24" fill="none" xmlns="http://www.w3.org/2000/svg">
<circle cx="12" cy="12" r="12" fill="#8E91A0"/>
<path d="M16.0625 5.125H7.9375C7.02344 5.125 6.3125 5.86133 6.3125 6.75V16.5C6.3125 17.4141 7.02344 18.125 7.9375 18.125H16.0625C16.9512 18.125 17.6875 17.4141 17.6875 16.5V6.75C17.6875 5.86133 16.9512 5.125 16.0625 5.125ZM7.9375 7.96875C7.9375 7.76562 8.11523 7.5625 8.34375 7.5625H9.15625C9.35938 7.5625 9.5625 7.76562 9.5625 7.96875V8.78125C9.5625 9.00977 9.35938 9.1875 9.15625 9.1875H8.34375C8.11523 9.1875 7.9375 9.00977 7.9375 8.78125V7.96875ZM9.5625 15.2812C9.5625 15.5098 9.35938 15.6875 9.15625 15.6875H8.34375C8.11523 15.6875 7.9375 15.5098 7.9375 15.2812V14.4688C7.9375 14.2656 8.11523 14.0625 8.34375 14.0625H9.15625C9.35938 14.0625 9.5625 14.2656 9.5625 14.4688V15.2812ZM10.4512 10.9141L9.0293 12.3359C8.95312 12.4121 8.85156 12.4375 8.75 12.4375C8.62305 12.4375 8.52148 12.4121 8.44531 12.3359L7.83594 11.7266C7.68359 11.5742 7.68359 11.2949 7.83594 11.1426C7.98828 10.9902 8.26758 10.9902 8.41992 11.1426L8.75 11.4727L9.86719 10.3301C10.0195 10.1777 10.2988 10.1777 10.4512 10.3301C10.6035 10.4824 10.6035 10.7617 10.4512 10.9141ZM15.6562 15.2812H11.5938C11.3652 15.2812 11.1875 15.1035 11.1875 14.875C11.1875 14.6719 11.3652 14.4688 11.5938 14.4688H15.6562C15.8594 14.4688 16.0625 14.6719 16.0625 14.875C16.0625 15.1035 15.8594 15.2812 15.6562 15.2812ZM15.6562 12.0312H11.5938C11.3652 12.0312 11.1875 11.8535 11.1875 11.625C11.1875 11.4219 11.3652 11.2188 11.5938 11.2188H15.6562C15.8594 11.2188 16.0625 11.4219 16.0625 11.625C16.0625 11.8535 15.8594 12.0312 15.6562 12.0312ZM15.6562 8.78125H11.5938C11.3652 8.78125 11.1875 8.60352 11.1875 8.375C11.1875 8.17188 11.3652 7.96875 11.5938 7.96875H15.6562C15.8594 7.96875 16.0625 8.17188 16.0625 8.375C16.0625 8.60352 15.8594 8.78125 15.6562 8.78125Z" fill="white"/>
</svg>
