<svg width="12" height="16" viewBox="0 0 12 16" fill="none" xmlns="http://www.w3.org/2000/svg">
<path d="M0.387573 13.316C0.387573 13.8433 0.513131 14.1635 1.00281 14.4021C2.08261 14.8855 3.5893 15.1931 5.35967 15.1994C7.18026 15.1931 9.20802 14.9169 10.6206 14.2388C11.4053 13.8559 11.6125 13.5043 11.6125 12.6819V3.08301C11.6125 2.00949 11.1165 1.50098 10.0869 1.50098H9.49053V1.28753C9.49053 0.634626 9.13897 0.314453 8.54885 0.314453C8.34795 0.314453 8.10939 0.358398 7.83316 0.452567C5.93724 1.06152 4.20454 1.46959 1.99472 1.46959H1.5176C0.795637 1.46959 0.387573 1.88393 0.387573 2.54311V13.316ZM3.66464 13.9563C5.89957 13.8684 7.9085 13.2532 9.01341 12.412C9.35869 12.1483 9.49053 11.8846 9.49053 11.3008V2.68122H10.0555C10.3129 2.68122 10.4322 2.81306 10.4322 3.10184V12.5564C10.4322 12.9268 10.3694 13.0837 10.0116 13.2344C8.86902 13.7366 7.29954 14.0505 5.81168 14.0693C5.096 14.0756 4.40543 14.0442 3.66464 13.9563ZM2.69784 6.37891V4.22559C2.69784 4.1377 2.7669 4.06236 2.85479 4.05608C4.30498 3.99958 5.61079 3.76102 6.95426 3.25879C7.03587 3.23368 7.16143 3.26507 7.16143 3.41574V5.65067C7.16143 5.70717 7.13004 5.76367 7.07354 5.78878C5.89957 6.2659 4.35521 6.52958 2.85479 6.52958C2.77318 6.52958 2.69784 6.47935 2.69784 6.37891Z" fill="#ED3902"/>
</svg>
