<svg width="47" height="48" viewBox="0 0 47 48" fill="none" xmlns="http://www.w3.org/2000/svg">
<g id="vuesax/bold/ranking">
<g id="vuesax/bold/ranking_2">
<g id="ranking">
<path id="Vector" d="M13.0634 27.9167H7.83464C5.68047 27.9167 3.91797 29.6792 3.91797 31.8334V41.6251C3.91797 42.7022 4.79922 43.5834 5.8763 43.5834H13.0634C14.1405 43.5834 15.0217 42.7022 15.0217 41.6251V29.8751C15.0217 28.798 14.1405 27.9167 13.0634 27.9167Z" fill="white"/>
<path id="Vector_2" d="M26.1064 20.0833H20.8776C18.7234 20.0833 16.9609 21.8458 16.9609 23.9999V41.6249C16.9609 42.702 17.8422 43.5833 18.9193 43.5833H28.0647C29.1418 43.5833 30.023 42.702 30.023 41.6249V23.9999C30.023 21.8458 28.2801 20.0833 26.1064 20.0833Z" fill="white"/>
<path id="Vector_3" d="M39.1636 33.7917H33.9349C32.8578 33.7917 31.9766 34.673 31.9766 35.7501V41.6251C31.9766 42.7022 32.8578 43.5834 33.9349 43.5834H41.122C42.1991 43.5834 43.0803 42.7022 43.0803 41.6251V37.7084C43.0803 35.5542 41.3178 33.7917 39.1636 33.7917Z" fill="white"/>
<path id="Vector_4" d="M29.3935 9.9979C30.0006 9.39082 30.2356 8.66623 30.0398 8.03957C29.8439 7.4129 29.2368 6.96248 28.3752 6.8254L26.4952 6.51207C26.4168 6.51207 26.2406 6.37498 26.2014 6.29665L25.1635 4.22082C24.3802 2.63457 22.5981 2.63457 21.8148 4.22082L20.7768 6.29665C20.7573 6.37498 20.581 6.51207 20.5027 6.51207L18.6227 6.8254C17.761 6.96248 17.1735 7.4129 16.9581 8.03957C16.7623 8.66623 16.9973 9.39082 17.6043 9.9979L19.0535 11.4666C19.1318 11.5254 19.1906 11.7604 19.171 11.8387L18.7598 13.6404C18.4464 14.9916 18.9556 15.5987 19.2885 15.8337C19.6214 16.0687 20.346 16.3821 21.5406 15.6771L23.3031 14.6391C23.3814 14.5804 23.636 14.5804 23.7143 14.6391L25.4573 15.6771C26.0056 16.01 26.456 16.1079 26.8085 16.1079C27.2198 16.1079 27.5135 15.9512 27.6898 15.8337C28.0227 15.5987 28.5318 14.9916 28.2185 13.6404L27.8073 11.8387C27.7877 11.7408 27.8464 11.5254 27.9248 11.4666L29.3935 9.9979Z" fill="white"/>
</g>
</g>
</g>
</svg>
