<svg width="19" height="13" viewBox="0 0 19 13" fill="none" xmlns="http://www.w3.org/2000/svg">
<path d="M7.38889 13H11.6111V10.8333H7.38889V13ZM0 0V2.16667H19V0H0ZM3.16667 7.58333H15.8333V5.41667H3.16667V7.58333Z" fill="#7660FE"/>
</svg>
