<svg width="17" height="18" viewBox="0 0 17 18" fill="none" xmlns="http://www.w3.org/2000/svg">
<g clip-path="url(#clip0_1691_59215)">
<path d="M14.8544 3.30108C14.88 3.2102 14.8809 3.11414 14.8571 3.02279C14.8332 2.93144 14.7855 2.84809 14.7187 2.78133C14.652 2.71457 14.5686 2.66681 14.4773 2.64296C14.3859 2.61911 14.2898 2.62004 14.199 2.64565L1.44897 6.51182C1.34487 6.5412 1.25223 6.60165 1.18341 6.68509C1.1146 6.76853 1.07289 6.87099 1.06386 6.97877C1.05484 7.08656 1.07893 7.19453 1.13291 7.28825C1.1869 7.38197 1.2682 7.45699 1.36596 7.50326L7.05166 10.1954C7.16236 10.2479 7.25151 10.337 7.30401 10.4477L9.99678 16.1328C10.0431 16.2305 10.1181 16.3118 10.2118 16.3658C10.3055 16.4198 10.4135 16.4439 10.5213 16.4349C10.6291 16.4258 10.7315 16.3841 10.815 16.3153C10.8984 16.2465 10.9588 16.1538 10.9882 16.0497L14.8544 3.30108Z" stroke="white" stroke-width="1.4" stroke-linecap="round" stroke-linejoin="round"/>
<path d="M7.19971 10.3002L10.6249 6.875" stroke="white" stroke-width="1.4" stroke-linecap="round" stroke-linejoin="round"/>
</g>
<defs>
<clipPath id="clip0_1691_59215">
<rect width="17" height="17" fill="white" transform="translate(0 0.5)"/>
</clipPath>
</defs>
</svg>
