<svg width="48" height="47" viewBox="0 0 48 47" fill="none" xmlns="http://www.w3.org/2000/svg">
<g id="vuesax/bold/star">
<g id="vuesax/bold/star_2">
<g id="star">
<path id="Vector" d="M30.6377 10.203L33.3989 15.7255C33.771 16.4893 34.7698 17.2138 35.6118 17.3705L40.6056 18.193C43.7977 18.7218 44.5418 21.0326 42.2506 23.3434L38.3535 27.2405C37.7073 27.8868 37.3352 29.1597 37.5506 30.0801L38.6668 34.8976C39.5481 38.6968 37.5114 40.1851 34.1627 38.1876L29.4823 35.4068C28.6402 34.8976 27.2302 34.8976 26.3881 35.4068L21.7077 38.1876C18.3589 40.1655 16.3223 38.6968 17.2035 34.8976L18.3198 30.0801C18.496 29.1401 18.1239 27.8672 17.4777 27.2209L13.5806 23.3238C11.2893 21.0326 12.0335 18.7218 15.2256 18.1734L20.2193 17.3509C21.0614 17.2138 22.0602 16.4697 22.4323 15.7059L25.1935 10.1834C26.7014 7.20676 29.1298 7.20676 30.6377 10.203Z" fill="white"/>
<path id="Vector_2" d="M16.168 11.2605H4.41797C3.61505 11.2605 2.94922 10.5947 2.94922 9.79175C2.94922 8.98883 3.61505 8.323 4.41797 8.323H16.168C16.9709 8.323 17.6367 8.98883 17.6367 9.79175C17.6367 10.5947 16.9709 11.2605 16.168 11.2605Z" fill="white"/>
<path id="Vector_3" d="M10.293 38.677H4.41797C3.61505 38.677 2.94922 38.0112 2.94922 37.2083C2.94922 36.4053 3.61505 35.7395 4.41797 35.7395H10.293C11.0959 35.7395 11.7617 36.4053 11.7617 37.2083C11.7617 38.0112 11.0959 38.677 10.293 38.677Z" fill="white"/>
<path id="Vector_4" d="M6.3763 24.9688H4.41797C3.61505 24.9688 2.94922 24.3029 2.94922 23.5C2.94922 22.6971 3.61505 22.0312 4.41797 22.0312H6.3763C7.17922 22.0312 7.84505 22.6971 7.84505 23.5C7.84505 24.3029 7.17922 24.9688 6.3763 24.9688Z" fill="white"/>
</g>
</g>
</g>
</svg>
