<svg width="16" height="16" viewBox="0 0 16 16" fill="none" xmlns="http://www.w3.org/2000/svg">
<path d="M3 1C1.875 1 1 1.90625 1 3V13C1 14.125 1.875 15 3 15H10V11.5C10 10.6875 10.6562 10 11.5 10H15V3C15 1.90625 14.0938 1 13 1H3ZM15 11H11.5C11.2188 11 11 11.25 11 11.5V15L15 11Z" fill="#FF6337"/>
<path d="M5.43934 3V3.66051H4.12742V7.93608H3.319V3.66051H2V3H5.43934Z" fill="white"/>
<path d="M5.98859 5.96165C5.98859 5.56866 6.06896 5.22064 6.2297 4.91761C6.39516 4.61458 6.61736 4.38021 6.89629 4.21449C7.17994 4.04403 7.49197 3.95881 7.83235 3.95881C8.13965 3.95881 8.40676 4.02036 8.63368 4.14347C8.86534 4.26184 9.04971 4.41099 9.18681 4.59091V4.02273H10.0023V7.93608H9.18681V7.35369C9.04971 7.53835 8.86297 7.69224 8.62659 7.81534C8.39021 7.93845 8.12074 8 7.81817 8C7.48251 8 7.17522 7.91477 6.89629 7.74432C6.61736 7.56913 6.39516 7.32765 6.2297 7.01989C6.06896 6.70739 5.98859 6.35464 5.98859 5.96165ZM9.18681 5.97585C9.18681 5.70597 9.13008 5.47159 9.01662 5.27273C8.90789 5.07386 8.76369 4.92235 8.58404 4.81818C8.4044 4.71402 8.21056 4.66193 8.00255 4.66193C7.79453 4.66193 7.6007 4.71402 7.42105 4.81818C7.2414 4.91761 7.09485 5.06676 6.98138 5.26563C6.87265 5.45975 6.81828 5.69176 6.81828 5.96165C6.81828 6.23153 6.87265 6.46828 6.98138 6.67188C7.09485 6.87547 7.2414 7.03172 7.42105 7.14063C7.60543 7.24479 7.79926 7.29688 8.00255 7.29688C8.21056 7.29688 8.4044 7.24479 8.58404 7.14063C8.76369 7.03646 8.90789 6.88494 9.01662 6.68608C9.13008 6.48248 9.18681 6.24574 9.18681 5.97585Z" fill="white"/>
<path d="M12.7377 5.95455L14 7.93608H13.0852L12.2413 6.60795L11.4471 7.93608H10.6032L11.8655 6.01136L10.6032 4.02273H11.518L12.3619 5.35085L13.1561 4.02273H14L12.7377 5.95455Z" fill="white"/>
</svg>
