<svg width="18" height="20" viewBox="0 0 18 20" fill="none" xmlns="http://www.w3.org/2000/svg">
<path d="M15.5002 2.11031L10.5102 0.240313C9.68016 -0.0696875 8.32016 -0.0696875 7.49016 0.240313L2.50016 2.11031C1.35016 2.54031 0.410156 3.90031 0.410156 5.12031V12.5503C0.410156 13.7303 1.19016 15.2803 2.14016 15.9903L6.44016 19.2003C7.85016 20.2603 10.1702 20.2603 11.5802 19.2003L15.8802 15.9903C16.8302 15.2803 17.6102 13.7303 17.6102 12.5503V5.12031C17.5902 3.90031 16.6502 2.54031 15.5002 2.11031ZM8.93016 5.03031C10.1102 5.03031 11.0702 5.99031 11.0702 7.17031C11.0702 8.33031 10.1602 9.26031 9.01016 9.30031H8.99016H8.97016C8.95016 9.30031 8.93016 9.30031 8.91016 9.30031C7.71016 9.26031 6.81016 8.33031 6.81016 7.17031C6.80016 5.99031 7.76016 5.03031 8.93016 5.03031ZM11.1902 14.3603C10.5802 14.7603 9.79016 14.9703 9.00016 14.9703C8.21016 14.9703 7.41016 14.7703 6.81016 14.3603C6.24016 13.9803 5.93016 13.4603 5.92016 12.8903C5.92016 12.3303 6.24016 11.7903 6.81016 11.4103C8.02016 10.6103 9.99016 10.6103 11.2002 11.4103C11.7702 11.7903 12.0902 12.3103 12.0902 12.8803C12.0802 13.4403 11.7602 13.9803 11.1902 14.3603Z" fill="#8E91A0"/>
</svg>
