<svg width="19" height="20" viewBox="0 0 19 20" fill="none" xmlns="http://www.w3.org/2000/svg">
<circle cx="9.5" cy="10" r="7.125" stroke="#8E91A0" stroke-width="1.5"/>
<path d="M14.25 14.75L4.75 5.25" stroke="#8E91A0" stroke-width="1.5"/>
</svg>
