<svg width="7" height="13" viewBox="0 0 7 13" fill="none" xmlns="http://www.w3.org/2000/svg">
<path d="M6.017 1.69081C6.29052 1.39142 6.29052 0.932826 6.017 0.633434V0.633434C5.7062 0.293236 5.17041 0.293235 4.85961 0.633433L0.732404 5.15102C0.0345007 5.91494 0.0345002 7.08506 0.732403 7.84897L4.85961 12.3666C5.17041 12.7068 5.7062 12.7068 6.017 12.3666V12.3666C6.29052 12.0672 6.29052 11.6086 6.017 11.3092L1.62339 6.5L6.017 1.69081Z" fill="white"/>
</svg>
