<svg width="48" height="47" viewBox="0 0 48 47" fill="none" xmlns="http://www.w3.org/2000/svg">
<g id="vuesax/bold/cup">
<g id="vuesax/bold/cup_2">
<g id="cup">
<path id="Vector" d="M22.5312 35.7395H18.125C15.9708 35.7395 14.2083 37.502 14.2083 39.6561V40.1457H12.25C11.4471 40.1457 10.7812 40.8115 10.7812 41.6145C10.7812 42.4174 11.4471 43.0832 12.25 43.0832H35.75C36.5529 43.0832 37.2188 42.4174 37.2188 41.6145C37.2188 40.8115 36.5529 40.1457 35.75 40.1457H33.7917V39.6561C33.7917 37.502 32.0292 35.7395 29.875 35.7395H25.4688V31.2549C24.9792 31.3136 24.4896 31.3332 24 31.3332C23.5104 31.3332 23.0208 31.3136 22.5312 31.2549V35.7395Z" fill="white"/>
<path id="Vector_2" d="M36.6898 22.7948C37.9823 22.3053 39.1182 21.5023 40.019 20.6015C41.8403 18.5844 43.0348 16.1757 43.0348 13.3557C43.0348 10.5357 40.8219 8.32275 38.0019 8.32275H36.9053C35.6323 5.71817 32.969 3.9165 29.8748 3.9165H18.1248C15.0307 3.9165 12.3673 5.71817 11.0944 8.32275H9.99776C7.17776 8.32275 4.96484 10.5357 4.96484 13.3557C4.96484 16.1757 6.15943 18.5844 7.98068 20.6015C8.88151 21.5023 10.0173 22.3053 11.3098 22.7948C13.3465 27.8082 18.2423 31.3332 23.9998 31.3332C29.7573 31.3332 34.6532 27.8082 36.6898 22.7948ZM29.5615 16.5478L28.3473 18.0361C28.1515 18.2515 28.0144 18.6823 28.034 18.9761L28.1515 20.8953C28.2298 22.0703 27.3878 22.6773 26.2911 22.2465L24.509 21.5415C24.2348 21.4436 23.7648 21.4436 23.4907 21.5415L21.7086 22.2465C20.6119 22.6773 19.7698 22.0703 19.8482 20.8953L19.9657 18.9761C19.9853 18.6823 19.8482 18.2515 19.6523 18.0361L18.4382 16.5478C17.6744 15.6469 18.0073 14.6482 19.1432 14.3544L21.0036 13.8844C21.2973 13.8061 21.6498 13.5319 21.8065 13.2773L22.8444 11.6715C23.4907 10.6728 24.509 10.6728 25.1553 11.6715L26.1932 13.2773C26.3498 13.5319 26.7023 13.8061 26.9961 13.8844L28.8565 14.3544C29.9923 14.6482 30.3253 15.6469 29.5615 16.5478Z" fill="white"/>
</g>
</g>
</g>
</svg>
