<svg width="16" height="16" viewBox="0 0 16 16" fill="none" xmlns="http://www.w3.org/2000/svg">
<path d="M14.9828 11.5589L14.326 14.3172C14.244 14.7269 13.9156 15 13.5051 15C6.60953 14.9727 1 9.37411 1 2.49195C1 2.0823 1.24627 1.75457 1.65672 1.67264L4.42044 1.0172C4.80353 0.935269 5.21398 1.15375 5.37817 1.50878L6.66425 4.48559C6.80107 4.84062 6.71898 5.25027 6.41798 5.46876L4.94035 6.6704C5.87071 8.5548 7.40307 10.0842 9.31852 11.0127L10.5225 9.53797C10.7414 9.26487 11.1519 9.15563 11.5076 9.29218L14.4902 10.5758C14.8459 10.7669 15.0649 11.1766 14.9828 11.5589Z" fill="#FF6337"/>
</svg>
