<svg width="20" height="20" viewBox="0 0 20 20" fill="none" xmlns="http://www.w3.org/2000/svg">
<path d="M10 3.75C6.5332 3.75 3.75 6.55762 3.75 10C3.75 13.4668 6.5332 16.25 10 16.25C13.4424 16.25 16.25 13.4668 16.25 10C16.25 6.55762 13.4424 3.75 10 3.75ZM10 6.875C10.415 6.875 10.7812 7.24121 10.7812 7.65625C10.7812 8.0957 10.415 8.4375 10 8.4375C9.56055 8.4375 9.21875 8.0957 9.21875 7.65625C9.21875 7.24121 9.56055 6.875 10 6.875ZM10.9766 13.125H9.02344C8.68164 13.125 8.4375 12.8809 8.4375 12.5391C8.4375 12.2217 8.68164 11.9531 9.02344 11.9531H9.41406V10.3906H9.21875C8.87695 10.3906 8.63281 10.1465 8.63281 9.80469C8.63281 9.4873 8.87695 9.21875 9.21875 9.21875H10C10.3174 9.21875 10.5859 9.4873 10.5859 9.80469V11.9531H10.9766C11.2939 11.9531 11.5625 12.2217 11.5625 12.5391C11.5625 12.8809 11.2939 13.125 10.9766 13.125Z" fill="#7C68EE"/>
</svg>
