<svg width="80" height="80" viewBox="0 0 80 80" fill="none" xmlns="http://www.w3.org/2000/svg">
<g filter="url(#filter0_d_4605_4306)">
<path d="M29.6077 18C34.2265 10 45.7735 10 50.3923 18L64.2487 42C68.8675 50 63.094 60 53.8564 60H26.1436C16.906 60 11.1325 50 15.7513 42L29.6077 18Z" fill="#FF6337"/>
<path d="M42.7023 27.9033L42.25 40.1482H38.2844L37.8321 27.9033H42.7023ZM40.2672 45.9924C39.5947 45.9924 39.0178 45.7576 38.5366 45.2879C38.0611 44.8125 37.8263 44.2356 37.8321 43.5573C37.8263 42.8964 38.0611 42.3311 38.5366 41.8615C39.0178 41.3918 39.5947 41.157 40.2672 41.157C40.905 41.157 41.4673 41.3918 41.9544 41.8615C42.4472 42.3311 42.6965 42.8964 42.7023 43.5573C42.6965 44.0095 42.5776 44.4212 42.3457 44.7922C42.1196 45.1575 41.8239 45.4503 41.4586 45.6706C41.0934 45.8851 40.6962 45.9924 40.2672 45.9924Z" fill="white"/>
</g>
<defs>
<filter id="filter0_d_4605_4306" x="2.12598" y="8" width="75.748" height="72" filterUnits="userSpaceOnUse" color-interpolation-filters="sRGB">
<feFlood flood-opacity="0" result="BackgroundImageFix"/>
<feColorMatrix in="SourceAlpha" type="matrix" values="0 0 0 0 0 0 0 0 0 0 0 0 0 0 0 0 0 0 127 0" result="hardAlpha"/>
<feOffset dy="8"/>
<feGaussianBlur stdDeviation="6"/>
<feComposite in2="hardAlpha" operator="out"/>
<feColorMatrix type="matrix" values="0 0 0 0 1 0 0 0 0 0.74902 0 0 0 0 0.411765 0 0 0 0.3 0"/>
<feBlend mode="normal" in2="BackgroundImageFix" result="effect1_dropShadow_4605_4306"/>
<feBlend mode="normal" in="SourceGraphic" in2="effect1_dropShadow_4605_4306" result="shape"/>
</filter>
</defs>
</svg>
