<svg width="22" height="16" viewBox="0 0 22 16" fill="none" xmlns="http://www.w3.org/2000/svg">
<path d="M0.25 1.5C0.25 1.28451 0.335603 1.07785 0.487976 0.925476C0.640349 0.773103 0.847012 0.6875 1.0625 0.6875H18.9375C19.153 0.6875 19.3597 0.773103 19.512 0.925476C19.6644 1.07785 19.75 1.28451 19.75 1.5C19.75 1.71549 19.6644 1.92215 19.512 2.07452C19.3597 2.2269 19.153 2.3125 18.9375 2.3125H1.0625C0.847012 2.3125 0.640349 2.2269 0.487976 2.07452C0.335603 1.92215 0.25 1.71549 0.25 1.5ZM1.0625 8.8125H8.375C8.59049 8.8125 8.79715 8.7269 8.94952 8.57452C9.1019 8.42215 9.1875 8.21549 9.1875 8C9.1875 7.78451 9.1019 7.57785 8.94952 7.42548C8.79715 7.2731 8.59049 7.1875 8.375 7.1875H1.0625C0.847012 7.1875 0.640349 7.2731 0.487976 7.42548C0.335603 7.57785 0.25 7.78451 0.25 8C0.25 8.21549 0.335603 8.42215 0.487976 8.57452C0.640349 8.7269 0.847012 8.8125 1.0625 8.8125ZM10 13.6875H1.0625C0.847012 13.6875 0.640349 13.7731 0.487976 13.9255C0.335603 14.0778 0.25 14.2845 0.25 14.5C0.25 14.7155 0.335603 14.9222 0.487976 15.0745C0.640349 15.2269 0.847012 15.3125 1.0625 15.3125H10C10.2155 15.3125 10.4222 15.2269 10.5745 15.0745C10.7269 14.9222 10.8125 14.7155 10.8125 14.5C10.8125 14.2845 10.7269 14.0778 10.5745 13.9255C10.4222 13.7731 10.2155 13.6875 10 13.6875ZM21.1373 15.0748C21.0619 15.1504 20.9723 15.2103 20.8736 15.2512C20.775 15.2921 20.6693 15.3131 20.5625 15.3131C20.4557 15.3131 20.35 15.2921 20.2514 15.2512C20.1527 15.2103 20.0631 15.1504 19.9877 15.0748L17.9219 13.0131C17.0818 13.5674 16.0659 13.7901 15.0709 13.638C14.076 13.486 13.173 12.97 12.5368 12.1902C11.9006 11.4103 11.5765 10.4221 11.6273 9.41688C11.6782 8.41171 12.1004 7.4612 12.812 6.74953C13.5237 6.03785 14.4742 5.61569 15.4794 5.56484C16.4846 5.51398 17.4728 5.83806 18.2527 6.47428C19.0325 7.11049 19.5485 8.01354 19.7005 9.00845C19.8526 10.0034 19.6299 11.0193 19.0756 11.8594L21.1373 13.9211C21.2135 13.9966 21.2739 14.0865 21.3152 14.1855C21.3564 14.2845 21.3777 14.3907 21.3777 14.498C21.3777 14.6052 21.3564 14.7114 21.3152 14.8104C21.2739 14.9094 21.2135 14.9993 21.1373 15.0748ZM15.6875 12.0625C16.1696 12.0625 16.6409 11.9195 17.0417 11.6517C17.4425 11.3839 17.755 11.0032 17.9395 10.5578C18.1239 10.1124 18.1722 9.6223 18.0782 9.14947C17.9841 8.67664 17.752 8.24232 17.4111 7.90143C17.0702 7.56054 16.6359 7.32839 16.163 7.23434C15.6902 7.14028 15.2001 7.18855 14.7547 7.37304C14.3093 7.55753 13.9286 7.86995 13.6608 8.2708C13.393 8.67164 13.25 9.14291 13.25 9.625C13.25 10.2715 13.5068 10.8915 13.9639 11.3486C14.421 11.8057 15.041 12.0625 15.6875 12.0625Z" fill="black"/>
</svg>
