<svg width="40" height="40" viewBox="0 0 40 40" fill="none" xmlns="http://www.w3.org/2000/svg">
<rect width="40" height="40" rx="20" fill="#7660FE"/>
<path d="M27.407 20H12.5933M27.407 20L21.8515 14.4448M27.407 20L21.8515 25.5551" stroke="white" stroke-width="2" stroke-linecap="round" stroke-linejoin="round"/>
</svg>
