<svg width="17" height="17" viewBox="0 0 17 17" fill="none" xmlns="http://www.w3.org/2000/svg">
<rect width="17" height="17" fill="none"/>
<path d="M6.37508 15.5833H10.6251C14.1667 15.5833 15.5834 14.1667 15.5834 10.625V6.37499C15.5834 2.83332 14.1667 1.41666 10.6251 1.41666H6.37508C2.83341 1.41666 1.41675 2.83332 1.41675 6.37499V10.625C1.41675 14.1667 2.83341 15.5833 6.37508 15.5833Z" stroke="#575757" stroke-width="1.5" stroke-linecap="round" stroke-linejoin="round"/>
<path d="M12.3959 12.0983H11.0854" stroke="#575757" stroke-width="1.5" stroke-linecap="round" stroke-linejoin="round"/>
<path d="M9.18716 12.0983H4.60425" stroke="#575757" stroke-width="1.5" stroke-linecap="round" stroke-linejoin="round"/>
<path d="M12.3958 9.435H8.47876" stroke="#575757" stroke-width="1.5" stroke-linecap="round" stroke-linejoin="round"/>
<path d="M6.56633 9.435H4.60425" stroke="#575757" stroke-width="1.5" stroke-linecap="round" stroke-linejoin="round"/>
<path d="M7.0557 3V8H6V5.5V3H7.0557Z" fill="#575757"/>
<path d="M9.55702 8H7.78696V3H9.57165C10.0739 3 10.5063 3.1001 10.8687 3.30029C11.2312 3.49886 11.5099 3.78451 11.705 4.15723C11.9017 4.52995 12 4.97591 12 5.49512C12 6.01595 11.9017 6.46354 11.705 6.83789C11.5099 7.21224 11.2296 7.49951 10.8638 7.69971C10.4998 7.8999 10.0641 8 9.55702 8ZM8.84266 7.09424H9.51314C9.82521 7.09424 10.0877 7.0389 10.3006 6.92822C10.5152 6.81592 10.6761 6.64258 10.7834 6.4082C10.8923 6.1722 10.9467 5.86784 10.9467 5.49512C10.9467 5.12565 10.8923 4.82373 10.7834 4.58936C10.6761 4.35498 10.516 4.18245 10.3031 4.07178C10.0902 3.9611 9.82765 3.90576 9.51557 3.90576H8.84266V7.09424Z" fill="#575757"/>
</svg>