<svg width="28" height="28" viewBox="0 0 28 28" fill="none" xmlns="http://www.w3.org/2000/svg">
<path d="M20.1713 4.82997L20.0897 9.25164C20.078 9.8583 20.463 10.6633 20.953 11.025L23.8463 13.2183C25.7013 14.6183 25.398 16.3333 23.1813 17.0333L19.413 18.2116C18.783 18.41 18.118 19.0983 17.9547 19.74L17.0563 23.17C16.3447 25.8766 14.5713 26.145 13.1013 23.765L11.048 20.44C10.6747 19.8333 9.788 19.3783 9.088 19.4133L5.19133 19.6116C2.403 19.7516 1.60966 18.1416 3.42966 16.0183L5.73966 13.335C6.17133 12.8333 6.36966 11.9 6.17133 11.27L4.98133 7.48997C4.293 5.2733 5.52966 4.0483 7.73466 4.77164L11.1763 5.9033C11.7597 6.08997 12.6347 5.96164 13.1247 5.59997L16.718 3.00997C18.6663 1.62164 20.218 2.4383 20.1713 4.82997Z" fill="white"/>
<path d="M25.0137 23.8816L21.4787 20.3466C21.1404 20.0083 20.5804 20.0083 20.242 20.3466C19.9037 20.685 19.9037 21.245 20.242 21.5833L23.777 25.1183C23.952 25.2933 24.1737 25.375 24.3954 25.375C24.617 25.375 24.8387 25.2933 25.0137 25.1183C25.352 24.78 25.352 24.22 25.0137 23.8816Z" fill="white"/>
</svg>
