<svg xmlns="http://www.w3.org/2000/svg" width="19" height="20" viewBox="0 0 19 20" fill="none">
    <path d="M11.693 15.6351H7.33089C6.98255 15.6351 6.53922 15.5955 6.2463 15.2947C5.9613 15.0017 5.96922 14.6376 5.97714 14.3922V13.6876C3.98214 12.3576 2.66797 10.0459 2.66797 7.84508C2.66797 5.76299 3.60214 3.81549 5.22505 2.50924C6.84797 1.20299 8.97755 0.712161 11.0596 1.17133C13.0388 1.60674 14.7488 2.92883 15.6355 4.71008C17.3534 8.16966 15.6988 11.9142 13.0546 13.6955V14.2892C13.0626 14.5188 13.0705 14.9384 12.7459 15.2709C12.5005 15.5084 12.1521 15.6351 11.693 15.6351ZM7.15672 14.4397C7.1963 14.4397 7.25172 14.4476 7.32297 14.4476H11.693C11.7721 14.4476 11.8276 14.4397 11.8592 14.4317C11.8592 14.408 11.8592 14.3763 11.8592 14.3526V13.3551C11.8592 13.1492 11.9701 12.9513 12.1442 12.8484C14.4876 11.4313 16.0392 8.19341 14.5588 5.22466C13.8305 3.76008 12.4213 2.67549 10.7905 2.31924C9.06464 1.93924 7.29922 2.34299 5.95339 3.42758C4.60755 4.51216 3.83964 6.11924 3.83964 7.84508C3.83964 10.0459 5.35964 11.9459 6.8638 12.8563C7.04589 12.9672 7.1488 13.1572 7.1488 13.363V14.4317C7.15672 14.4317 7.15672 14.4317 7.15672 14.4397Z" fill="#F79945" stroke="#F79945" stroke-width="0.9"/>
    <path d="M12.2711 18.9983C12.2157 18.9983 12.1602 18.9904 12.1048 18.9746C10.3948 18.4838 8.59774 18.4838 6.88774 18.9746C6.57108 19.0617 6.24649 18.8796 6.15149 18.5629C6.05649 18.2463 6.24649 17.9217 6.56316 17.8267C8.47899 17.2804 10.5136 17.2804 12.4294 17.8267C12.7461 17.9138 12.9282 18.2463 12.8411 18.5629C12.7698 18.8321 12.5323 18.9983 12.2711 18.9983Z" fill="#F79945" stroke="#F79945" stroke-width="0.9"/>
</svg>