<svg width="14" height="13" viewBox="0 0 14 13" fill="none" xmlns="http://www.w3.org/2000/svg">
<path d="M2.6748 12.6289H11.3195C12.6818 12.6289 13.3912 11.9258 13.3912 10.5823V2.9421C13.3912 1.59863 12.6818 0.895508 11.3195 0.895508H2.6748C1.31878 0.895508 0.609375 1.59235 0.609375 2.9421V10.5823C0.609375 11.9258 1.31878 12.6289 2.6748 12.6289ZM2.66853 11.3796C2.14746 11.3796 1.85868 11.1097 1.85868 10.5572V4.78153C1.85868 4.22907 2.14746 3.95912 2.66853 3.95912H11.3258C11.8468 3.95912 12.1356 4.22907 12.1356 4.78153V10.5572C12.1356 11.1097 11.8468 11.3796 11.3258 11.3796H2.66853ZM3.74205 6.21289H10.2648C10.4908 6.21289 10.6603 6.03711 10.6603 5.80483C10.6603 5.5851 10.4908 5.4156 10.2648 5.4156H3.74205C3.50977 5.4156 3.34026 5.5851 3.34026 5.80483C3.34026 6.03711 3.50977 6.21289 3.74205 6.21289ZM3.74205 8.06487H10.2648C10.4908 8.06487 10.6603 7.89537 10.6603 7.67564C10.6603 7.44964 10.4908 7.26758 10.2648 7.26758H3.74205C3.50977 7.26758 3.34026 7.44964 3.34026 7.67564C3.34026 7.89537 3.50977 8.06487 3.74205 8.06487ZM3.74205 9.91685H7.86035C8.08636 9.91685 8.25586 9.74735 8.25586 9.52762C8.25586 9.30162 8.08636 9.12584 7.86035 9.12584H3.74205C3.50977 9.12584 3.34026 9.30162 3.34026 9.52762C3.34026 9.74735 3.50977 9.91685 3.74205 9.91685Z" fill="#ED3902"/>
</svg>
