<svg width="20" height="20" viewBox="0 0 20 20" fill="none" xmlns="http://www.w3.org/2000/svg">
<path d="M18.424 1.57384C17.6378 0.753524 15.4162 1.57384 12.716 3.41954C10.1525 2.35997 7.07632 2.87266 4.95718 4.95763C2.87222 7.07677 2.35953 10.1529 3.4191 12.7164C1.57339 15.4166 0.753082 17.6383 1.57339 18.4244C2.83804 19.7233 7.65738 16.9547 12.3058 12.3063C16.9543 7.62364 19.7228 2.83849 18.424 1.57384ZM13.0919 13.0924C11.7931 14.3912 10.2209 15.7926 8.61441 16.9889C10.9386 17.4332 13.3654 16.7154 15.0402 15.0065C16.715 13.3316 17.4328 10.9391 16.9543 8.61485C15.7238 10.2897 14.3224 11.8619 13.0919 13.0924Z" fill="url(#paint0_linear_3833_53821)"/>
<defs>
<linearGradient id="paint0_linear_3833_53821" x1="2.09222" y1="13.715" x2="12.7774" y2="0.427523" gradientUnits="userSpaceOnUse">
<stop stop-color="#1664FC"/>
<stop offset="1" stop-color="#17D4FD"/>
</linearGradient>
</defs>
</svg>
