<svg width="22" height="23" viewBox="0 0 22 23" fill="none" xmlns="http://www.w3.org/2000/svg">
<g clip-path="url(#clip0_2003_80557)">
<path d="M19.25 4.21387H14.4375C13.7082 4.21387 13.0087 4.5036 12.493 5.01932C11.9772 5.53505 11.6875 6.23452 11.6875 6.96387V14.5264C11.6875 14.7087 11.6151 14.8836 11.4861 15.0125C11.3572 15.1414 11.1823 15.2139 11 15.2139C10.8177 15.2139 10.6428 15.1414 10.5139 15.0125C10.3849 14.8836 10.3125 14.7087 10.3125 14.5264V6.96387C10.3125 6.23452 10.0228 5.53505 9.50704 5.01932C8.99132 4.5036 8.29185 4.21387 7.5625 4.21387H2.75C2.38533 4.21387 2.03559 4.35873 1.77773 4.6166C1.51987 4.87446 1.375 5.22419 1.375 5.58887V16.5889C1.375 16.9535 1.51987 17.3033 1.77773 17.5611C2.03559 17.819 2.38533 17.9639 2.75 17.9639H8.25C8.79701 17.9639 9.32161 18.1812 9.70841 18.568C10.0952 18.9548 10.3125 19.4794 10.3125 20.0264C10.3125 20.2087 10.3849 20.3836 10.5139 20.5125C10.6428 20.6414 10.8177 20.7139 11 20.7139C11.1823 20.7139 11.3572 20.6414 11.4861 20.5125C11.6151 20.3836 11.6875 20.2087 11.6875 20.0264C11.6875 19.4794 11.9048 18.9548 12.2916 18.568C12.6784 18.1812 13.203 17.9639 13.75 17.9639H19.25C19.6147 17.9639 19.9644 17.819 20.2223 17.5611C20.4801 17.3033 20.625 16.9535 20.625 16.5889V5.58887C20.625 5.22419 20.4801 4.87446 20.2223 4.6166C19.9644 4.35873 19.6147 4.21387 19.25 4.21387ZM17.875 14.5264H14.4375C14.2552 14.5264 14.0803 14.4539 13.9514 14.325C13.8224 14.1961 13.75 14.0212 13.75 13.8389C13.75 13.6565 13.8224 13.4817 13.9514 13.3527C14.0803 13.2238 14.2552 13.1514 14.4375 13.1514H17.875C18.0573 13.1514 18.2322 13.2238 18.3611 13.3527C18.4901 13.4817 18.5625 13.6565 18.5625 13.8389C18.5625 14.0212 18.4901 14.1961 18.3611 14.325C18.2322 14.4539 18.0573 14.5264 17.875 14.5264ZM17.875 11.7764H14.4375C14.2552 11.7764 14.0803 11.7039 13.9514 11.575C13.8224 11.4461 13.75 11.2712 13.75 11.0889C13.75 10.9065 13.8224 10.7317 13.9514 10.6027C14.0803 10.4738 14.2552 10.4014 14.4375 10.4014H17.875C18.0573 10.4014 18.2322 10.4738 18.3611 10.6027C18.4901 10.7317 18.5625 10.9065 18.5625 11.0889C18.5625 11.2712 18.4901 11.4461 18.3611 11.575C18.2322 11.7039 18.0573 11.7764 17.875 11.7764ZM17.875 9.02637H14.4375C14.2552 9.02637 14.0803 8.95393 13.9514 8.825C13.8224 8.69607 13.75 8.5212 13.75 8.33887C13.75 8.15653 13.8224 7.98166 13.9514 7.85273C14.0803 7.7238 14.2552 7.65137 14.4375 7.65137H17.875C18.0573 7.65137 18.2322 7.7238 18.3611 7.85273C18.4901 7.98166 18.5625 8.15653 18.5625 8.33887C18.5625 8.5212 18.4901 8.69607 18.3611 8.825C18.2322 8.95393 18.0573 9.02637 17.875 9.02637Z" fill="#8E91A0"/>
</g>
<defs>
<clipPath id="clip0_2003_80557">
<rect width="22" height="22" fill="white" transform="translate(0 0.0888672)"/>
</clipPath>
</defs>
</svg>
