<svg width="10" height="7" viewBox="0 0 10 7" fill="none" xmlns="http://www.w3.org/2000/svg">
<path d="M9.72799 4.70964L5.74747 0.542969C5.52807 0.347656 5.27733 0.25 5.02659 0.25C4.7445 0.25 4.49376 0.347656 4.30571 0.542969L0.325186 4.70964C0.0117597 5.0026 -0.0822683 5.45833 0.0744451 5.84896C0.231158 6.23958 0.607271 6.5 1.01473 6.5H9.00711C9.41456 6.5 9.75933 6.23958 9.91605 5.84896C10.0728 5.45833 10.0101 5.0026 9.72799 4.70964Z" fill="#757688"/>
</svg>
