<svg width="72" height="13" viewBox="0 0 72 13" fill="none" xmlns="http://www.w3.org/2000/svg">
<path d="M0.226497 6.5L6 12.2735L11.7735 6.5L6 0.726497L0.226497 6.5ZM71.7735 6.5L66 0.726497L60.2265 6.5L66 12.2735L71.7735 6.5ZM6 7.5H66V5.5H6V7.5Z" fill="#DFDAFF"/>
</svg>
