<svg width="16" height="16" viewBox="0 0 16 16" fill="#757688" xmlns="http://www.w3.org/2000/svg">
<path d="M8 14.125C4.39453 14.125 1.5 11.2305 1.5 7.625C1.5 4.04492 4.39453 1.125 8 1.125C11.5801 1.125 14.5 4.04492 14.5 7.625C14.5 11.2305 11.5801 14.125 8 14.125ZM7.39062 7.625C7.39062 7.82812 7.49219 8.03125 7.64453 8.13281L10.082 9.75781C10.3613 9.96094 10.7422 9.88477 10.9199 9.60547C11.123 9.32617 11.0469 8.94531 10.7676 8.74219L8.60938 7.32031V4.17188C8.60938 3.8418 8.33008 3.5625 7.97461 3.5625C7.64453 3.5625 7.36523 3.8418 7.36523 4.17188L7.39062 7.625Z" fill="inherit"/>
</svg>
