{
    "status": true,
    "data": {
        "data": {
            "1": {
                "0": [
                    "http://127.0.0.1:8000/storage/images/中文標題-000.jpg",
                    "http://127.0.0.1:8000/storage/images/中文標題-001.jpg",
                    "http://127.0.0.1:8000/storage/images/中文標題-002.jpg",
                    "http://127.0.0.1:8000/storage/images/中文標題-003.jpg"
                ],
                "color": "中文顏色",
                "product_id": 1,
                "dueday": "中文期限",
                "material": "中文材質",
                "productName": "中文名稱",
                "quantity": "中文數量",
                "spec": "中文規格",
                "situation": "中文情況",
                "storageMethod": "中文方式",
                "type_id": 1,
                "title": "中文標題",
                "used": "中文用途",
                "lang_id": 0
            },
            "2": {
                "0": [
                    "http://127.0.0.1:8000/storage/images/中文標題1-000.jpg",
                    "http://127.0.0.1:8000/storage/images/中文標題1-001.jpg",
                    "http://127.0.0.1:8000/storage/images/中文標題1-002.jpg",
                    "http://127.0.0.1:8000/storage/images/中文標題1-003.jpg"
                ],
                "color": "中文顏色1",
                "product_id": 2,
                "dueday": "中文期限1",
                "material": "中文材質1",
                "productName": "中文名稱1",
                "quantity": "中文數量1",
                "spec": "中文規格1",
                "situation": "中文情況1",
                "storageMethod": "中文方式1",
                "type_id": 1,
                "title": "中文標題1",
                "used": "中文用途1",
                "lang_id": 0
            },
            "3": {
                "0": [
                    "http://127.0.0.1:8000/storage/images/en 標題-000.jpg",
                    "http://127.0.0.1:8000/storage/images/en 標題-001.jpg"
                ],
                "color": "en 顏色",
                "product_id": 3,
                "dueday": "en 期限",
                "material": "en 材質",
                "productName": "en 名稱",
                "quantity": "en 數量",
                "spec": "en產品規格 ",
                "situation": "en 情況",
                "storageMethod": "en保存方式",
                "type_id": 1,
                "title": "en 標題",
                "used": "用途 env",
                "lang_id": 1
            }
        }
    }
}