<?xml version="1.0" encoding="utf-8"?>
<!-- Generator: Adobe Illustrator 18.0.0, SVG Export Plug-In . SVG Version: 6.00 Build 0)  -->
<!DOCTYPE svg PUBLIC "-//W3C//DTD SVG 1.1//EN" "http://www.w3.org/Graphics/SVG/1.1/DTD/svg11.dtd">
<svg version="1.1" id="Content" xmlns="http://www.w3.org/2000/svg" xmlns:xlink="http://www.w3.org/1999/xlink" x="0px" y="0px"
	 viewBox="0 0 1600 900" enable-background="new 0 0 1600 900" xml:space="preserve">
<rect id="Background" y="0" fill="#242733" width="1600" height="900"/>
<g>
	<path fill="#FFFFFF" d="M1013.3,252.4c-20.5-17.2-49.1-20-72.5-6.6c-19.1,11-29.9,27.5-31.9,49.6c-0.2,2.1-0.6,4.6-1.8,6.3
		c-13.7,19.2-27.5,38.3-41.4,57.4c-0.2,0.3-0.7,0.6-1.1,0.6c-8.6,0.2-16.6,2.9-24.2,6.7c-0.5,0.3-1.4,0.3-2,0
		c-9.5-3.9-18.9-7.8-28.3-11.8c-29-12.3-57.9-24.6-86.9-36.9c-20.2-8.6-40.3-17.1-60.5-25.7c-1-0.4-2-1.5-2.4-2.5
		c-2.6-7-5.3-14-10.4-19.7c-13.2-14.8-29.7-20.3-49-15.9c-26.3,6.1-43.1,32.9-35.2,60.8c4.4,15.8,14.7,26.9,30.3,32.5
		c11.4,4.2,22.8,4.1,34.1-0.3c3.1-1.2,5.9-2.9,8.9-4.2c0.8-0.4,2.1-0.4,2.9,0c12.3,5.1,24.5,10.2,36.8,15.4
		c26.5,11.2,53,22.6,79.5,33.8c19,8.1,37.9,16.1,56.9,24.2c1,0.4,2,1.7,2.3,2.7c5.3,19.4,17,32.8,37,37.2
		c19.1,4.2,35.5-1.4,48.4-16.3c6.9-8,10.2-17.6,11.2-28.1c0.1-1.4,0.8-3.1,1.8-3.9c17.5-13.3,35.1-26.4,52.7-39.5
		c1.8-1.4,4.1-2.4,6.3-3c3.5-0.9,7.2-1,10.7-1.8c29.3-6.5,50.3-32,50.4-61.3C1036.1,282.8,1027.8,264.6,1013.3,252.4z M643.3,285.5
		c-2,1.7-4.2,1.4-6-0.2c-3-2.6-5.5-5.6-8.7-7.9c-10.4-7.3-28.8-7.5-39,6.9c-9.7,13.7-6.2,32.1,7.9,41.2c5.2,3.4,11.1,4,17.1,4.2
		c1,0,2.1,0.1,3.1,0.2c2.9,0.3,4.3,1.7,4.4,4.4c0.1,2.7-1.5,4.5-4.2,4.8c-22.9,3.1-43.5-14.8-43.5-37.9c0-18.5,13.3-34.9,31.5-37.9
		c13.7-2.3,25.6,1.6,35.2,11.9c1.2,1.3,2.4,2.7,3.3,4.2C645.6,281.7,645.3,283.8,643.3,285.5z M902.9,416.1
		c-3.2,15-12.3,25.1-27,29.4c-13.9,4.1-26.3,0.5-37-9.1c-1.3-1.2-2.4-2.5-3.5-3.9c-1.8-2.4-1.6-4.6,0.3-6.9c1.8-2.1,4.1-2.1,6.1-0.8
		c2.4,1.5,4.4,3.6,6.7,5.4c6.5,5.2,14,6.8,22.1,5.3c19.9-3.8,25.3-23.5,20.1-36.5c-4.5-11.3-14.4-17.5-26.4-17.1
		c-2.1,0-4.2,0.1-6.2,0c-2.6-0.1-4-2-4.2-4.2c-0.1-1.6,0.6-4.1,1.8-4.8c1.9-1.3,4.5-2,6.9-2.2C887.4,368.6,908.1,391.8,902.9,416.1z
		 M972.1,345.3c-24.1-0.1-44-20.1-43.9-44.3c0.1-24,20.3-43.8,44.5-43.7c23.7,0.1,43.4,20.2,43.4,44
		C1016,325.4,996.1,345.4,972.1,345.3z"/>
	<path fill="#FFFFFF" d="M972.2,268.8c-17.7,0-32.2,14.6-32.2,32.4c0,18,14.2,32.2,32.3,32.3c17.9,0,32.3-14.4,32.3-32.2
		C1004.6,283.7,989.7,268.8,972.2,268.8z"/>
</g>
<g>
	<path fill="#FFFFFF" d="M667.1,608.2c1.3,2.6,3,4.7,5.2,6.2c2.2,1.5,4.8,2.6,7.8,3.3c3,0.7,6.2,1,9.7,1c2,0,4.1-0.3,6.4-0.8
		c2.3-0.6,4.5-1.5,6.5-2.7c2-1.2,3.7-2.8,5-4.7c1.3-1.9,2-4.3,2-7c0-2.1-0.5-3.9-1.4-5.5c-0.9-1.5-2.2-2.8-3.7-3.9
		c-1.5-1-3.2-1.9-5-2.6c-1.8-0.7-3.6-1.2-5.4-1.6l-16.7-4.1c-2.2-0.6-4.3-1.3-6.4-2.1c-2.1-0.8-3.9-2-5.4-3.4
		c-1.5-1.4-2.8-3.1-3.7-5.1c-0.9-2-1.4-4.5-1.4-7.5c0-1.8,0.3-4,1-6.4c0.7-2.5,2-4.8,3.9-6.9c1.9-2.2,4.6-4,7.9-5.5
		c3.4-1.5,7.7-2.3,12.9-2.3c3.7,0,7.2,0.5,10.6,1.5c3.4,1,6.3,2.5,8.8,4.4c2.5,2,4.5,4.4,6,7.3c1.5,2.9,2.3,6.3,2.3,10.1H707
		c-0.1-2.9-0.8-5.4-1.9-7.5c-1.2-2.1-2.7-3.9-4.5-5.4c-1.9-1.4-4-2.5-6.4-3.3c-2.4-0.7-5-1.1-7.6-1.1c-2.5,0-4.8,0.3-7.1,0.8
		c-2.3,0.5-4.3,1.4-6,2.5c-1.7,1.2-3.1,2.7-4.1,4.6c-1.1,1.9-1.6,4.2-1.6,7c0,1.8,0.3,3.3,0.9,4.6c0.6,1.3,1.4,2.4,2.5,3.3
		c1.1,0.9,2.3,1.6,3.6,2.2c1.4,0.6,2.8,1,4.4,1.4l18.3,4.5c2.7,0.7,5.2,1.6,7.5,2.6c2.3,1,4.4,2.3,6.2,3.8c1.8,1.5,3.2,3.3,4.2,5.5
		c1,2.2,1.5,4.8,1.5,7.9c0,0.8-0.1,2-0.3,3.4c-0.2,1.4-0.6,2.9-1.3,4.5c-0.7,1.6-1.6,3.2-2.8,4.8c-1.2,1.6-2.9,3.1-5,4.4
		c-2.1,1.3-4.8,2.3-7.9,3.2c-3.2,0.8-6.9,1.2-11.3,1.2c-4.4,0-8.5-0.5-12.3-1.5c-3.8-1-7-2.6-9.7-4.7c-2.7-2.1-4.7-4.8-6.1-8.1
		c-1.4-3.3-2-7.2-1.8-11.9h7.1C665.2,602.4,665.8,605.6,667.1,608.2z"/>
	<path fill="#FFFFFF" d="M748.4,569v5.6h-11v36.6c0,2.2,0.3,3.9,0.9,5.1c0.6,1.2,2.1,1.9,4.5,2c1.9,0,3.8-0.1,5.7-0.3v5.6
		c-1,0-2,0-2.9,0.1c-1,0.1-2,0.1-2.9,0.1c-4.4,0-7.5-0.9-9.2-2.6c-1.8-1.7-2.6-4.9-2.5-9.5v-37.1h-9.5V569h9.5v-16.3h6.6V569H748.4z
		"/>
	<path fill="#FFFFFF" d="M762.8,605.3c0.7,2.6,1.7,4.9,3.2,6.9c1.5,2,3.3,3.7,5.6,5c2.2,1.3,4.9,2,8.1,2c4.8,0,8.6-1.3,11.3-3.8
		c2.7-2.5,4.6-5.9,5.7-10.1h6.6c-1.4,6.2-4,10.9-7.7,14.3c-3.7,3.4-9.1,5-15.9,5c-4.3,0-8-0.8-11.1-2.3c-3.1-1.5-5.7-3.6-7.6-6.2
		c-2-2.6-3.4-5.7-4.4-9.1c-0.9-3.5-1.4-7.1-1.4-11c0-3.6,0.5-7.1,1.4-10.5c0.9-3.4,2.4-6.5,4.4-9.2c2-2.7,4.5-4.9,7.6-6.5
		c3.1-1.6,6.8-2.5,11.1-2.5c4.3,0,8.1,0.9,11.1,2.6c3.1,1.8,5.6,4,7.5,6.9c1.9,2.8,3.3,6.1,4.1,9.8c0.8,3.7,1.2,7.4,1.1,11.2h-41.7
		C761.8,600.3,762.2,602.8,762.8,605.3z M795.6,585.1c-0.8-2.3-1.9-4.4-3.4-6.1c-1.5-1.8-3.3-3.2-5.4-4.3c-2.1-1.1-4.5-1.6-7.1-1.6
		c-2.7,0-5.1,0.5-7.2,1.6c-2.1,1.1-3.9,2.5-5.4,4.3c-1.5,1.8-2.6,3.9-3.5,6.2c-0.9,2.3-1.5,4.7-1.7,7.2h35.1
		C796.8,589.8,796.4,587.4,795.6,585.1z"/>
	<path fill="#FFFFFF" d="M813.8,577.4c1.1-2.3,2.6-4.2,4.6-5.7c1.9-1.5,4.2-2.6,6.8-3.3c2.6-0.7,5.5-1,8.6-1c2.4,0,4.8,0.2,7.1,0.7
		c2.4,0.5,4.5,1.3,6.4,2.6c1.9,1.3,3.4,3,4.6,5.3c1.2,2.3,1.8,5.2,1.8,8.9v28.8c0,2.7,1.3,4,3.9,4c0.8,0,1.5-0.1,2.1-0.4v5.6
		c-0.8,0.1-1.5,0.2-2,0.3c-0.6,0.1-1.3,0.1-2.3,0.1c-1.7,0-3-0.2-4-0.7c-1-0.5-1.8-1.1-2.4-1.9c-0.6-0.8-0.9-1.8-1.1-3
		c-0.2-1.2-0.3-2.4-0.3-3.8h-0.2c-1.2,1.8-2.4,3.3-3.6,4.7c-1.2,1.4-2.6,2.5-4.1,3.4c-1.5,0.9-3.2,1.6-5.1,2.1
		c-1.9,0.5-4.2,0.7-6.9,0.7c-2.5,0-4.9-0.3-7.1-0.9c-2.2-0.6-4.1-1.5-5.8-2.8c-1.6-1.3-2.9-2.9-3.9-4.9c-0.9-2-1.4-4.4-1.4-7.1
		c0-3.8,0.8-6.7,2.5-8.9c1.7-2.1,3.9-3.8,6.7-4.9c2.8-1.1,5.9-1.9,9.3-2.4c3.5-0.5,7-0.9,10.6-1.3c1.4-0.1,2.6-0.3,3.7-0.5
		c1.1-0.2,1.9-0.6,2.6-1.1c0.7-0.5,1.2-1.2,1.6-2.2c0.4-0.9,0.6-2.1,0.6-3.6c0-2.2-0.4-4.1-1.1-5.5c-0.7-1.4-1.8-2.6-3-3.4
		c-1.3-0.8-2.8-1.4-4.5-1.7c-1.7-0.3-3.6-0.5-5.5-0.5c-4.2,0-7.6,1-10.3,3c-2.7,2-4.1,5.2-4.2,9.6h-6.6
		C812,582.5,812.7,579.8,813.8,577.4z M846.9,593.6c-0.4,0.8-1.2,1.3-2.4,1.7c-1.2,0.4-2.2,0.6-3.2,0.7c-2.8,0.5-5.7,0.9-8.7,1.3
		c-3,0.4-5.7,1-8.1,1.7c-2.5,0.8-4.5,1.9-6,3.3c-1.6,1.4-2.4,3.5-2.4,6.1c0,1.7,0.3,3.2,1,4.5c0.7,1.3,1.6,2.4,2.7,3.4
		c1.1,0.9,2.4,1.7,3.9,2.2c1.5,0.5,3,0.7,4.5,0.7c2.5,0,4.9-0.4,7.2-1.2c2.3-0.8,4.3-1.9,6-3.4c1.7-1.5,3.1-3.3,4.1-5.4
		c1-2.1,1.5-4.5,1.5-7.1v-8.6H846.9z"/>
	<path fill="#FFFFFF" d="M873.1,569v9.1h0.3c1.7-3.4,4-6,6.9-7.9c2.8-1.9,6.5-2.8,10.9-2.8c3.6,0,6.8,0.9,9.7,2.6
		c2.9,1.8,4.8,4.4,5.8,8c1.6-3.6,4-6.2,7.1-8c3.2-1.7,6.5-2.6,10.1-2.6c12,0,18,6.3,18,19v36.8h-6.6v-36.4c0-4.5-0.9-7.9-2.8-10.2
		c-1.9-2.3-5.2-3.5-10-3.5c-2.9,0-5.3,0.5-7.1,1.6c-1.9,1.1-3.4,2.5-4.5,4.4c-1.1,1.8-1.9,3.9-2.4,6.3c-0.5,2.3-0.7,4.8-0.7,7.3
		v30.7h-6.6v-36.8c0-1.8-0.2-3.6-0.6-5.2c-0.4-1.6-1-3.1-1.9-4.3c-0.9-1.2-2-2.2-3.5-2.9c-1.5-0.7-3.3-1.1-5.4-1.1
		c-2.8,0-5.2,0.5-7.3,1.5c-2.1,1-3.7,2.4-5,4.2c-1.3,1.8-2.3,3.9-2.9,6.3c-0.6,2.4-0.9,5.1-0.9,7.9v30.3H867V569H873.1z"/>
</g>
<g>
	<path fill="#FFFFFF" d="M584.2,704.7v-41.4h16.9c4.3,0,7.5,0.9,9.5,2.6c2,1.7,3.1,4.4,3.1,8c0.1,2.8-0.7,5.1-2.2,6.9
		c-1.5,1.8-3.8,3.1-6.7,3.7v0.1c1.7,0.2,3.1,0.6,4.2,1.2c1.1,0.6,1.9,1.4,2.5,2.3c0.6,1,1,2.1,1.2,3.4c0.2,1.3,0.3,2.8,0.3,4.5
		c0,0.6,0,1.3,0.1,2.2c0,0.9,0.1,1.7,0.2,2.6c0.1,0.8,0.2,1.6,0.3,2.3c0.1,0.7,0.3,1.2,0.5,1.4h-1.3c-0.2-0.4-0.3-1-0.5-1.7
		c-0.1-0.7-0.2-1.5-0.3-2.3c-0.1-0.8-0.1-1.6-0.1-2.5c0-0.8,0-1.6,0-2.2c0-1.7-0.1-3.2-0.4-4.5c-0.3-1.3-0.8-2.5-1.5-3.4
		c-0.8-0.9-1.9-1.6-3.3-2.1c-1.4-0.5-3.3-0.7-5.7-0.7h-15.6v19.4H584.2z M600.8,684.1c1.5,0,3-0.2,4.4-0.6c1.4-0.4,2.7-1,3.7-1.9
		c1.1-0.8,2-1.9,2.6-3.2c0.7-1.3,1-2.8,1-4.7c0-2.9-0.9-5.2-2.7-6.9c-1.7-1.6-4.6-2.5-8.5-2.5h-16v19.6H600.8z"/>
	<path fill="#FFFFFF" d="M619.8,695.6c0.4,1.7,1.1,3.2,2.1,4.5c0.9,1.3,2.1,2.3,3.6,3c1.5,0.7,3.3,1.1,5.4,1.1
		c3.1,0,5.7-0.8,7.8-2.5c2.1-1.6,3.3-4.1,3.9-7.4h1.2c-0.4,3.5-1.8,6.2-4.1,8.1c-2.3,1.9-5.2,2.9-8.6,2.9c-2.3,0-4.3-0.3-5.9-1.1
		c-1.6-0.8-3-1.9-4-3.3c-1-1.4-1.8-3.1-2.3-5c-0.5-1.9-0.8-4-0.8-6.2c0-2.5,0.4-4.7,1.1-6.6c0.7-1.9,1.7-3.6,2.9-4.9
		c1.2-1.3,2.6-2.3,4.2-3c1.6-0.7,3.2-1,4.9-1c2.3,0,4.3,0.4,6,1.3c1.7,0.9,3.1,2.1,4.1,3.5c1.1,1.5,1.8,3.1,2.3,5
		c0.5,1.9,0.7,3.9,0.6,5.9h-24.9C619.1,692,619.3,693.9,619.8,695.6z M642.1,683.7c-0.5-1.6-1.2-3.1-2.2-4.3c-1-1.2-2.2-2.2-3.7-2.9
		c-1.5-0.7-3.2-1.1-5.1-1.1c-1.6,0-3.1,0.3-4.5,0.9c-1.4,0.6-2.6,1.5-3.7,2.7c-1.1,1.2-1.9,2.6-2.6,4.3c-0.7,1.7-1,3.5-1.2,5.6h23.8
		C642.8,687,642.6,685.3,642.1,683.7z"/>
	<path fill="#FFFFFF" d="M672.9,663.3v41.4h-1.2v-8.3h-0.1c-0.8,2.7-2.2,4.8-4.3,6.5s-4.6,2.5-7.7,2.5c-2,0-3.7-0.4-5.3-1.2
		c-1.6-0.8-2.9-1.8-4-3.2c-1.1-1.4-1.9-3-2.5-4.9c-0.6-1.9-0.9-4-0.9-6.2c0-2.1,0.3-4.1,0.8-6c0.6-1.9,1.4-3.6,2.4-5
		c1.1-1.4,2.4-2.6,4-3.4c1.6-0.8,3.4-1.3,5.4-1.3c3.2,0,5.8,0.8,7.8,2.5c2,1.7,3.4,3.8,4.1,6.5h0.1v-19.9H672.9z M668.5,679.1
		c-2.2-2.5-5.1-3.7-8.7-3.7c-2,0-3.7,0.4-5.2,1.3c-1.5,0.9-2.7,2-3.6,3.4c-0.9,1.4-1.6,2.9-2.1,4.6c-0.4,1.7-0.7,3.4-0.7,5.2
		c0,1.9,0.2,3.7,0.7,5.4c0.5,1.7,1.2,3.3,2.1,4.6c0.9,1.3,2.1,2.4,3.6,3.2c1.4,0.8,3.1,1.2,5.1,1.2c1.9,0,3.6-0.4,5.1-1.2
		c1.5-0.8,2.7-1.8,3.8-3.1c1-1.3,1.8-2.8,2.3-4.6c0.5-1.7,0.8-3.6,0.8-5.5C671.8,685.2,670.7,681.6,668.5,679.1z"/>
	<path fill="#FFFFFF" d="M679.9,695.6c0.4,1.7,1.1,3.2,2.1,4.5c0.9,1.3,2.1,2.3,3.6,3c1.5,0.7,3.3,1.1,5.4,1.1
		c3.1,0,5.7-0.8,7.8-2.5c2.1-1.6,3.3-4.1,3.9-7.4h1.2c-0.4,3.5-1.8,6.2-4.1,8.1c-2.3,1.9-5.2,2.9-8.6,2.9c-2.3,0-4.3-0.3-5.9-1.1
		c-1.6-0.8-3-1.9-4-3.3c-1-1.4-1.8-3.1-2.3-5c-0.5-1.9-0.8-4-0.8-6.2c0-2.5,0.4-4.7,1.1-6.6c0.7-1.9,1.7-3.6,2.9-4.9
		c1.2-1.3,2.6-2.3,4.2-3c1.6-0.7,3.2-1,4.9-1c2.3,0,4.3,0.4,6,1.3c1.7,0.9,3.1,2.1,4.1,3.5c1.1,1.5,1.8,3.1,2.3,5
		c0.5,1.9,0.7,3.9,0.6,5.9h-24.9C679.2,692,679.4,693.9,679.9,695.6z M702.1,683.7c-0.5-1.6-1.2-3.1-2.2-4.3c-1-1.2-2.2-2.2-3.7-2.9
		c-1.5-0.7-3.2-1.1-5.1-1.1c-1.6,0-3.1,0.3-4.5,0.9c-1.4,0.6-2.6,1.5-3.7,2.7c-1.1,1.2-1.9,2.6-2.6,4.3c-0.7,1.7-1,3.5-1.2,5.6h23.8
		C702.9,687,702.6,685.3,702.1,683.7z"/>
	<path fill="#FFFFFF" d="M727.4,679.9c-0.5-1-1.1-1.9-2-2.6c-0.8-0.7-1.9-1.2-3-1.5c-1.2-0.3-2.5-0.5-3.9-0.5
		c-2.1,0-3.7,0.3-4.9,0.8c-1.2,0.6-2.1,1.2-2.7,1.9c-0.6,0.7-0.9,1.4-1.1,2.1c-0.2,0.7-0.2,1.2-0.2,1.4c0,1.5,0.3,2.6,0.9,3.4
		c0.6,0.8,1.4,1.4,2.4,1.8c1,0.4,2.2,0.8,3.4,1.1c1.2,0.3,2.6,0.7,4.3,1.1c1.2,0.3,2.3,0.6,3.4,1c1.1,0.3,2.2,0.8,3.1,1.4
		c0.9,0.6,1.6,1.3,2.2,2.2c0.6,0.9,0.8,2,0.8,3.5c0,1.5-0.3,2.8-1,3.8c-0.6,1-1.5,1.9-2.5,2.5c-1,0.7-2.2,1.1-3.5,1.4
		c-1.3,0.3-2.6,0.4-3.9,0.4c-4,0-7-0.9-9-2.6c-2-1.7-3-4.5-3-8.2h1.2c0,3.4,0.9,5.8,2.8,7.4c1.9,1.6,4.6,2.3,8.1,2.3
		c1.1,0,2.2-0.1,3.3-0.4c1.1-0.3,2.2-0.7,3.1-1.2c0.9-0.6,1.7-1.3,2.3-2.2c0.6-0.9,0.9-2,0.9-3.2c0-1.3-0.3-2.4-0.9-3.2
		c-0.6-0.8-1.4-1.5-2.3-2s-2-0.9-3.3-1.2c-1.2-0.3-2.5-0.6-3.8-0.9c-1.4-0.3-2.7-0.7-3.8-1c-1.1-0.3-2-0.7-2.9-1
		c-1.2-0.5-2.1-1.3-2.7-2.3c-0.6-1-0.9-2.3-0.9-3.9c0-0.8,0.2-1.7,0.5-2.5c0.3-0.9,0.9-1.7,1.7-2.4c0.8-0.7,1.9-1.3,3.1-1.8
		c1.3-0.5,2.8-0.7,4.7-0.7c3.3,0,5.9,0.8,7.9,2.3c1.9,1.5,2.9,3.9,2.9,7.2h-1.2C728.1,682.2,727.8,680.9,727.4,679.9z"/>
	<path fill="#FFFFFF" d="M735.5,669.2v-5.9h1.2v5.9H735.5z M735.5,704.7v-29.8h1.2v29.8H735.5z"/>
	<path fill="#FFFFFF" d="M765.6,694.7c-0.3,1.3-0.9,2.5-1.7,3.5c-0.8,1-1.7,1.9-2.8,2.6c-1.1,0.7-2.2,1.3-3.5,1.6
		c-1.3,0.4-2.5,0.5-3.8,0.5c-2.1,0-3.9-0.4-5.4-1.2c-1.5-0.8-2.8-1.8-3.9-3.1c-1-1.3-1.8-2.8-2.3-4.5c-0.5-1.7-0.8-3.6-0.8-5.4
		c0-2,0.3-3.9,0.8-5.6c0.5-1.8,1.4-3.3,2.4-4.6c1.1-1.3,2.4-2.4,4-3.2c1.6-0.8,3.4-1.2,5.5-1.2c1.4,0,2.8,0.2,4,0.7
		c1.2,0.4,2.3,1.1,3.3,1.8c1,0.8,1.8,1.7,2.5,2.7c0.7,1,1.2,2.2,1.5,3.4h0.1v-7.9h1.2v28.8c0,4.1-1.1,7.1-3.2,9s-5.2,2.9-9.2,2.9
		c-1.5,0-2.9-0.2-4.3-0.5c-1.4-0.3-2.5-0.9-3.6-1.7c-1-0.8-1.9-1.7-2.5-2.9c-0.6-1.2-0.9-2.6-1-4.3h1.2c0,1.5,0.3,2.7,0.9,3.8
		c0.6,1,1.3,1.9,2.2,2.5c0.9,0.7,2,1.1,3.2,1.4c1.2,0.3,2.5,0.5,3.8,0.5c3.6,0,6.4-0.9,8.4-2.6c1.9-1.7,2.9-4.4,2.9-8.1v-9H765.6z
		 M764.9,683.8c-0.5-1.6-1.2-3.1-2.1-4.3c-0.9-1.3-2.1-2.3-3.6-3c-1.4-0.8-3.1-1.1-4.9-1.1c-1.9,0-3.6,0.4-5.1,1.1
		c-1.4,0.7-2.7,1.7-3.7,2.9c-1,1.2-1.7,2.7-2.2,4.3c-0.5,1.6-0.7,3.3-0.7,5.2c0,1.9,0.2,3.6,0.7,5.2c0.5,1.6,1.2,3,2.1,4.1
		c0.9,1.2,2.1,2.1,3.5,2.8c1.4,0.7,3,1,4.8,1c1.9,0,3.6-0.3,5.1-1c1.5-0.7,2.7-1.6,3.7-2.8c1-1.2,1.7-2.6,2.3-4.2
		c0.5-1.6,0.8-3.3,0.8-5.1C765.6,687.1,765.4,685.4,764.9,683.8z"/>
	<path fill="#FFFFFF" d="M774.2,674.9v7.4h0.1c0.3-1.2,0.7-2.2,1.3-3.2c0.6-1,1.4-1.8,2.3-2.5c0.9-0.7,2-1.3,3.2-1.7s2.5-0.6,4-0.6
		c1.5,0,3,0.2,4.3,0.7c1.3,0.5,2.4,1.1,3.4,2.1s1.7,2,2.2,3.4c0.5,1.3,0.8,2.9,0.8,4.6v19.8h-1.2v-19.6c0-1.7-0.3-3.2-0.8-4.4
		c-0.5-1.2-1.2-2.2-2.1-3c-0.9-0.8-1.9-1.4-3-1.7c-1.1-0.4-2.3-0.6-3.6-0.6c-1.8,0-3.3,0.3-4.7,1c-1.4,0.7-2.5,1.6-3.4,2.7
		c-0.9,1.1-1.6,2.5-2.1,4c-0.5,1.5-0.7,3.1-0.7,4.8v16.9h-1.2v-29.8H774.2z"/>
	<path fill="#FFFFFF" d="M851.4,695.4c-1,2.1-2.2,3.9-3.7,5.4c-1.5,1.5-3.3,2.7-5.4,3.5c-2.1,0.8-4.4,1.3-7.1,1.3
		c-2.7,0-5.3-0.5-7.6-1.6c-2.3-1.1-4.3-2.5-5.9-4.4c-1.6-1.9-2.9-4.1-3.9-6.7c-0.9-2.6-1.4-5.5-1.4-8.5c0-2.5,0.4-5.1,1.1-7.7
		c0.7-2.6,1.8-5,3.4-7.1c1.5-2.1,3.6-3.9,6-5.2c2.5-1.4,5.5-2,9-2c2.7,0,5.1,0.5,7.2,1.4c2,0.9,3.8,2,5.1,3.4
		c1.4,1.4,2.4,2.8,3.1,4.4c0.7,1.5,1.1,3,1.1,4.2h-1.2c-0.1-1.5-0.6-3-1.3-4.4c-0.8-1.4-1.8-2.8-3.2-3.9c-1.3-1.2-2.9-2.1-4.8-2.8
		c-1.8-0.7-3.9-1.1-6.1-1.1c-3.4,0-6.3,0.7-8.6,2.1c-2.3,1.4-4.2,3.1-5.6,5.2c-1.4,2.1-2.5,4.3-3.1,6.7c-0.6,2.4-1,4.7-1,6.9
		c0,2.6,0.4,5.2,1.2,7.6c0.8,2.4,1.9,4.6,3.4,6.4c1.5,1.9,3.3,3.3,5.5,4.5c2.2,1.1,4.7,1.7,7.4,1.7c2.5,0,4.7-0.4,6.7-1.2
		c2-0.8,3.7-1.9,5.1-3.4c1.4-1.4,2.6-3.1,3.5-5.1c0.9-2,1.5-4.1,1.8-6.4h1.2C853,691,852.3,693.3,851.4,695.4z"/>
	<path fill="#FFFFFF" d="M857.1,683.9c0.6-1.9,1.4-3.5,2.6-5c1.1-1.4,2.5-2.6,4.2-3.4c1.7-0.9,3.6-1.3,5.8-1.3
		c2.2,0,4.1,0.4,5.7,1.3c1.7,0.9,3.1,2,4.2,3.4c1.1,1.4,2,3.1,2.6,5c0.6,1.9,0.9,3.8,0.9,5.9s-0.3,4-0.9,5.9c-0.6,1.9-1.4,3.5-2.6,5
		c-1.1,1.4-2.5,2.6-4.2,3.4c-1.7,0.8-3.6,1.3-5.8,1.3c-2.2,0-4.1-0.4-5.7-1.3s-3.1-2-4.2-3.4c-1.1-1.4-2-3.1-2.6-5
		c-0.6-1.9-0.9-3.8-0.9-5.9S856.6,685.8,857.1,683.9z M858.2,695.2c0.5,1.7,1.3,3.3,2.3,4.6c1,1.3,2.3,2.4,3.9,3.2
		c1.5,0.8,3.3,1.2,5.3,1.2c2,0,3.7-0.4,5.2-1.2c1.5-0.8,2.8-1.9,3.9-3.2c1-1.3,1.8-2.9,2.3-4.6c0.5-1.7,0.8-3.6,0.8-5.4
		c0-1.9-0.3-3.7-0.8-5.4c-0.5-1.7-1.3-3.3-2.3-4.6c-1-1.3-2.3-2.4-3.9-3.2c-1.5-0.8-3.3-1.2-5.2-1.2c-2,0-3.8,0.4-5.3,1.2
		c-1.5,0.8-2.8,1.9-3.9,3.2c-1,1.3-1.8,2.9-2.3,4.6c-0.5,1.7-0.8,3.5-0.8,5.4C857.4,691.7,857.7,693.5,858.2,695.2z"/>
	<path fill="#FFFFFF" d="M889.1,674.9v7.4h0.1c0.3-1.2,0.7-2.2,1.3-3.2c0.6-1,1.4-1.8,2.3-2.5c0.9-0.7,2-1.3,3.2-1.7s2.5-0.6,4-0.6
		c1.5,0,3,0.2,4.3,0.7c1.3,0.5,2.4,1.1,3.4,2.1s1.7,2,2.2,3.4c0.5,1.3,0.8,2.9,0.8,4.6v19.8h-1.2v-19.6c0-1.7-0.3-3.2-0.8-4.4
		c-0.5-1.2-1.2-2.2-2.1-3c-0.9-0.8-1.9-1.4-3-1.7c-1.1-0.4-2.3-0.6-3.6-0.6c-1.8,0-3.3,0.3-4.7,1c-1.4,0.7-2.5,1.6-3.4,2.7
		c-0.9,1.1-1.6,2.5-2.1,4c-0.5,1.5-0.7,3.1-0.7,4.8v16.9h-1.2v-29.8H889.1z"/>
	<path fill="#FFFFFF" d="M939.6,699c-0.7,1.3-1.5,2.5-2.6,3.4c-1.1,0.9-2.3,1.6-3.7,2.1c-1.4,0.5-3,0.8-4.7,0.8
		c-2.1,0-4-0.4-5.6-1.2c-1.6-0.8-3-1.9-4.1-3.2c-1.1-1.4-2-2.9-2.5-4.7c-0.6-1.8-0.9-3.7-0.9-5.8c0-2.2,0.3-4.2,0.8-6.2
		c0.6-2,1.4-3.7,2.5-5.2c1.1-1.5,2.6-2.7,4.3-3.6c1.8-0.9,3.8-1.3,6.2-1.3c1.4,0,2.7,0.2,4,0.6c1.3,0.4,2.4,1,3.4,1.9
		c1,0.8,1.8,1.8,2.5,3c0.7,1.2,1.1,2.6,1.3,4.2h-1.2c-0.2-1.5-0.7-2.7-1.3-3.8c-0.6-1.1-1.4-1.9-2.3-2.7c-0.9-0.7-1.9-1.2-3-1.6
		c-1.1-0.3-2.3-0.5-3.5-0.5c-2.4,0-4.4,0.5-6,1.4c-1.6,0.9-3,2.1-3.9,3.5c-1,1.4-1.7,3.1-2.1,4.9c-0.4,1.8-0.7,3.6-0.7,5.3
		c0,1.8,0.3,3.6,0.8,5.2c0.5,1.7,1.3,3.1,2.3,4.4c1,1.3,2.3,2.3,3.8,3c1.5,0.8,3.2,1.1,5.2,1.1c1.5,0,2.8-0.2,4.1-0.7
		c1.3-0.4,2.4-1.1,3.4-1.9c1-0.8,1.8-1.9,2.4-3c0.6-1.2,1-2.5,1.1-4h1.2C940.7,696.2,940.3,697.7,939.6,699z"/>
	<path fill="#FFFFFF" d="M946,695.6c0.4,1.7,1.1,3.2,2.1,4.5c0.9,1.3,2.1,2.3,3.6,3c1.5,0.7,3.3,1.1,5.4,1.1c3.1,0,5.7-0.8,7.8-2.5
		c2.1-1.6,3.3-4.1,3.9-7.4h1.2c-0.4,3.5-1.8,6.2-4.1,8.1c-2.3,1.9-5.2,2.9-8.6,2.9c-2.3,0-4.3-0.3-5.9-1.1c-1.6-0.8-3-1.9-4-3.3
		c-1-1.4-1.8-3.1-2.3-5c-0.5-1.9-0.8-4-0.8-6.2c0-2.5,0.4-4.7,1.1-6.6c0.7-1.9,1.7-3.6,2.9-4.9c1.2-1.3,2.6-2.3,4.2-3
		c1.6-0.7,3.2-1,4.9-1c2.3,0,4.3,0.4,6,1.3c1.7,0.9,3.1,2.1,4.1,3.5c1.1,1.5,1.8,3.1,2.3,5c0.5,1.9,0.7,3.9,0.6,5.9h-24.9
		C945.3,692,945.5,693.9,946,695.6z M968.3,683.7c-0.5-1.6-1.2-3.1-2.2-4.3c-1-1.2-2.2-2.2-3.7-2.9c-1.5-0.7-3.2-1.1-5.1-1.1
		c-1.6,0-3.1,0.3-4.5,0.9c-1.4,0.6-2.6,1.5-3.7,2.7c-1.1,1.2-1.9,2.6-2.6,4.3c-0.7,1.7-1,3.5-1.2,5.6H969
		C969,687,968.8,685.3,968.3,683.7z"/>
	<path fill="#FFFFFF" d="M974.8,714.9v-40h1.2v8.3h0.1c0.4-1.3,0.9-2.5,1.7-3.6c0.7-1.1,1.6-2.1,2.6-2.9c1-0.8,2.2-1.4,3.4-1.9
		c1.3-0.4,2.7-0.7,4.2-0.7c2,0,3.7,0.4,5.3,1.2c1.6,0.8,2.9,1.9,4,3.2c1.1,1.4,1.9,3,2.5,4.9c0.6,1.9,0.9,4,0.9,6.2
		c0,2.1-0.3,4.1-0.8,6c-0.6,1.9-1.4,3.6-2.4,5c-1.1,1.4-2.4,2.6-4,3.4c-1.6,0.8-3.4,1.2-5.4,1.2c-3.2,0-5.8-0.8-7.8-2.5
		c-2-1.6-3.4-3.8-4.1-6.5H976v18.5H974.8z M993.3,702.9c1.4-0.9,2.6-2,3.6-3.4c0.9-1.4,1.6-2.9,2.1-4.6c0.4-1.7,0.7-3.4,0.7-5.2
		c0-1.9-0.2-3.8-0.7-5.5c-0.5-1.7-1.2-3.2-2.1-4.6c-0.9-1.3-2.1-2.4-3.6-3.2c-1.4-0.8-3.1-1.2-5.1-1.2c-1.9,0-3.6,0.4-5.1,1.2
		c-1.5,0.8-2.8,1.8-3.8,3.1c-1,1.3-1.8,2.8-2.3,4.6c-0.5,1.7-0.8,3.6-0.8,5.5c0,4.7,1.1,8.3,3.3,10.7c2.2,2.5,5.1,3.7,8.7,3.7
		C990.1,704.2,991.8,703.8,993.3,702.9z"/>
	<path fill="#FFFFFF" d="M1009.1,698.9c0,1.1,0.1,2,0.4,2.6c0.3,0.6,0.6,1.1,1,1.4c0.4,0.3,0.8,0.5,1.3,0.6c0.5,0.1,0.9,0.1,1.4,0.1
		c0.6,0,1.1,0,1.6,0c0.5,0,0.8-0.1,1-0.1v1.2c-0.3,0-0.7,0.1-1,0.1c-0.3,0-0.9,0.1-1.8,0.1c-1.4,0-2.5-0.4-3.4-1.2
		c-0.9-0.8-1.4-2.2-1.4-4.4V676h-5.4v-1.2h5.4v-9.4h1.2v9.4h6.7v1.2h-6.7V698.9z"/>
</g>
</svg>
