<?xml version="1.0" encoding="utf-8"?>
<!-- Generator: Adobe Illustrator 18.0.0, SVG Export Plug-In . SVG Version: 6.00 Build 0)  -->
<!DOCTYPE svg PUBLIC "-//W3C//DTD SVG 1.1//EN" "http://www.w3.org/Graphics/SVG/1.1/DTD/svg11.dtd">
<svg version="1.1" id="Layer_1" xmlns="http://www.w3.org/2000/svg" xmlns:xlink="http://www.w3.org/1999/xlink" x="0px" y="0px"
	 viewBox="0 507 800 266" enable-background="new 0 507 800 266" xml:space="preserve">
<g>
	<g>
		<polygon fill="#333333" points="734,615.5 723.1,615.5 710.3,637.5 697.6,615.5 686.7,615.5 703,643.8 686.7,672 697.6,672 
			710.3,650 723.1,672 734,672 717.7,643.8 		"/>
		<path fill="#333333" d="M403.6,624.8V660l28.3,16.2l18.9-10.8v14.8l-18.9,10.9l-28.3-16.3v10.9l28.3,16.2l28.3-16.2v-60.8
			l-28.3-16.4L403.6,624.8z M450.7,630.2v24.3l-18.9,10.9L413,654.5v-24.3l18.9-10.9L450.7,630.2z"/>
		<polygon fill="#333333" points="472.2,626.2 472.2,661.4 500.5,677.6 528.8,661.5 528.8,661.5 528.8,661.4 528.8,650.5 
			500.5,666.8 481.7,656 481.7,631.7 500.5,620.8 519.4,631.7 500.5,642.6 500.5,653.4 528.8,637.2 528.8,637.1 528.8,626.2 
			528.8,626.2 500.5,609.8 		"/>
		<polygon fill="#333333" points="622.6,626.2 622.6,661.4 650.9,677.6 679.2,661.4 679.2,650.5 650.9,666.8 632,656 632,631.7 
			650.9,620.8 669.8,631.7 650.9,642.6 650.9,653.4 679.2,637.2 679.2,637.1 679.2,626.2 679.2,626.2 650.9,609.8 		"/>
		<path fill="#333333" d="M362.4,609.8l-28.3,16.4v35.2l28.3,16.2l18.9-10.8v10.8l9.4-5.5v-45.9L362.4,609.8z M381.2,656l-18.9,10.9
			L343.5,656v-24.3l18.9-10.9l18.9,10.9v13.2V656z"/>
		<polygon fill="#333333" points="269,622.2 245.4,608.5 217.1,624.9 217.1,635.8 217.1,672.2 226.5,677.6 226.5,630.4 245.4,619.5 
			264.2,630.4 264.2,674.9 269,677.6 273.7,674.9 273.7,630.4 292.5,619.5 311.4,630.4 311.4,677.6 320.8,672.2 320.8,624.9 
			292.5,608.5 		"/>
		<polygon fill="#333333" points="194.8,672.2 204.2,677.6 204.2,578.1 194.8,583.6 		"/>
		<polygon fill="#333333" points="601.3,623.2 553.6,623.2 553.6,578.1 544.2,583.6 544.2,672.2 553.6,677.6 553.6,632.6 
			601.3,632.6 601.3,677.6 610.7,672.2 610.7,583.6 601.3,578.1 		"/>
	</g>
	<g>
		<polygon fill="#E72244" points="118.5,637.1 141.8,623.6 165.1,637.1 165.1,664 141.8,677.5 118.5,664 		"/>
		<polygon fill="#7CBA5B" points="66,637.2 89.3,623.7 112.7,637.2 112.7,664.1 89.3,677.6 66,664.1 		"/>
		<polygon fill="#3B52A2" points="92.3,591.6 115.6,578.1 139,591.6 139,618.5 115.6,632 92.3,618.5 		"/>
	</g>
</g>
</svg>
