<svg id="Group_23" data-name="Group 23" xmlns="http://www.w3.org/2000/svg" xmlns:xlink="http://www.w3.org/1999/xlink" width="288.508" height="104.479" viewBox="0 0 288.508 104.479">
  <defs>
    <clipPath id="clip-path">
      <rect id="Rectangle_14" data-name="Rectangle 14" width="288.508" height="104.48" fill="#fff"/>
    </clipPath>
  </defs>
  <g id="Group_22" data-name="Group 22" clip-path="url(#clip-path)">
    <path id="Path_121" data-name="Path 121" d="M37.407,96.744c-4.3,5.591-8.171,7.736-13.759,7.736C9.889,104.479,0,84.271,0,53.315,0,21.069,9.459,0,23.648,0c4.728,0,9.029,1.721,13.329,5.589V24.937c-4.3-4.3-7.308-6.019-10.319-6.019-7.31,0-13.329,10.319-13.329,32.679,0,21.925,4.728,33.539,12.9,33.539,3.44,0,7.309-3.014,11.18-8.172ZM53.746,44.717l3.009-25.37,3.44,25.37ZM41.706,70.947h8.6l2.148-14.622h9.031l1.721,14.622h8.6L61.487,0H52.029ZM78.254.43h7.74l9.459,28.807L104.482.43h8.17V70.947h-8.6V25.8l-7.74,26.658H94.593L86.853,25.8h-.431V70.947H78.254Zm40.417,0h23.218V12.471H127.7V28.808h12.9V41.277H127.7v17.63h14.619v12.04H118.671Zm29.669,0h9.026V58.048h14.622v12.9H148.34Zm38.7,58.908V40.417h3.44c3.436,0,4.727,4.73,4.727,9.458,0,6.021-1.291,9.461-5.159,9.461h-3.007Zm-9.03,11.609h13.33c8.168,0,12.9-9.459,12.9-20.639,0-8.171-2.149-14.189-6.449-17.629,3.44-3.01,5.158-8.171,5.158-14.618,0-8.6-3.44-17.629-11.608-17.629h-13.33Zm9.03-42.138V11.61h1.719c3.872,0,5.159,3.009,5.159,8.6,0,6.02-1.719,8.6-5.159,8.6Zm31.817,15.909,3.44-25.37,3.009,25.37Zm-11.61,26.229h8.6l1.719-14.622h9.031l1.719,14.622h9.031L227.027,0h-9.463ZM242.5,0h13.757V50.736L271.309,0h13.33L270.022,49.876l18.486,54.178h-15.05l-17.2-50.306v50.306H242.5Z" fill="#fff" fill-rule="evenodd"/>
  </g>
</svg>
