<?xml version="1.0" standalone="no"?>
<!DOCTYPE svg PUBLIC "-//W3C//DTD SVG 20010904//EN"
 "http://www.w3.org/TR/2001/REC-SVG-20010904/DTD/svg10.dtd">
<svg version="1.0" xmlns="http://www.w3.org/2000/svg"
 width="100.000000pt" height="100.000000pt" viewBox="0 0 512.000000 512.000000"
 preserveAspectRatio="xMidYMid meet">
<metadata>
Created by potrace 1.15, written by Peter Selinger 2001-2017
</metadata>
<g transform="translate(0.000000,512.000000) scale(0.100000,-0.100000)"
fill="#000000" stroke="none">
<path d="M154 4571 c-17 -11 -36 -34 -43 -52 -8 -23 -11 -443 -11 -1536 0
-1350 2 -1508 16 -1538 32 -68 -25 -65 1064 -65 l982 0 -7 -57 c-20 -158 -101
-355 -186 -447 -60 -66 -150 -114 -229 -122 -106 -11 -140 -39 -140 -116 0
-45 19 -78 57 -97 15 -8 274 -11 905 -11 816 0 885 1 908 17 40 27 49 45 50
91 0 77 -34 105 -140 116 -79 8 -169 56 -229 122 -85 92 -166 289 -186 447
l-7 57 982 0 c1089 0 1032 -3 1064 65 14 30 16 188 16 1539 0 1650 3 1558 -59
1590 -27 14 -268 16 -2403 16 -2315 0 -2374 -1 -2404 -19z m4646 -1586 l0
-1385 -2240 0 -2240 0 0 1385 0 1385 2240 0 2240 0 0 -1385z m-2057 -1677 c14
-153 83 -354 168 -483 l49 -75 -400 0 -400 0 49 75 c85 129 154 330 168 483
l6 72 177 0 177 0 6 -72z"/>
<path d="M4115 4061 c-11 -5 -323 -191 -692 -414 l-671 -405 -558 114 c-307
63 -570 114 -585 114 -31 0 -22 6 -416 -277 -172 -123 -319 -234 -328 -246 -8
-12 -15 -39 -15 -60 0 -56 52 -107 108 -107 45 0 18 -17 374 238 147 105 278
198 291 207 22 14 60 8 590 -100 471 -96 570 -113 594 -104 15 6 342 200 726
431 526 318 702 428 713 449 34 67 5 139 -64 159 -42 11 -40 11 -67 1z"/>
<path d="M3575 3298 c-11 -6 -28 -20 -37 -32 -16 -19 -18 -72 -18 -706 0 -634
2 -687 18 -706 33 -41 52 -44 302 -44 250 0 269 3 302 44 16 19 18 72 18 706
0 634 -2 687 -18 706 -9 12 -27 27 -39 33 -30 15 -500 15 -528 -1z m365 -738
l0 -530 -100 0 -100 0 0 530 0 530 100 0 100 0 0 -530z"/>
<path d="M1854 2862 c-43 -35 -44 -42 -44 -522 l0 -462 34 -34 34 -34 248 0
c229 0 252 2 281 20 21 12 36 32 43 57 8 26 10 179 8 486 l-3 449 -33 29 -32
29 -258 0 c-228 0 -259 -2 -278 -18z m386 -517 l0 -315 -105 0 -105 0 0 315 0
315 105 0 105 0 0 -315z"/>
<path d="M2714 2651 c-17 -11 -36 -34 -43 -52 -18 -51 -15 -680 3 -724 26 -61
46 -65 322 -65 l246 0 34 34 34 34 0 362 0 362 -34 34 -34 34 -248 0 c-227 0
-252 -2 -280 -19z m376 -411 l0 -210 -105 0 -105 0 0 210 0 210 105 0 105 0 0
-210z"/>
<path d="M1024 2450 c-12 -4 -31 -21 -43 -36 -20 -26 -21 -36 -21 -283 0 -277
1 -281 57 -310 30 -15 496 -15 526 0 56 29 57 33 57 311 l0 258 -29 32 -29 33
-249 2 c-136 1 -258 -2 -269 -7z m356 -315 l0 -105 -100 0 -100 0 0 105 0 105
100 0 100 0 0 -105z"/>
</g>
</svg>
