{
    "--comments--": {
        "TODO": "Add comments here describing the configurations",
        "DocsUrl": "https://gitlab.com/taeluf/php/CodeScrawl/-/tree/v0.8#default-configs-file-structre"
    },

    "template.dirs": ["doctemplate"],

    "dir.docs": "docs",
    "dir.src": "docsrc",
    "dir.scan": ["src", "test"],
    "ScrawlExtensions":[],

    "file.bootstrap":"scrawl-bootstrap.php",

    "deleteExistingDocs": true,
    "readme.copyFromDocs": true,

    "markdown.preserveNewLines": true,
    "markdown.prependGenNotice": true
}
