{
    "readme.copyFromDocs": true,
    "dir.docs": "docs",
    "dir.template": ".docsrc",
    "dir.template_files": ".doctemplate",
    "dir.code": ["code", "test"],
    "deleteExistingDocs": true,
    "markdown.preserveNewLines": true,
    "markdown.prependGenNotice": false,
    "autoload": {
        "classmap":["code"]
    },
    "noprompt":false,
    "scrawl.ext": {
    },
    "file.code.ext": [".php"],
    "file.template.ext": [".src.md"],
    "lex.php":true
}
