Benchmark Results,01/14/2022,This benches the differentce between routing via a defined function (new) vs an anonymous function(old),,,,,,,,,,,,
,,,,,,,,,,,,,,
,,,,,,,,,,,,,,
Test,newroute,newroute,newroute,new,old,old,old,old,new_avg,old_avg,new wins by,new_min,old_min,new_min wins by
Verify,15.898,15.259,19.176,18.5289,17.8111,18.2371,18.0118,19.146,17.215475,18.3015,1.0860,15.259,17.8111,2.5521
Explicit,17.4541,16.3882,18.3861,19.1641,18.616,18.095,17.417,19.1422,17.848125,18.31755,0.4694,16.3882,17.417,1.0288
GetBlogForm,17.7519,20.226,20.716,21.102,17.2858,19.037,18.117,20.2579,19.948975,18.674425,-1.2746,17.7519,17.2858,-0.4661
ApproveRoleAccess,19.078,20.0191,18.9619,20.3581,18.369,22.8,20.7021,20.2558,19.604275,20.531725,0.9275,18.9619,18.369,-0.5929
DeleteFailNotFound,19.8801,23.5519,19.1872,19.2211,17.6299,19.49,20.869,19.52,20.460075,19.377225,-1.0829,19.1872,17.6299,-1.5573
SimpleSpeciesQuery,20.0481,20.6959,20.0789,21.059,17.3659,19.7771,17.5312,20.5801,20.470475,18.813575,-1.6569,20.0481,17.3659,-2.6822
DenyRoleAccess,20.107,20.0939,20.7009,19.774,19.7551,22.2411,19.4821,19.486,20.16895,20.241075,0.0721,19.774,19.4821,-0.2919
Routed,20.2549,16.8102,20.257,19.9161,17.7948,18.2118,17.6468,18.826,19.30955,18.11985,-1.1897,16.8102,17.6468,0.8366
ServeSitemap,20.689,16.458,20.7791,20.0069,19.2521,20.0751,18.6181,20.221,19.48325,19.541575,0.0583,16.458,18.6181,2.1601
GetDynamicRoute,21.0979,17.4,20.659,20.272,18.039,19.659,17.494,19.6559,19.857225,18.711975,-1.1453,17.4,17.494,0.0940
ApproveCustomAccess,21.1189,21.2319,19.9008,18.7759,18.0001,21.4539,18.7349,19.7248,20.256875,19.478425,-0.7785,18.7759,18.0001,-0.7758
QueryCharacterView,21.4751,19.6681,20.139,20.0491,18.306,17.766,18.2581,20.757,20.332825,18.771775,-1.5611,19.6681,17.766,-1.9021
EditBlogForm,21.713,19.3601,20.5181,41.1999,18.6858,18.7728,18.1282,19.093,25.697775,18.66995,-7.0278,19.3601,18.1282,-1.2319
DenyCustomAccess,21.7211,20.5719,19.81,19.767,19.0542,21.7309,18.1181,19.6531,20.4675,19.639075,-0.8284,19.767,18.1181,-1.6489
DeleteCustomResponse,24.7478,22.2831,17.9882,17.858,16.813,19.3322,20.4091,19.897,20.719275,19.112825,-1.6065,17.858,16.813,-1.0450
QueryCharacterJson,36.999,40.8032,41.9419,41.527,35.434,38.9938,36.8721,40.2579,40.317775,37.88945,-2.4283,36.999,35.434,-1.5650
NestedViews,38.5811,41.5809,42.7649,41.373,37.559,37.302,37.8311,39.644,41.074975,38.084025,-2.9910,38.5811,37.302,-1.2791
BlogFormRedirect,46.4988,41.343,43.9799,269.9819,41.4732,44.971,41.0042,45.053,100.4509,43.12535,-57.3256,41.343,41.0042,-0.3388
CustomRowAccess,46.7629,38.7189,38.9092,38.708,37.7119,43.633,39.0992,42.413,40.77475,40.714275,-0.0605,38.708,37.7119,-0.9961
UploadFile,47.5609,46.7269,50.205,267.1318,48.5339,53.3938,47.9009,48.8501,102.90615,49.669675,-53.2365,46.7269,47.9009,1.1740
FailToDeleteNonDeleteable,47.6868,22.0881,19.6512,17.904,16.752,40.2081,36.3381,18.7938,26.832525,28.023,1.1905,17.904,16.752,-1.1520
FailedSubmissionRequiredProperties,51.883,58.2728,55.4929,55.2781,49.1898,54.7771,66.123,58.8162,55.2317,57.226525,1.9948,51.883,49.1898,-2.6932
FailedAccessForSubmission,55.8231,58.862,59.006,48.8579,48.9972,56.411,53.843,54.4171,55.63725,53.417075,-2.2202,48.8579,48.9972,0.1393
UploadFileFail,72.551,56.3822,71.9929,48.1708,64.4102,52.64,70.004,51.9049,62.274225,59.739775,-2.5345,48.1708,51.9049,3.7341
SubmitBlogForm,79.576,76.2041,79.0451,340.306,78.413,80.605,76.009,82.6089,143.7828,79.408975,-64.3738,76.2041,76.009,-0.1951
RejectDeleteAccessWithCustomHandler,90.229,95.4969,91.512,94.2559,90.8499,122.802,112.6902,100.6579,92.87345,106.75,13.8766,90.229,90.8499,0.6209
DeletePrint,105.257,99.503,97.595,134.0981,127.6319,108.33,100.4932,100.5621,109.113275,109.2543,0.1410,97.595,100.4932,2.8982
DeleteItemS,141.3269,147.296,140.9271,156.6882,146.184,150.965,153.656,153.5931,146.55955,151.099525,4.5400,140.9271,146.184,5.2569
CreateNoDelete,142.3149,139.4999,169.0412,135.762,135.524,143.7621,139.4401,141.9289,146.6545,140.163775,-6.4907,135.762,135.524,-0.2380
DeleteRedirect,145.4089,155.2441,168.6559,153.8091,140.8501,146.848,146.256,125.9348,155.7795,139.972225,-15.8073,145.4089,125.9348,-19.4741
DeleteResponse,148.1171,147.7621,116.8931,152.4351,141.351,168.3779,161.0711,143.182,141.30185,153.4955,12.1937,116.8931,141.351,24.4579
,,,,,,,,,,,,,,
,,,,,,,,,,,,,,
Average of Column,46.3875677419355,49.8159612903226,46.3567516129032,52.6249612903226,51.728864516129,49.9325322580645,47.5200935483871,51.4287860215054,3.90869247311828,,,,,
request time < 30ms (avg of columns),16.62784,17.7582466666667,17.41062,18.5825133333333,19.2913533333333,17.8686466666667,17.2655688888889,18.5808377777778,1.31526888888889,,I believe these quicker ones are only making one request … but I don’t know.,,,
,,,,,,,,,,,,,,
,,,,,,,,,,,,,,
,,,,,,,,,,,,,,
,,,,,,,,,,,,,,
,,,,,,,,,,,,,,
,,,,,,,,,,,,,,
,,,,,,,,,,,,,,
,,,,,,,,,,,,,,
,,,,,,,,,,,,,,
,,,,,,,,,,,,,,
,,,,,,,,,,,,,,
,,,,,,,,,,,,,,
,,+,,,,,,,,,,,,
,,+,,,,,,,,,,,,
,,+,,,,,,,,,,,,
,,+,,,,,,,,,,,,
,,+,,,,,,,,,,,,
,,+,,,,,,,,,,,,
,,+,,,,,,,,,,,,
,,+,,,,,,,,,,,,
,,+,,,,,,,,,,,,
,,+,,,,,,,,,,,,
,,+,,,,,,,,,,,,
,,+,,,,,,,,,,,,
,,+,,,,,,,,,,,,
,,+,,,,,,,,,,,,
,,+,,,,,,,,,,,,
,,+,,,,,,,,,,,,
,,+,,,,,,,,,,,,
,,+,,,,,,,,,,,,
,,+,,,,,,,,,,,,
,,+,,,,,,,,,,,,
,,+,,,,,,,,,,,,
,,+,,,,,,,,,,,,
,,+,,,,,,,,,,,,
,,+,,,,,,,,,,,,
,,+,,,,,,,,,,,,
,,+,,,,,,,,,,,,
,,+,,,,,,,,,,,,
,,+,,,,,,,,,,,,
,,+,,,,,,,,,,,,
,,+,,,,,,,,,,,,
,,+,,,,,,,,,,,,
,,,,,,,,,,,,,,
,,,,,,,,,,,,,,
,,,,,,,,,,,,,,
,,,,,,,,,,,,,,
,,,,,,,,,,,,,,
,,,,,,,,,,,,,,
,,,,,,,,,,,,,,
,,,,,,,,,,,,,,
,,,,,,,,,,,,,,
,,,,,,,,,,,,,,
,,,,,,,,,,,,,,
,,,,,,,,,,,,,,
,,,,,,,,,,,,,,
,,,,,,,,,,,,,,
,,,,,,,,,,,,,,
,,,,,,,,,,,,,,
,,,,,,,,,,,,,,
,,,,,,,,,,,,,,
,,,,,,,,,,,,,,
,,,,,,,,,,,,,,
,,,,,,,,,,,,,,
,,,,,,,,,,,,,,
,,///,AFTER,switching,,,,,,,,,,
,,,,,,,,,,,,,,
,,+,UploadFileFail,,,,,,,,,,,
,,+,FailedSubmissionRequiredProperties,,,,,,,,,,,
,,+,FailedAccessForSubmission,,,,,,,,,,,
,,+,CreateNoDelete,,,,,,,,,,,
,,+,RejectDeleteAccessWithCustomHandler,,,,,,,,,,,
,,+,FailToDeleteNonDeleteable,,,,,,,,,,,
,,+,DeleteCustomResponse,,,,,,,,,,,
,,+,DeleteFailNotFound,,,,,,,,,,,
,,+,DeletePrint,,,,,,,,,,,
,,+,DeleteRedirect,,,,,,,,,,,
,,+,DeleteResponse,,,,,,,,,,,
,,+,DeleteItemS,,,,,,,,,,,
,,+,CustomRowAccess,,,,,,,,,,,
,,+,ApproveCustomAccess,,,,,,,,,,,
,,+,DenyCustomAccess,,,,,,,,,,,
,,+,DenyRoleAccess,,,,,,,,,,,
,,+,ApproveRoleAccess,,,,,,,,,,,
,,+,UploadFile,,,,,,,,,,,
,,+,EditBlogForm,,,,,,,,,,,
,,+,BlogFormRedirect,,,,,,,,,,,
,,+,SubmitBlogForm,,,,,,,,,,,
,,+,GetBlogForm,,,,,,,,,,,
,,+,NestedViews,,,,,,,,,,,
,,+,QueryCharacterJson,,,,,,,,,,,
,,+,SimpleSpeciesQuery,,,,,,,,,,,
,,+,QueryCharacterView,,,,,,,,,,,
,,+,ServeSitemap,,,,,,,,,,,
,,+,GetDynamicRoute,,,,,,,,,,,
,,+,Routed,,,,,,,,,,,
,,+,Explicit,,,,,,,,,,,
,,+,Verify,,,,,,,,,,,
,,,,,,,,,,,,,,
,,,,,,,,,,,,,,
,,,,,,,,,,,,,,
,,+,UploadFileFail,,,,,,,,,,,
,,+,FailedSubmissionRequiredProperties,,,,,,,,,,,
,,+,FailedAccessForSubmission,,,,,,,,,,,
,,+,CreateNoDelete,,,,,,,,,,,
,,+,RejectDeleteAccessWithCustomHandler,,,,,,,,,,,
,,+,FailToDeleteNonDeleteable,,,,,,,,,,,
,,+,DeleteCustomResponse,,,,,,,,,,,
,,+,DeleteFailNotFound,,,,,,,,,,,
,,+,DeletePrint,,,,,,,,,,,
,,+,DeleteRedirect,,,,,,,,,,,
,,+,DeleteResponse,,,,,,,,,,,
,,+,DeleteItemS,,,,,,,,,,,
,,+,CustomRowAccess,,,,,,,,,,,
,,+,ApproveCustomAccess,,,,,,,,,,,
,,+,DenyCustomAccess,,,,,,,,,,,
,,+,DenyRoleAccess,,,,,,,,,,,
,,+,ApproveRoleAccess,,,,,,,,,,,
,,+,UploadFile,,,,,,,,,,,
,,+,EditBlogForm,,,,,,,,,,,
,,+,BlogFormRedirect,,,,,,,,,,,
,,+,SubmitBlogForm,,,,,,,,,,,
,,+,GetBlogForm,,,,,,,,,,,
,,+,NestedViews,,,,,,,,,,,
,,+,QueryCharacterJson,,,,,,,,,,,
,,+,SimpleSpeciesQuery,,,,,,,,,,,
,,+,QueryCharacterView,,,,,,,,,,,
,,+,ServeSitemap,,,,,,,,,,,
,,+,GetDynamicRoute,,,,,,,,,,,
,,+,Routed,,,,,,,,,,,
,,+,Explicit,,,,,,,,,,,
,,+,Verify,,,,,,,,,,,
,,,,,,,,,,,,,,
,,,,,,,,,,,,,,
,,,,,,,,,,,,,,
,,+,UploadFileFail,,,,,,,,,,,
,,+,FailedSubmissionRequiredProperties,,,,,,,,,,,
,,+,FailedAccessForSubmission,,,,,,,,,,,
,,+,CreateNoDelete,,,,,,,,,,,
,,+,RejectDeleteAccessWithCustomHandler,,,,,,,,,,,
,,+,FailToDeleteNonDeleteable,,,,,,,,,,,
,,+,DeleteCustomResponse,,,,,,,,,,,
,,+,DeleteFailNotFound,,,,,,,,,,,
,,+,DeletePrint,,,,,,,,,,,
,,+,DeleteRedirect,,,,,,,,,,,
,,+,DeleteResponse,,,,,,,,,,,
,,+,DeleteItemS,,,,,,,,,,,
,,+,CustomRowAccess,,,,,,,,,,,
,,+,ApproveCustomAccess,,,,,,,,,,,
,,+,DenyCustomAccess,,,,,,,,,,,
,,+,DenyRoleAccess,,,,,,,,,,,
,,+,ApproveRoleAccess,,,,,,,,,,,
,,+,UploadFile,,,,,,,,,,,
,,+,EditBlogForm,,,,,,,,,,,
,,+,BlogFormRedirect,,,,,,,,,,,
,,+,SubmitBlogForm,,,,,,,,,,,
,,+,GetBlogForm,,,,,,,,,,,
,,+,NestedViews,,,,,,,,,,,
,,+,QueryCharacterJson,,,,,,,,,,,
,,+,SimpleSpeciesQuery,,,,,,,,,,,
,,+,QueryCharacterView,,,,,,,,,,,
,,+,ServeSitemap,,,,,,,,,,,
,,+,GetDynamicRoute,,,,,,,,,,,
,,+,Routed,,,,,,,,,,,
,,+,Explicit,,,,,,,,,,,
,,+,Verify,,,,,,,,,,,
