{
    "dir.docs": "doc",
    "dir.template": ".docsrc",
    "dir.code": "code",
    "file.conf": ".config\/scrawl.json",
    "file.code.ext": "*",
    "file.template.ext": ".src.md",
    "deleteExistingDocs": false,
    "markdown.preserveNewLines": true,
    "markdown.prependGenNotice": true,
    "scrawl.ext": [],
    "autoload": {
        "classmap": []
    },
    "readme.copyFromDocs": true,
    "ext.PhpApiScraper": true,
    "lex": true
}