{
    "dir.test":["test/run"],
    "dir.exclude":[],
    "file.require":[],

    "results.writeHtml":false,

    "server":{
        "main": { "dir":"test/Server" }
    },

    "bench.threshold": 0.0001,
    "test":[],
    "class":[]
}
