{
    "--NOTICE":"v1.0 will introduce updated defaults.",
    "--docs_url--": "https://www.taeluf.com/docs/Code%20Scrawl or https://gitlab.com/taeluf/php/CodeScrawl",

    "template.dirs": [".doctemplate"],

    "dir.docs": "docs",
    "dir.src": ".docsrc",
    "dir.scan": ["code", "test"],
    "ScrawlExtensions":[],

    "file.bootstrap":"scrawl-bootstrap.php",

    "api.output_dir": "api/",
    "api.generate_readme": true,

    "deleteExistingDocs": false,
    "readme.copyFromDocs": false,

    "markdown.preserveNewLines": true,
    "markdown.prependGenNotice": true
}
