{
  "name": "RO/reed-personal.maconzero.com",
  "type": "RO-site",
  "repositories": [ 
    {"type": "vcs",
     "url": "https://github.com/ReedOverflow/PHP-Request-Handler"
    },
    {"type": "vcs",
     "url": "https://github.com/ReedOverflow/PHP-View-Controller"
    },
    {"type": "vcs",
     "url": "https://github.com/ReedOverflow/PHP-Calendar"
    },
    {"type": "vcs",
     "url": "https://github.com/ReedOverflow/PHP-Common-Functions"
    }
  ],
  "require": {
    "RO/RequestHandler": "dev-master",
    "RO/View": "dev-master",
    "RO/Calendar": "dev-master",
    "RO/CommonFunctions":"dev-master"
  }
  
}
