"Variant Strains found in Macon County",,,,,,,,,,
"Not all confirmed positive tests are tested for variants & MCHD doesn’t report what percent of cases are tested",,,,,,,,,,
,,,,,,,,,,
"Variant Strain names ","Strain identifier","Place name",,"Variant Strain names ","Strain identifier","Place name",,,,
"alpha","b.1.1.7","UK ",,"epsilon","B.1.427/B.1.429","california",,,,
"gamma","p.1 / p.1.1","brazil",,"beta","b.1.351","south africa",,,,
"delta","B.1.617.2/AY.12/ AY.2/AY.25/AY.3/AY.3.1/AY.4/AY.6","--",,"mu","b.1.621","--",,,,
,,,,"idk","b.1.2, b.1","idk",,,,
"report_date","total_variants","url","alpha","gamma","delta","california","beta","mu","b_1_2","b_1"
"Report Date","Total Variants","URL","alpha","gamma","delta","california","beta","mu","B.1.2","b.1"
07/09/21,237,"https://www.facebook.com/permalink.php?story_fbid=4162238390504139&id=116643335063685 ",141,84,1,7,4,0,,
07/27/21,246,"https://www.facebook.com/permalink.php?story_fbid=4213563792038265&id=116643335063685 ",143,87,5,7,4,0,,
07/30/21,251,"https://www.facebook.com/permalink.php?story_fbid=4222340371160607&id=116643335063685 ",143,87,10,7,4,0,,
08/06/21,258,"https://www.facebook.com/permalink.php?story_fbid=4242727335788577&id=116643335063685 ",143,87,17,7,4,0,,
08/13/21,260,"https://www.facebook.com/permalink.php?story_fbid=4263998920328085&id=116643335063685 ",143,87,19,7,4,0,,
08/20/21,263,"https://www.facebook.com/permalink.php?story_fbid=4284884334906210&id=116643335063685 ",143,87,22,7,4,0,,
08/27/21,289,"https://www.facebook.com/permalink.php?story_fbid=4305707509490559&id=116643335063685 ",143,87,48,7,4,0,,
09/03/21,312,"https://www.facebook.com/permalink.php?story_fbid=4327145794013397&id=116643335063685 ",143,87,71,7,4,0,,
09/10/21,324,"https://www.facebook.com/permalink.php?story_fbid=4348411151886861&id=116643335063685 ",143,87,81,7,4,2,,
09/17/21,353,"https://www.facebook.com/permalink.php?story_fbid=4370339696360673&id=116643335063685 ",143,87,109,7,4,3,,
09/24/21,377,"https://www.facebook.com/permalink.php?story_fbid=4393401894054453&id=116643335063685 ",143,87,133,7,4,3,,
10/01/21,409,"https://www.facebook.com/permalink.php?story_fbid=4415904358470873&id=116643335063685 ",143,87,165,7,4,3,,
10/08/21,417,"https://www.facebook.com/permalink.php?story_fbid=4436666236394685&id=116643335063685 ",143,87,173,7,4,3,,
10/22/21,453,"https://www.facebook.com/permalink.php?story_fbid=4480610985333543&id=116643335063685 ",143,87,209,7,4,3,,
10/29/21,464,"https://www.facebook.com/permalink.php?story_fbid=4502828799778428&id=116643335063685 ",143,87,218,7,4,3,2,
11/05/21,484,"https://www.facebook.com/116643335063685/photos/a.136673823060636/4524634644264510/ ",143,87,237,7,4,3,2,1
,,,,,,,,,,
,,,,,,,,,,
,,,,,,,,,,
,,"Note:","The b.1.2 column WILL be changed when we have a variant strain name or a place name for it",,,,,,,
,,,"same for b.1 column",,,,,,,
