{
    "county": {
        "name": "county",
        "type": "VARCHAR(62)"
    },
    "tested_9_24": {
        "name": "tested_9_24",
        "type": "VARCHAR(60)"
    },
    "cases_9_24": {
        "name": "cases_9_24",
        "type": "VARCHAR(59)"
    },
    "deaths_9_24": {
        "name": "deaths_9_24",
        "type": "VARCHAR(56)"
    },
    "tested_9_17": {
        "name": "tested_9_17",
        "type": "VARCHAR(60)"
    },
    "cases_9_17": {
        "name": "cases_9_17",
        "type": "VARCHAR(59)"
    },
    "deaths_9_17": {
        "name": "deaths_9_17",
        "type": "VARCHAR(56)"
    },
    "deaths_per_7_days_9_17": {
        "name": "deaths_per_7_days_9_17",
        "type": "int(10)"
    },
    "population": {
        "name": "population",
        "type": "VARCHAR(60)"
    },
    "deaths_in_7_days_per_100k": {
        "name": "deaths_in_7_days_per_100k",
        "type": "FLOAT"
    },
    "deaths_in_7_days_per_100k_rank": {
        "name": "deaths_in_7_days_per_100k_rank",
        "type": "int(10)"
    }
}