{
    "date": {
        "name": "date",
        "type": "DATE"
    },
    "cases": {
        "name": "cases",
        "type": "int(10)"
    },
    "released_from_isolation": {
        "name": "released_from_isolation",
        "type": "int(10)"
    },
    "in_home_isolation": {
        "name": "in_home_isolation",
        "type": "int(10)"
    },
    "hospitalized": {
        "name": "hospitalized",
        "type": "int(10)"
    },
    "deaths": {
        "name": "deaths",
        "type": "int(10)"
    }
}