{
    "date": {
        "name": "date",
        "type": "DATE"
    },
    "total_deaths": {
        "name": "total_deaths",
        "type": "int(10)"
    },
    "url": {
        "name": "url",
        "type": "VARCHAR(178)"
    },
    "male": {
        "name": "male",
        "type": "int(10)"
    },
    "female": {
        "name": "female",
        "type": "int(10)"
    },
    "black": {
        "name": "black",
        "type": "int(10)"
    },
    "white": {
        "name": "white",
        "type": "int(10)"
    },
    "other_race": {
        "name": "other_race",
        "type": "int(10)"
    },
    "unknown_race": {
        "name": "unknown_race",
        "type": "int(10)"
    },
    "age_30_to_39": {
        "name": "age_30_to_39",
        "type": "int(10)"
    },
    "age_40_to_49": {
        "name": "age_40_to_49",
        "type": "int(10)"
    },
    "age_50_to_59": {
        "name": "age_50_to_59",
        "type": "int(10)"
    },
    "age_60_to_69": {
        "name": "age_60_to_69",
        "type": "int(10)"
    },
    "age_70_to_79": {
        "name": "age_70_to_79",
        "type": "int(10)"
    },
    "age_80_to_89": {
        "name": "age_80_to_89",
        "type": "int(10)"
    },
    "age_90_to_99": {
        "name": "age_90_to_99",
        "type": "int(10)"
    },
    "age_100_plus": {
        "name": "age_100_plus",
        "type": "int(10)"
    }
}